<?xml version="1.0" encoding="UTF-8" standalone="no"?>
<svg
        width="23.757999mm"
        height="23.757999mm"
        viewBox="0 0 23.758 23.757998"
        version="1.1"
        xmlns="http://www.w3.org/2000/svg">
    <g
            transform="translate(-78.650696,-68.730968)">
        <path
                d="m 90.554464,80.612424 -8.112762,1.426799"
                fill="none"
                stroke-width="0.85"
                stroke="#4f4f4f"/>
        <path
                d="m 97.830538,77.453091 -7.276074,3.159333"
                fill="none"
                stroke-width="0.85"
                stroke="#4f4f4f"/>
        <circle
                fill="#0d6efd"
                cx="97.868805"
                cy="77.424881"
                r="2.1244874"/>
        <path
                d="m 86.98483,73.171742 3.569634,7.440682"
                fill="none"
                stroke="#4f4f4f"
                stroke-width="0.85"/>
        <path
                d="m 82.4106,82.134057 c 1.648883,4.723585 6.971072,7.829186 12.763187,5.358027"
                fill="none"
                stroke-width="0.85"
                stroke="#4f4f4f"/>
        <circle
                fill="#0d6efd"
                cx="86.98037"
                cy="73.195999"
                r="2.1244874"/>
        <circle
                cx="90.529472"
                fill="#dc3545"
                cy="80.609749"
                r="3.2386508"/>
        <circle
                cx="82.418419"
                cy="82.049561"
                fill="#198754"
                r="1.752311"/>
        <circle
                cx="95.175735"
                cy="87.50563"
                fill="#198754"
                r="1.752311"/>
        <circle
                cx="90.529472"
                fill="none"
                stroke="#4f4f4f"
                stroke-width="0.57"
                cy="80.609749"
                r="11.594855"/>
    </g>
</svg>
