{
  "bin": {
    "properties": {
      "binid": {
        "type": "keyword"
      },
      "completeness": {
        "type": "double"
      },
      "contamination": {
        "type": "double"
      },
      "markerlineage": {
        "type": "keyword"
      },
      "classification": {
        "include_in_parent": true,
        "properties": {
          "domain": {
            "type": "keyword"
          },
          "phylum": {
            "type": "keyword"
          },
          "class": {
            "type": "keyword"
          },
          "order": {
            "type": "keyword"
          },
          "family": {
            "type": "keyword"
          },
          "genus": {
            "type": "keyword"
          },
          "species": {
            "type": "keyword"
          }
        },
        "type": "nested"
      },
      "classification_details": {
        "include_in_parent": true,
        "properties": {
          "cpani": {
            "type": "double"
          },
          "cpaf": {
            "type": "double"
          },
          "aap": {
            "type": "double"
          },
          "note": {
           "analyzer": "standard",
            "type": "text"
          },
          "warnings": {
           "analyzer": "standard",
            "type": "text"
          }
        },
        "type": "nested"
      }
    }
  }
}
