<?xml version="1.0" encoding="UTF-8" standalone="no"?>
<svg
   xmlns:dc="http://purl.org/dc/elements/1.1/"
   xmlns:cc="http://creativecommons.org/ns#"
   xmlns:rdf="http://www.w3.org/1999/02/22-rdf-syntax-ns#"
   xmlns:svg="http://www.w3.org/2000/svg"
   xmlns="http://www.w3.org/2000/svg"
   id="svg1126"
   version="1.1"
   viewBox="0 0 68.91449 68.443855"
   height="68.443855mm"
   width="68.91449mm">
  <defs
     id="defs1120" />
  <metadata
     id="metadata1123">
    <rdf:RDF>
      <cc:Work
         rdf:about="">
        <dc:format>image/svg+xml</dc:format>
        <dc:type
           rdf:resource="http://purl.org/dc/dcmitype/StillImage" />
        <dc:title></dc:title>
      </cc:Work>
    </rdf:RDF>
  </metadata>
  <g
     transform="translate(-38.60067,-48.372389)"
     id="layer1">
    <path
       id="rect1671"
       d="m 56.680103,48.655915 c 4.620795,0 9.467849,1.809015 14.041644,2.049225 6.722349,0.35305 12.36685,-0.650171 18.71449,-2.049225 9.543391,-2.103415 17.639783,7.867346 17.639783,17.63979 0,6.249183 -5.84293,12.146504 -5.85028,17.81137 -0.007,5.715143 4.34921,9.809993 5.85028,14.944764 2.74206,9.379871 -7.867339,17.639791 -17.639783,17.639791 -4.781449,0 -7.960951,-2.59674 -13.328329,-2.61618 -5.655512,-0.0205 -13.06894,1.75852 -19.427805,2.61618 -9.68475,1.30624 -17.639789,-7.86734 -17.639789,-17.639791 0,-5.281421 6.879931,-8.712997 6.928861,-14.248914 0.05188,-5.869521 -5.079234,-12.184982 -6.928861,-18.50722 -2.743996,-9.379294 7.867346,-17.63979 17.639789,-17.63979 z"
       style="opacity:1;vector-effect:none;fill:#f9e4a5;fill-opacity:1;stroke:none;stroke-width:0.26499999;stroke-linecap:round;stroke-linejoin:miter;stroke-miterlimit:4;stroke-dasharray:none;stroke-dashoffset:0;stroke-opacity:1" />
    <g
       id="g1520">
      <text
         xml:space="preserve"
         style="font-style:normal;font-variant:normal;font-weight:normal;font-stretch:ultra-condensed;font-size:45.37753296px;line-height:0.69999999;font-family:'Fira Sans Compressed';-inkscape-font-specification:'Fira Sans Compressed, Ultra-Condensed';font-variant-ligatures:normal;font-variant-caps:normal;font-variant-numeric:normal;font-feature-settings:normal;text-align:start;letter-spacing:0px;word-spacing:0px;writing-mode:lr-tb;text-anchor:start;fill:#e48c2d;fill-opacity:1;stroke:none;stroke-width:0.26458341;"
         x="44.648411"
         y="83.028961"
         id="text1675-8"
         transform="scale(1.0328715,0.96817465)"><tspan
           x="44.648411"
           y="83.028961"
           style="font-style:normal;font-variant:normal;font-weight:normal;font-stretch:normal;line-height:0.69999999;font-family:'Street Humouresque';-inkscape-font-specification:'Street Humouresque';fill:#e48c2d;fill-opacity:1;stroke-width:0.26458341;"
           id="tspan1677-9">E</tspan></text>
      <text
         xml:space="preserve"
         style="font-style:normal;font-variant:normal;font-weight:normal;font-stretch:ultra-condensed;font-size:46.19815445px;line-height:0.69999999;font-family:'Fira Sans Compressed';-inkscape-font-specification:'Fira Sans Compressed, Ultra-Condensed';font-variant-ligatures:normal;font-variant-caps:normal;font-variant-numeric:normal;font-feature-settings:normal;text-align:start;letter-spacing:0px;word-spacing:0px;writing-mode:lr-tb;text-anchor:start;fill:#73b159;fill-opacity:1;stroke:none;stroke-width:0.26458341;"
         x="65.917427"
         y="83.599884"
         id="text1675-8-7"
         transform="scale(1.0328715,0.96817464)"><tspan
           x="65.917427"
           y="83.599884"
           style="font-style:normal;font-variant:normal;font-weight:normal;font-stretch:normal;line-height:0.69999999;font-family:'Street Humouresque';-inkscape-font-specification:'Street Humouresque';fill:#73b159;fill-opacity:1;stroke-width:0.26458341;"
           id="tspan1677-9-5">M</tspan></text>
      <text
         xml:space="preserve"
         style="font-style:normal;font-variant:normal;font-weight:normal;font-stretch:ultra-condensed;font-size:45.37753296px;line-height:0.69999999;font-family:'Fira Sans Compressed';-inkscape-font-specification:'Fira Sans Compressed, Ultra-Condensed';font-variant-ligatures:normal;font-variant-caps:normal;font-variant-numeric:normal;font-feature-settings:normal;text-align:start;letter-spacing:0px;word-spacing:0px;writing-mode:lr-tb;text-anchor:start;fill:#5d9ad0;fill-opacity:1;stroke:none;stroke-width:0.26458341;"
         x="43.590733"
         y="113.53352"
         id="text1675-8-3"
         transform="scale(1.0328715,0.96817465)"><tspan
           x="43.590733"
           y="113.53352"
           style="font-style:normal;font-variant:normal;font-weight:normal;font-stretch:normal;line-height:0.69999999;font-family:'Street Humouresque';-inkscape-font-specification:'Street Humouresque';fill:#5d9ad0;fill-opacity:1;stroke-width:0.26458341;"
           id="tspan1677-9-8">G</tspan></text>
      <text
         xml:space="preserve"
         style="font-style:normal;font-variant:normal;font-weight:normal;font-stretch:ultra-condensed;font-size:46.6328125px;line-height:0.69999999;font-family:'Fira Sans Compressed';-inkscape-font-specification:'Fira Sans Compressed, Ultra-Condensed';font-variant-ligatures:normal;font-variant-caps:normal;font-variant-numeric:normal;font-feature-settings:normal;text-align:start;letter-spacing:0px;word-spacing:0px;writing-mode:lr-tb;text-anchor:start;fill:#b86992;fill-opacity:1;stroke:none;stroke-width:0.26458341;"
         x="72.918602"
         y="113.22454"
         id="text1675-8-8"
         transform="scale(1.0328715,0.96817465)"><tspan
           x="72.918602"
           y="113.22454"
           style="font-style:normal;font-variant:normal;font-weight:normal;font-stretch:normal;line-height:0.69999999;font-family:'Street Humouresque';-inkscape-font-specification:'Street Humouresque';fill:#b86992;fill-opacity:1;stroke-width:0.26458341;"
           id="tspan1677-9-3">B</tspan></text>
    </g>
  </g>
</svg>
