<?xml version="1.0" encoding="UTF-8" standalone="no"?>

<svg
        width="23.757999mm"
        height="23.757999mm"
        viewBox="0 0 23.758 23.757998"
        version="1.1"
        id="svg5126"
        xmlns="http://www.w3.org/2000/svg">

    <g
            id="layer1"
            transform="translate(-78.650696,-68.730968)">
        <path
                style="fill:none;fill-opacity:1;stroke:#4f4f4f;stroke-width:0.851766;stroke-linecap:butt;stroke-linejoin:miter;stroke-dasharray:none;stroke-opacity:1"
                d="m 90.554464,80.612424 -8.112762,1.426799"
                id="path7807-9-7"
        />
        <path
                style="fill:none;fill-opacity:1;stroke:#4f4f4f;stroke-width:0.851766;stroke-linecap:butt;stroke-linejoin:miter;stroke-dasharray:none;stroke-opacity:1"
                d="m 97.830538,77.453091 -7.276074,3.159333"
                id="path7807-9"
        />
        <circle
                style="fill:#0d6efd;fill-opacity:1;stroke:none;stroke-width:0.283922;stop-color:#000000"
                id="path5738-5"
                cx="97.868805"
                cy="77.424881"
                r="2.1244874"/>
        <path
                style="fill:none;fill-opacity:1;stroke:#4f4f4f;stroke-width:0.851766;stroke-linecap:butt;stroke-linejoin:miter;stroke-dasharray:none;stroke-opacity:1"
                d="m 86.98483,73.171742 3.569634,7.440682"
                id="path7807"
        />
        <path
                style="fill:none;stroke:#4f4f4f;stroke-width:0.851766;stroke-linecap:butt;stroke-linejoin:miter;stroke-dasharray:none;stroke-opacity:1"
                d="m 82.4106,82.134057 c 1.648883,4.723585 6.971072,7.829186 12.763187,5.358027"
                id="path9337"
        />
        <circle
                style="fill:#0d6efd;fill-opacity:1;stroke:none;stroke-width:0.283922;stop-color:#000000"
                id="path5738"
                cx="86.98037"
                cy="73.195999"
                r="2.1244874"/>
        <circle
                style="fill:#dc3545;fill-opacity:1;stroke:none;stroke-width:0.283922;stroke-opacity:1;stop-color:#000000"
                id="path5738-7"
                cx="90.529472"
                cy="80.609749"
                r="3.2386508"/>
        <circle
                style="fill:#198754;fill-opacity:1;stroke:none;stroke-width:0.283922;stop-color:#000000"
                id="path5738-4"
                cx="82.418419"
                cy="82.049561"
                r="1.752311"/>
        <circle
                style="fill:#198754;fill-opacity:1;stroke:none;stroke-width:0.283922;stop-color:#000000"
                id="path5738-4-5"
                cx="95.175735"
                cy="87.50563"
                r="1.752311"/>
        <circle
                style="fill:none;fill-opacity:1;stroke:#4f4f4f;stroke-width:0.567844;stroke-dasharray:none;stroke-opacity:1;stop-color:#000000"
                id="path10954"
                cx="90.529472"
                cy="80.609749"
                r="11.594855"/>
    </g>
</svg>
