n, date, filename, device, runtime," accuracy (train, test)"," loss (train, test)", epochs, batch_size, opt, layers, loss function, spike gradient, v_th, slope, a, b, c, d, bias, transform
0,31 1 2022 16:29:29,dvsgesture_izhi_1l.py,cuda,124.01701331138611,"(0.109375, 0.1875)","(2.393364429473877, 2.3790295124053955)",5,2,"['amsgrad:False', 'betas:(0.9,0.999)', 'eps:1e-08', 'lr:0.002', 'weight_decay:0']",100,ce_max_membrane_loss,fast_sigmoid,30,25,0.01,0.25,-65,2,140,"['Downsample(time_factor=0.001,spatial_factor=1)', 'ToFrame(sensor_size=(128,128,2),time_window=10,event_count=None,n_time_bins=None,n_event_bins=None,overlap=0,include_incomplete=False)']"
1,31 1 2022 16:33:05,dvsgesture_izhi_1l.py,cuda,209.143488407135,"(0.40625, 0.125)","(1.9927611351013184, 2.2304983139038086)",5,2,"['amsgrad:False', 'betas:(0.9,0.999)', 'eps:1e-08', 'lr:0.002', 'weight_decay:0']",100,ce_max_membrane_loss,fast_sigmoid,30,25,0.01,0.25,-65,2,140,"['Downsample(time_factor=0.001,spatial_factor=1)', 'ToFrame(sensor_size=(128,128,2),time_window=10,event_count=None,n_time_bins=None,n_event_bins=None,overlap=0,include_incomplete=False)']"
2,31 1 2022 16:37:49,dvsgesture_izhi_1l.py,cuda,119.61734700202942,"(0.0625, 0.1875)","(4122.09716796875, 4119.40966796875)",5,2,"['amsgrad:False', 'betas:(0.9,0.999)', 'eps:1e-08', 'lr:0.002', 'weight_decay:0']",100,mse_membrane_loss,fast_sigmoid,30,25,0.01,0.25,-65,2,140,"['Downsample(time_factor=0.001,spatial_factor=1)', 'ToFrame(sensor_size=(128,128,2),time_window=10,event_count=None,n_time_bins=None,n_event_bins=None,overlap=0,include_incomplete=False)']"
3,31 1 2022 16:42:01,dvsgesture_izhi_1l.py,cuda,229.9683120250702,"(0.09375, 0.0)","(4129.97607421875, 4125.001953125)",5,2,"['amsgrad:False', 'betas:(0.9,0.999)', 'eps:1e-08', 'lr:0.002', 'weight_decay:0']",100,mse_membrane_loss,fast_sigmoid,30,25,0.01,0.25,-65,2,140,"['Downsample(time_factor=0.001,spatial_factor=1)', 'ToFrame(sensor_size=(128,128,2),time_window=10,event_count=None,n_time_bins=None,n_event_bins=None,overlap=0,include_incomplete=False)']"
4,31 1 2022 16:46:07,dvsgesture_izhi_1l.py,cuda,217.52199506759644,"(0.421875, 0.1875)","(1.6596815586090088, 2.2144947052001953)",5,2,"['amsgrad:False', 'betas:(0.9,0.999)', 'eps:1e-08', 'lr:0.002', 'weight_decay:0']",100,ce_max_membrane_loss,fast_sigmoid,30,25,0.01,0.25,-65,2,140,"['Downsample(time_factor=0.001,spatial_factor=1)', 'ToFrame(sensor_size=(128,128,2),time_window=10,event_count=None,n_time_bins=None,n_event_bins=None,overlap=0,include_incomplete=False)']"
5,31 1 2022 16:51:59,dvsgesture_izhi_1l.py,cuda,216.49430632591248,"(0.515625, 0.25)","(1.6260606050491333, 2.1243467330932617)",5,2,"['amsgrad:False', 'betas:(0.9,0.999)', 'eps:1e-08', 'lr:0.002', 'weight_decay:0']",100,ce_max_membrane_loss,fast_sigmoid,25,25,0.01,0.25,-65,2,140,"['Downsample(time_factor=0.001,spatial_factor=1)', 'ToFrame(sensor_size=(128,128,2),time_window=10,event_count=None,n_time_bins=None,n_event_bins=None,overlap=0,include_incomplete=False)']"
