n, date, filename, device, runtime," accuracy (train, test)"," loss (train, test)", epochs, batch_size, lr, layers, alpha, beta, v_th, slope, first saccade only, loss function, spike gradient, transform
0,7 12 2021 13:37:28,nmnist_lif_1l.py,cuda,333.4327943325043,"(0.971640625, 0.95)","(1.577259806394577, 0.012500969134271145)",5,128,0.002,100,0.9,0.6,1.0,25,True,ce_rate_loss,fast_sigmoid,"['Downsample(time_factor=0.001,spatial_factor=1)', 'ToFrame(sensor_size=(34,34,2),time_window=1,event_count=None,n_time_bins=None,n_event_bins=None,overlap=0,include_incomplete=True)']"
1,7 12 2021 13:51:09,nmnist_lif_2l.py,cuda,362.83551812171936,"(0.972578125, 0.95859375)","(1.5774506831169128, 0.012443480826914311)",5,128,0.002,"(100, 100)",0.9,0.6,1.0,25,True,ce_rate_loss,fast_sigmoid,"['Downsample(time_factor=0.001,spatial_factor=1)', 'ToFrame(sensor_size=(34,34,2),time_window=1,event_count=None,n_time_bins=None,n_event_bins=None,overlap=0,include_incomplete=True)']"
2,7 12 2021 13:58:28,nmnist_lif_3l.py,cuda,409.91091871261597,"(0.953046875, 0.94453125)","(1.6172156488895417, 0.012695015128701925)",5,128,0.002,"(100, 100, 100)",0.9,0.6,1.0,25,True,ce_rate_loss,fast_sigmoid,"['Downsample(time_factor=0.001,spatial_factor=1)', 'ToFrame(sensor_size=(34,34,2),time_window=1,event_count=None,n_time_bins=None,n_event_bins=None,overlap=0,include_incomplete=True)']"
3,7 12 2021 14:09:29,nmnist_lif_cnn.py,cuda,73.05990362167358,"(0.78, 0.81015625)","(1.8694955062866212, 0.014266879344359041)",2,128,0.002,34x34x2-8c3-2p-16c3-2p-32c3-2048-10,0.9,0.6,1.0,25,True,ce_rate_loss,fast_sigmoid,"['Downsample(time_factor=0.001,spatial_factor=1)', 'ToFrame(sensor_size=(34,34,2),time_window=10,event_count=None,n_time_bins=None,n_event_bins=None,overlap=0,include_incomplete=True)']"
4,7 12 2021 14:31:55,nmnist_lif_rec.py,cuda,402.81924414634705,"(0.947890625, 0.9296875)","(1.5881104981899261, 0.012543503381311893)",5,128,0.002,100,0.9,0.6,1.0,20,True,ce_rate_loss,fast_sigmoid,"['Downsample(time_factor=0.001,spatial_factor=1)', 'ToFrame(sensor_size=(34,34,2),time_window=1,event_count=None,n_time_bins=None,n_event_bins=None,overlap=0,include_incomplete=True)']"
5,7 12 2021 14:36:26,nmnist_lif_cnn.py,cuda,247.27271819114685,"(0.09953125, 0.094140625)","(2.302583477497101, 0.01798892952501774)",2,128,0.002,34x34x2-8c3-2p-16c3-2p-32c3-2048-10,0.9,0.6,1.0,25,True,ce_rate_loss,fast_sigmoid,"['Downsample(time_factor=0.001,spatial_factor=1)', 'ToFrame(sensor_size=(34,34,2),time_window=1,event_count=None,n_time_bins=None,n_event_bins=None,overlap=0,include_incomplete=True)']"
