Epoch Train Test
0 1.3835292061169941 1.3203676144282024
1 1.158828337987264 1.133254845937093
2 1.0473428070545197 1.1175280809402466
3 1.0015005469322205 1.0755323966344197
4 0.9924882253011068 1.0615524053573608
5 0.9741741120815277 1.0288785099983215
6 0.9285520017147064 0.9790964722633362
7 0.8708479305108389 0.8831351002057394
8 0.7951752742131551 0.8414525389671326
9 0.7732075750827789 0.8179803093274435
10 0.7675104737281799 0.8042025963465372
11 0.761519213517507 0.7969639897346497
12 0.761519213517507 0.7927091717720032
13 0.761519213517507 0.77494215965271
14 0.761519213517507 0.7717764178911845
15 0.7581512828667959 0.7722588976224264
16 0.7570565342903137 0.769280751546224
17 0.761519213517507 0.7693993051846822
18 0.7570565342903137 0.7698239882787069
19 0.7603407899538676 0.7639255523681641
20 0.7570565342903137 0.7619236509005228
21 0.7570565342903137 0.7672788699467977
22 0.7570565342903137 0.756568431854248
23 0.7570565342903137 0.761923631032308
24 0.7570565342903137 0.7617360552151998
