+----+---------------------+------------------+--------+--------------------+--------------------------------------------+-----------------------------------------------------------------------+--------+------------+---------------------------------------------------------------------------------------+--------+---------+----------+-------+-------+--------+----------+--------+----------+-----------------------------+------------------------+----------------------------------------------------------------------------------------------------------------------------------------------------------------------------------------------+
| n  |         date        |     filename     | device |      runtime       |           accuracy (train, test)           |                           loss (train, test)                          | epochs | batch_size |                                          opt                                          | layers | tSample |   type   | theta | tauSr | tauRef | scaleRef | tauRho | scaleRho |        tgtSpikeRegion       |     tgtSpikeCount      |                                                                                          transform                                                                                           |
+----+---------------------+------------------+--------+--------------------+--------------------------------------------+-----------------------------------------------------------------------+--------+------------+---------------------------------------------------------------------------------------+--------+---------+----------+-------+-------+--------+----------+--------+----------+-----------------------------+------------------------+----------------------------------------------------------------------------------------------------------------------------------------------------------------------------------------------+
| 0  |  7 12 2021 18:12:17 | dvsgesture_1l.py |  cuda  | 18.419913291931152 |             (0.09375, 0.1875)              |              (0.01848260482074693, 0.019789976067841053)              |   1    |     8      |                                         0.002                                         |  1000  |  10000  | SRMALPHA |   1   |  10.0 |  1.0   |    2     |   1    |    1     | {'start': 0, 'stop': 10000} | {True: 180, False: 30} | ['Downsample(time_factor=0.001,spatial_factor=1)', 'ToFrame(sensor_size=(128,128,2),time_window=100,event_count=None,n_time_bins=None,n_event_bins=None,overlap=0,include_incomplete=True)'] |
| 1  | 13 12 2021 14:20:24 | dvsgesture_1l.py |  cuda  | 136.73505878448486 | (0.19498607242339833, 0.21212121212121213) |                (1.7320385249322947, 1.702097975846493)                |   1    |     8      |                                         0.002                                         |  1000  |   1000  | SRMALPHA |   1   |  10.0 |  1.0   |    2     |   1    |    1     |  {'start': 0, 'stop': 1000} | {True: 180, False: 30} | ['Downsample(time_factor=0.001,spatial_factor=1)', 'ToFrame(sensor_size=(128,128,2),time_window=100,event_count=None,n_time_bins=None,n_event_bins=None,overlap=0,include_incomplete=True)'] |
| 2  | 13 12 2021 14:23:21 | dvsgesture_1l.py |  cuda  | 134.2504529953003  | (0.25998142989786444, 0.25757575757575757) |                (0.6217388920797279, 0.6218083907257427)               |   1    |     8      |                                         0.002                                         |  1000  |   1000  | SRMALPHA |   1   |  10.0 |  1.0   |    2     |   1    |    1     |  {'start': 0, 'stop': 1000} | {True: 100, False: 20} | ['Downsample(time_factor=0.001,spatial_factor=1)', 'ToFrame(sensor_size=(128,128,2),time_window=100,event_count=None,n_time_bins=None,n_event_bins=None,overlap=0,include_incomplete=True)'] |
| 3  | 13 12 2021 14:26:06 | dvsgesture_1l.py |  cuda  | 134.54136395454407 | (0.16620241411327763, 0.16287878787878787) |             (0.003614726039678716, 0.0033693483212228975)             |   1    |     8      |                                         0.002                                         |  1000  |  10000  | SRMALPHA |   1   |  10.0 |  1.0   |    2     |   1    |    1     | {'start': 0, 'stop': 10000} | {True: 80, False: 10}  | ['Downsample(time_factor=0.001,spatial_factor=1)', 'ToFrame(sensor_size=(128,128,2),time_window=100,event_count=None,n_time_bins=None,n_event_bins=None,overlap=0,include_incomplete=True)'] |
| 4  | 13 12 2021 14:28:40 | dvsgesture_1l.py |  cuda  | 133.12848806381226 | (0.15784586815227483, 0.14772727272727273) |                (125.29769584351153, 37.06879488627116)                |   1    |     8      |                                         0.002                                         |  1000  |   100   | SRMALPHA |   1   |  10.0 |  1.0   |    2     |   1    |    1     |  {'start': 0, 'stop': 100}  | {True: 80, False: 10}  | ['Downsample(time_factor=0.001,spatial_factor=1)', 'ToFrame(sensor_size=(128,128,2),time_window=100,event_count=None,n_time_bins=None,n_event_bins=None,overlap=0,include_incomplete=True)'] |
| 5  | 13 12 2021 14:31:13 | dvsgesture_1l.py |  cuda  | 132.85336661338806 |  (0.116991643454039, 0.09090909090909091)  |               (0.3552992389284026, 0.33973714528661786)               |   1    |     8      |                                         0.002                                         |  1000  |   1000  | SRMALPHA |   1   |  10.0 |  1.0   |    2     |   1    |    1     |  {'start': 0, 'stop': 1000} | {True: 80, False: 10}  | ['Downsample(time_factor=0.001,spatial_factor=1)', 'ToFrame(sensor_size=(128,128,2),time_window=100,event_count=None,n_time_bins=None,n_event_bins=None,overlap=0,include_incomplete=True)'] |
| 6  | 13 12 2021 14:42:07 | dvsgesture_1l.py |  cuda  | 126.02492618560791 | (0.2200557103064067, 0.23106060606060605)  |                 (67.79625121730284, 65.03157112815164)                |   1    |     8      |                                         0.002                                         |  1000  |   100   | SRMALPHA |   1   |  10.0 |  5.0   |    2     |   1    |    1     |  {'start': 0, 'stop': 100}  | {True: 100, False: 20} | ['Downsample(time_factor=0.001,spatial_factor=1)', 'ToFrame(sensor_size=(128,128,2),time_window=None,event_count=None,n_time_bins=100,n_event_bins=None,overlap=0,include_incomplete=True)'] |
| 7  | 13 12 2021 14:53:51 | dvsgesture_1l.py |  cuda  | 124.5642032623291  | (0.09285051067780872, 0.09090909090909091) |                (127.80609351878047, 32.570533636844516)               |   1    |     8      |                                         0.002                                         |  1000  |   100   | SRMALPHA |   1   |  10.0 |  1.0   |    2     |   1    |    1     |  {'start': 0, 'stop': 100}  | {True: 80, False: 10}  | ['Downsample(time_factor=0.001,spatial_factor=1)', 'ToFrame(sensor_size=(128,128,2),time_window=100,event_count=None,n_time_bins=None,n_event_bins=None,overlap=0,include_incomplete=True)'] |
| 8  | 13 12 2021 15:16:07 | dvsgesture_1l.py |  cuda  | 124.69644927978516 | (0.14391829155060354, 0.16287878787878787) |               (0.3391578651293628, 0.32506123817328253)               |   1    |     8      |                                         0.002                                         |  1000  |   1000  | SRMALPHA |   1   |  10.0 |  1.0   |    2     |   1    |    1     |  {'start': 0, 'stop': 1000} | {True: 80, False: 10}  | ['Downsample(time_factor=0.001,spatial_factor=1)', 'ToFrame(sensor_size=(128,128,2),time_window=100,event_count=None,n_time_bins=None,n_event_bins=None,overlap=0,include_incomplete=True)'] |
| 9  | 13 12 2021 15:36:05 | dvsgesture_1l.py |  cuda  | 116.33306837081909 | (0.21634168987929434, 0.26136363636363635) |               (0.31762303393974056, 0.3153131852547328)               |   10   |     8      |                                         0.002                                         |  1000  |   1000  | SRMALPHA |   1   |  10.0 |  1.0   |    2     |   1    |    1     |  {'start': 0, 'stop': 1000} | {True: 80, False: 10}  | ['Downsample(time_factor=0.001,spatial_factor=1)', 'ToFrame(sensor_size=(128,128,2),time_window=100,event_count=None,n_time_bins=None,n_event_bins=None,overlap=0,include_incomplete=True)'] |
| 11 |  3 2 2022 14:02:41  | dvsgesture_1l.py | cuda:0 | 518.9165072441101  | (0.48794063079777367, 0.5454545454545454)  |                (1.8014572051549003, 1.7470516002539433)               |   1    |     8      |   ['amsgrad:False', 'betas:(0.9,0.999)', 'eps:1e-08', 'lr:0.002', 'weight_decay:0']   |  100   |  10000  | SRMALPHA |   1   |  1.0  |  5.0   |    2     |   1    |    1     | {'start': 0, 'stop': 10000} | {True: 800, False: 50} | ['Downsample(time_factor=0.001,spatial_factor=1)', 'ToFrame(sensor_size=(128,128,2),time_window=10,event_count=None,n_time_bins=None,n_event_bins=None,overlap=0,include_incomplete=False)'] |
| 12 |  3 2 2022 14:02:41  | dvsgesture_1l.py | cuda:0 | 507.9971823692322  | (0.47680890538033394, 0.48484848484848486) |                (1.8426034994603089, 1.8810684464194558)               |   1    |     8      |   ['amsgrad:False', 'betas:(0.9,0.999)', 'eps:1e-08', 'lr:0.002', 'weight_decay:0']   |  100   |  10000  | SRMALPHA |   1   |  1.0  |  5.0   |    2     |   1    |    1     | {'start': 0, 'stop': 10000} | {True: 800, False: 50} | ['Downsample(time_factor=0.001,spatial_factor=1)', 'ToFrame(sensor_size=(128,128,2),time_window=10,event_count=None,n_time_bins=None,n_event_bins=None,overlap=0,include_incomplete=False)'] |
| 13 |  3 2 2022 14:29:45  | dvsgesture_1l.py | cuda:0 | 376.39076685905457 |  (0.4675324675324675, 0.5909090909090909)  |                (1.8050302884131946, 1.8129098415374756)               |   1    |     8      |   ['amsgrad:False', 'betas:(0.9,0.999)', 'eps:1e-08', 'lr:0.002', 'weight_decay:0']   |  100   |  10000  | SRMALPHA |   1   |  1.0  |  5.0   |    2     |   1    |    1     | {'start': 0, 'stop': 10000} | {True: 800, False: 50} | ['Downsample(time_factor=0.001,spatial_factor=1)', 'ToFrame(sensor_size=(128,128,2),time_window=10,event_count=None,n_time_bins=None,n_event_bins=None,overlap=0,include_incomplete=False)'] |
| 13 |  3 2 2022 14:29:45  | dvsgesture_1l.py | cuda:0 |  386.605872631073  | (0.47680890538033394, 0.5378787878787878)  |                (1.845044637655283, 1.8544401436141043)                |   1    |     8      |   ['amsgrad:False', 'betas:(0.9,0.999)', 'eps:1e-08', 'lr:0.002', 'weight_decay:0']   |  100   |  10000  | SRMALPHA |   1   |  1.0  |  5.0   |    2     |   1    |    1     | {'start': 0, 'stop': 10000} | {True: 800, False: 50} | ['Downsample(time_factor=0.001,spatial_factor=1)', 'ToFrame(sensor_size=(128,128,2),time_window=10,event_count=None,n_time_bins=None,n_event_bins=None,overlap=0,include_incomplete=False)'] |
| 15 |  3 2 2022 15:12:13  | dvsgesture_1l.py | cuda:0 | 49.54209661483765  |      ([None, 0.3125], [None, 0.125])       | ([None, 2.092078149318695], [2.4980978965759277, 2.1526031494140625]) |   1    |     8      |   ['amsgrad:False', 'betas:(0.9,0.999)', 'eps:1e-08', 'lr:0.002', 'weight_decay:0']   |  100   |  10000  | SRMALPHA |   1   |  1.0  |  5.0   |    2     |   1    |    1     | {'start': 0, 'stop': 10000} | {True: 800, False: 50} | ['Downsample(time_factor=0.001,spatial_factor=1)', 'ToFrame(sensor_size=(128,128,2),time_window=10,event_count=None,n_time_bins=None,n_event_bins=None,overlap=0,include_incomplete=False)'] |
| 16 |  3 2 2022 15:12:13  | dvsgesture_1l.py | cuda:0 | 39.12408661842346  |      ([None, 0.3125], [None, 0.125])       | ([None, 2.092078149318695], [2.4980978965759277, 2.1526031494140625]) |   1    |     8      |   ['amsgrad:False', 'betas:(0.9,0.999)', 'eps:1e-08', 'lr:0.002', 'weight_decay:0']   |  100   |  10000  | SRMALPHA |   1   |  1.0  |  5.0   |    2     |   1    |    1     | {'start': 0, 'stop': 10000} | {True: 800, False: 50} | ['Downsample(time_factor=0.001,spatial_factor=1)', 'ToFrame(sensor_size=(128,128,2),time_window=10,event_count=None,n_time_bins=None,n_event_bins=None,overlap=0,include_incomplete=False)'] |
| 16 |  13 3 2022 10:51:26 | dvsgesture_1l.py |  cuda  | 1094.976145029068  |  (0.7669452181987001, 0.6856060606060606)  |                (22.482349250531353, 27.684432058623344)               |   25   |     8      |   ['amsgrad:False', 'betas:(0.9,0.999)', 'eps:1e-08', 'lr:0.002', 'weight_decay:0']   |  100   |    50   | SRMALPHA |   5   |  10.0 |  5.0   |    2     |   1    |    1     |   {'start': 0, 'stop': 50}  | {True: 80, False: 10}  | ['Downsample(time_factor=0.001,spatial_factor=1)', 'ToFrame(sensor_size=(128,128,2),time_window=None,event_count=None,n_time_bins=None,n_event_bins=50,overlap=0,include_incomplete=False)'] |
| 16 |  13 3 2022 11:04:11 | dvsgesture_1l.py |  cuda  | 591.3355658054352  |  (0.7688022284122563, 0.7007575757575758)  |                 (23.17401123046875, 27.0715156323982)                 |   25   |     8      | ['amsgrad:False', 'betas:(0.9,0.999)', 'eps:1e-08', 'lr:0.002', 'weight_decay:0.005'] |  100   |    50   | SRMALPHA |   5   |  10.0 |  5.0   |    2     |   1    |    1     |   {'start': 0, 'stop': 50}  | {True: 80, False: 10}  | ['Downsample(time_factor=0.001,spatial_factor=1)', 'ToFrame(sensor_size=(128,128,2),time_window=None,event_count=None,n_time_bins=None,n_event_bins=50,overlap=0,include_incomplete=False)'] |
| 18 |  16 3 2022 14:50:08 | dvsgesture_1l.py |  cuda  | 1061.6894295215607 |  (0.797585886722377, 0.7348484848484849)   |                 (42.86578398893138, 49.29992340550278)                |   50   |     8      |  ['amsgrad:False', 'betas:(0.9,0.999)', 'eps:1e-08', 'lr:0.003', 'weight_decay:0.05'] |  100   |    50   | SRMALPHA |   5   |  10.0 |  5.0   |    2     |   1    |    1     |   {'start': 0, 'stop': 50}  | {True: 100, False: 5}  | ['Downsample(time_factor=0.001,spatial_factor=1)', 'ToFrame(sensor_size=(128,128,2),time_window=None,event_count=None,n_time_bins=None,n_event_bins=50,overlap=0,include_incomplete=False)'] |
| 19 |  16 3 2022 15:00:26 | dvsgesture_1l.py |  cuda  | 539.7161111831665  |  (0.7409470752089137, 0.6818181818181818)  |                (13.015013968380048, 15.592499790769635)               |   25   |     8      |  ['amsgrad:False', 'betas:(0.9,0.999)', 'eps:1e-08', 'lr:0.003', 'weight_decay:0.05'] |  100   |    50   | SRMALPHA |   5   |  10.0 |  5.0   |    2     |   1    |    1     |   {'start': 0, 'stop': 50}  |  {True: 60, False: 5}  | ['Downsample(time_factor=0.001,spatial_factor=1)', 'ToFrame(sensor_size=(128,128,2),time_window=None,event_count=None,n_time_bins=None,n_event_bins=50,overlap=0,include_incomplete=False)'] |
| 20 |  16 3 2022 15:11:17 | dvsgesture_1l.py |  cuda  |  579.903502702713  |  (0.7121634168987929, 0.6704545454545454)  |                 (259.1267315396138, 270.0554185347124)                |   25   |     8      |  ['amsgrad:False', 'betas:(0.9,0.999)', 'eps:1e-08', 'lr:0.003', 'weight_decay:0.05'] |  100   |    50   | SRMALPHA |   5   |  10.0 |  5.0   |    2     |   1    |    1     |   {'start': 0, 'stop': 50}  | {True: 200, False: 5}  | ['Downsample(time_factor=0.001,spatial_factor=1)', 'ToFrame(sensor_size=(128,128,2),time_window=None,event_count=None,n_time_bins=None,n_event_bins=50,overlap=0,include_incomplete=False)'] |
| 21 |  16 3 2022 15:22:01 | dvsgesture_1l.py |  cuda  | 592.4697506427765  |  (0.754874651810585, 0.7196969696969697)   |                (25.691959023364962, 29.469583626949426)               |   25   |     8      |  ['amsgrad:False', 'betas:(0.9,0.999)', 'eps:1e-08', 'lr:0.003', 'weight_decay:0.05'] |  100   |    50   | SRMALPHA |   5   |  10.0 |  5.0   |    2     |   1    |    1     |   {'start': 0, 'stop': 50}  |  {True: 80, False: 5}  | ['Downsample(time_factor=0.001,spatial_factor=1)', 'ToFrame(sensor_size=(128,128,2),time_window=None,event_count=None,n_time_bins=None,n_event_bins=50,overlap=0,include_incomplete=False)'] |
| 22 |  16 3 2022 16:58:12 | dvsgesture_1l.py |  cuda  | 2152.7191565036774 |  (0.9925719591457753, 0.8484848484848485)  |                (22.446526863006053, 32.65833334489302)                |  100   |     8      |  ['amsgrad:False', 'betas:(0.9,0.999)', 'eps:1e-08', 'lr:0.003', 'weight_decay:0.02'] |  100   |    50   | SRMALPHA |   1   |  1.0  |  5.0   |    2     |   1    |    1     |   {'start': 0, 'stop': 50}  | {True: 90, False: 10}  | ['Downsample(time_factor=0.001,spatial_factor=1)', 'ToFrame(sensor_size=(128,128,2),time_window=None,event_count=None,n_time_bins=None,n_event_bins=50,overlap=0,include_incomplete=False)'] |
| 23 |  16 3 2022 18:30:50 | dvsgesture_1l.py |  cuda  | 1090.5978593826294 |  (0.7910863509749304, 0.6628787878787878)  |                (25.567994339995177, 30.30583318074544)                |   50   |     8      |  ['amsgrad:False', 'betas:(0.9,0.999)', 'eps:1e-08', 'lr:0.002', 'weight_decay:0.05'] |  100   |    50   | SRMALPHA |   5   |  5.0  |  5.0   |    2     |   1    |    1     |   {'start': 0, 'stop': 50}  | {True: 85, False: 10}  | ['Downsample(time_factor=0.001,spatial_factor=1)', 'ToFrame(sensor_size=(128,128,2),time_window=None,event_count=None,n_time_bins=None,n_event_bins=50,overlap=0,include_incomplete=False)'] |
| 24 |  16 3 2022 18:56:21 | dvsgesture_1l.py |  cuda  | 1184.9832813739777 |  (0.7910863509749304, 0.678030303030303)   |                 (43.11836550118421, 47.1759472471295)                 |   50   |     8      |  ['amsgrad:False', 'betas:(0.9,0.999)', 'eps:1e-08', 'lr:0.002', 'weight_decay:0.05'] |  100   |    50   | SRMALPHA |   1   |  1.0  |  5.0   |    2     |   1    |    1     |   {'start': 0, 'stop': 50}  | {True: 100, False: 10} | ['Downsample(time_factor=0.001,spatial_factor=1)', 'ToFrame(sensor_size=(128,128,2),time_window=None,event_count=None,n_time_bins=None,n_event_bins=50,overlap=0,include_incomplete=False)'] |
| 25 |  16 3 2022 19:36:59 | dvsgesture_1l.py |  cuda  | 2375.575424671173  |  (0.8820798514391829, 0.8143939393939394)  |                 (28.87081665492434, 33.28753800825639)                |  100   |     8      |  ['amsgrad:False', 'betas:(0.9,0.999)', 'eps:1e-08', 'lr:0.002', 'weight_decay:0.05'] |  100   |    50   | SRMALPHA |   1   |  1.0  |  5.0   |    2     |   1    |    1     |   {'start': 0, 'stop': 50}  | {True: 90, False: 10}  | ['Downsample(time_factor=0.001,spatial_factor=1)', 'ToFrame(sensor_size=(128,128,2),time_window=None,event_count=None,n_time_bins=None,n_event_bins=50,overlap=0,include_incomplete=False)'] |
| 26 |  16 3 2022 19:43:01 | dvsgesture_1l.py |  cuda  | 353.26306200027466 |  (0.9879294336118849, 0.8106060606060606)  |                  (22.1665825378928, 35.0032194888953)                 |   25   |     8      |  ['amsgrad:False', 'betas:(0.9,0.999)', 'eps:1e-08', 'lr:0.003', 'weight_decay:0.0']  |  100   |    50   | SRMALPHA |   1   |  1.0  |  5.0   |    2     |   1    |    1     |   {'start': 0, 'stop': 50}  | {True: 90, False: 10}  | ['Downsample(time_factor=0.001,spatial_factor=1)', 'ToFrame(sensor_size=(128,128,2),time_window=None,event_count=None,n_time_bins=None,n_event_bins=50,overlap=0,include_incomplete=False)'] |
| 27 |  16 3 2022 19:49:40 | dvsgesture_1l.py |  cuda  | 355.32724928855896 |         (1.0, 0.7348484848484849)          |                (20.25793873566439, 35.167878873420484)                |   25   |     8      |  ['amsgrad:False', 'betas:(0.9,0.999)', 'eps:1e-08', 'lr:0.003', 'weight_decay:0.0']  |  100   |    50   | SRMALPHA |   5   |  10.0 |  5.0   |    2     |   1    |    1     |   {'start': 0, 'stop': 50}  | {True: 90, False: 10}  | ['Downsample(time_factor=0.001,spatial_factor=1)', 'ToFrame(sensor_size=(128,128,2),time_window=None,event_count=None,n_time_bins=None,n_event_bins=50,overlap=0,include_incomplete=False)'] |
| 28 |  16 3 2022 19:56:43 | dvsgesture_1l.py |  cuda  | 349.15415048599243 |  (0.9870009285051068, 0.7765151515151515)  |                (20.471531760836488, 32.47189406192664)                |   25   |     8      |  ['amsgrad:False', 'betas:(0.9,0.999)', 'eps:1e-08', 'lr:0.003', 'weight_decay:0.0']  |  100   |    50   | SRMALPHA |   5   |  5.0  |  5.0   |    2     |   1    |    1     |   {'start': 0, 'stop': 50}  | {True: 90, False: 10}  | ['Downsample(time_factor=0.001,spatial_factor=1)', 'ToFrame(sensor_size=(128,128,2),time_window=None,event_count=None,n_time_bins=None,n_event_bins=50,overlap=0,include_incomplete=False)'] |
| 29 |  16 3 2022 20:02:43 | dvsgesture_1l.py |  cuda  | 351.2434642314911  |  (0.9656453110492108, 0.7159090909090909)  |                (24.995264689127605, 37.59166648171165)                |   25   |     8      |  ['amsgrad:False', 'betas:(0.9,0.999)', 'eps:1e-08', 'lr:0.003', 'weight_decay:0.0']  |  100   |    50   | SRMALPHA |   5   |  5.0  |  1.0   |    2     |   1    |    1     |   {'start': 0, 'stop': 50}  | {True: 90, False: 10}  | ['Downsample(time_factor=0.001,spatial_factor=1)', 'ToFrame(sensor_size=(128,128,2),time_window=None,event_count=None,n_time_bins=None,n_event_bins=50,overlap=0,include_incomplete=False)'] |
| 30 |  16 3 2022 20:08:57 | dvsgesture_1l.py |  cuda  | 356.8101360797882  |  (0.9498607242339833, 0.7765151515151515)  |                 (24.220036867047863, 33.9391663869222)                |   25   |     8      |  ['amsgrad:False', 'betas:(0.9,0.999)', 'eps:1e-08', 'lr:0.003', 'weight_decay:0.0']  |  100   |    50   | SRMALPHA |   5   |  5.0  |  10.0  |    2     |   1    |    1     |   {'start': 0, 'stop': 50}  | {True: 90, False: 10}  | ['Downsample(time_factor=0.001,spatial_factor=1)', 'ToFrame(sensor_size=(128,128,2),time_window=None,event_count=None,n_time_bins=None,n_event_bins=50,overlap=0,include_incomplete=False)'] |
| 31 |  16 3 2022 20:15:48 | dvsgesture_1l.py |  cuda  | 356.5037670135498  |  (0.968430826369545, 0.7613636363636364)   |                (25.388839069957964, 36.98977221864642)                |   25   |     8      |  ['amsgrad:False', 'betas:(0.9,0.999)', 'eps:1e-08', 'lr:0.003', 'weight_decay:0.0']  |  100   |    50   | SRMALPHA |   1   |  1.0  |  10.0  |    2     |   1    |    1     |   {'start': 0, 'stop': 50}  | {True: 90, False: 10}  | ['Downsample(time_factor=0.001,spatial_factor=1)', 'ToFrame(sensor_size=(128,128,2),time_window=None,event_count=None,n_time_bins=None,n_event_bins=50,overlap=0,include_incomplete=False)'] |
| 32 |  16 3 2022 20:22:16 | dvsgesture_1l.py |  cuda  | 355.93144154548645 |  (0.9981429897864438, 0.7992424242424242)  |                 (20.623537012240128, 33.6978786352909)                |   25   |     8      |  ['amsgrad:False', 'betas:(0.9,0.999)', 'eps:1e-08', 'lr:0.003', 'weight_decay:0.0']  |  100   |    50   | SRMALPHA |   1   |  1.0  |  1.0   |    2     |   1    |    1     |   {'start': 0, 'stop': 50}  | {True: 90, False: 10}  | ['Downsample(time_factor=0.001,spatial_factor=1)', 'ToFrame(sensor_size=(128,128,2),time_window=None,event_count=None,n_time_bins=None,n_event_bins=50,overlap=0,include_incomplete=False)'] |
| 33 |  16 3 2022 20:28:22 | dvsgesture_1l.py |  cuda  | 352.0068221092224  |  (0.9916434540389972, 0.6931818181818182)  |                (25.662720534130724, 40.94693120320638)                |   25   |     8      |  ['amsgrad:False', 'betas:(0.9,0.999)', 'eps:1e-08', 'lr:0.003', 'weight_decay:0.0']  |  100   |    50   | SRMALPHA |   5   |  10.0 |  1.0   |    2     |   1    |    1     |   {'start': 0, 'stop': 50}  | {True: 90, False: 10}  | ['Downsample(time_factor=0.001,spatial_factor=1)', 'ToFrame(sensor_size=(128,128,2),time_window=None,event_count=None,n_time_bins=None,n_event_bins=50,overlap=0,include_incomplete=False)'] |
| 34 |  16 3 2022 20:34:09 | dvsgesture_1l.py |  cuda  |  334.646684885025  |  (0.754874651810585, 0.6553030303030303)   |                 (39.68772572240236, 45.72018999041933)                |   25   |     8      |  ['amsgrad:False', 'betas:(0.9,0.999)', 'eps:1e-08', 'lr:0.003', 'weight_decay:0.0']  |  100   |    50   | SRMALPHA |   1   |  5.0  |  1.0   |    2     |   1    |    1     |   {'start': 0, 'stop': 50}  | {True: 90, False: 10}  | ['Downsample(time_factor=0.001,spatial_factor=1)', 'ToFrame(sensor_size=(128,128,2),time_window=None,event_count=None,n_time_bins=None,n_event_bins=50,overlap=0,include_incomplete=False)'] |
| 35 |  16 3 2022 20:39:46 | dvsgesture_1l.py |  cuda  | 330.89720487594604 |  (0.680594243268338, 0.5227272727272727)   |                 (37.05631346069449, 43.25924173990885)                |   25   |     8      |  ['amsgrad:False', 'betas:(0.9,0.999)', 'eps:1e-08', 'lr:0.003', 'weight_decay:0.0']  |  100   |    50   | SRMALPHA |   1   |  5.0  |  5.0   |    2     |   1    |    1     |   {'start': 0, 'stop': 50}  | {True: 90, False: 10}  | ['Downsample(time_factor=0.001,spatial_factor=1)', 'ToFrame(sensor_size=(128,128,2),time_window=None,event_count=None,n_time_bins=None,n_event_bins=50,overlap=0,include_incomplete=False)'] |
| 36 |  16 3 2022 20:45:48 | dvsgesture_1l.py |  cuda  | 328.8644564151764  |  (0.797585886722377, 0.5984848484848485)   |                 (29.1813553408992, 37.46034067327326)                 |   25   |     8      |  ['amsgrad:False', 'betas:(0.9,0.999)', 'eps:1e-08', 'lr:0.003', 'weight_decay:0.0']  |  100   |    50   | SRMALPHA |   1   |  5.0  |  10.0  |    2     |   1    |    1     |   {'start': 0, 'stop': 50}  | {True: 90, False: 10}  | ['Downsample(time_factor=0.001,spatial_factor=1)', 'ToFrame(sensor_size=(128,128,2),time_window=None,event_count=None,n_time_bins=None,n_event_bins=50,overlap=0,include_incomplete=False)'] |
| 37 |  16 3 2022 20:54:28 | dvsgesture_1l.py |  cuda  | 339.15186500549316 |         (1.0, 0.7954545454545454)          |                (18.799544409678397, 33.17943110610499)                |   25   |     8      |  ['amsgrad:False', 'betas:(0.9,0.999)', 'eps:1e-08', 'lr:0.003', 'weight_decay:0.0']  |  100   |    50   | SRMALPHA |   10  |  1.0  |  1.0   |    2     |   1    |    1     |   {'start': 0, 'stop': 50}  | {True: 90, False: 10}  | ['Downsample(time_factor=0.001,spatial_factor=1)', 'ToFrame(sensor_size=(128,128,2),time_window=None,event_count=None,n_time_bins=None,n_event_bins=50,overlap=0,include_incomplete=False)'] |
| 38 |  16 3 2022 21:00:27 | dvsgesture_1l.py |  cuda  | 340.85221219062805 |  (0.9972144846796658, 0.7348484848484849)  |                (21.283370319957964, 35.69685577623772)                |   25   |     8      |  ['amsgrad:False', 'betas:(0.9,0.999)', 'eps:1e-08', 'lr:0.003', 'weight_decay:0.0']  |  100   |    50   | SRMALPHA |   10  |  5.0  |  1.0   |    2     |   1    |    1     |   {'start': 0, 'stop': 50}  | {True: 90, False: 10}  | ['Downsample(time_factor=0.001,spatial_factor=1)', 'ToFrame(sensor_size=(128,128,2),time_window=None,event_count=None,n_time_bins=None,n_event_bins=50,overlap=0,include_incomplete=False)'] |
| 39 |  16 3 2022 21:06:24 | dvsgesture_1l.py |  cuda  | 343.08757853507996 |         (1.0, 0.7196969696969697)          |                 (22.6919032019825, 38.638825329867274)                |   25   |     8      |  ['amsgrad:False', 'betas:(0.9,0.999)', 'eps:1e-08', 'lr:0.003', 'weight_decay:0.0']  |  100   |    50   | SRMALPHA |   10  |  10.0 |  1.0   |    2     |   1    |    1     |   {'start': 0, 'stop': 50}  | {True: 90, False: 10}  | ['Downsample(time_factor=0.001,spatial_factor=1)', 'ToFrame(sensor_size=(128,128,2),time_window=None,event_count=None,n_time_bins=None,n_event_bins=50,overlap=0,include_incomplete=False)'] |
| 40 |  16 3 2022 21:12:20 | dvsgesture_1l.py |  cuda  | 338.8671233654022  |  (0.7650882079851439, 0.6287878787878788)  |                (33.27973945072213, 39.864620902321555)                |   25   |     8      |  ['amsgrad:False', 'betas:(0.9,0.999)', 'eps:1e-08', 'lr:0.003', 'weight_decay:0.0']  |  100   |    50   | SRMALPHA |   10  |  1.0  |  5.0   |    2     |   1    |    1     |   {'start': 0, 'stop': 50}  | {True: 90, False: 10}  | ['Downsample(time_factor=0.001,spatial_factor=1)', 'ToFrame(sensor_size=(128,128,2),time_window=None,event_count=None,n_time_bins=None,n_event_bins=50,overlap=0,include_incomplete=False)'] |
| 41 |  16 3 2022 21:18:12 | dvsgesture_1l.py |  cuda  | 341.7702851295471  |  (0.6415970287836583, 0.5833333333333334)  |                 (40.70710298189324, 43.38280232747396)                |   25   |     8      |  ['amsgrad:False', 'betas:(0.9,0.999)', 'eps:1e-08', 'lr:0.003', 'weight_decay:0.0']  |  100   |    50   | SRMALPHA |   10  |  1.0  |  10.0  |    2     |   1    |    1     |   {'start': 0, 'stop': 50}  | {True: 90, False: 10}  | ['Downsample(time_factor=0.001,spatial_factor=1)', 'ToFrame(sensor_size=(128,128,2),time_window=None,event_count=None,n_time_bins=None,n_event_bins=50,overlap=0,include_incomplete=False)'] |
| 42 |  16 3 2022 21:24:06 | dvsgesture_1l.py |  cuda  | 341.8748722076416  |         (1.0, 0.7878787878787878)          |                (19.730464202115794, 32.83257559574012)                |   25   |     8      |  ['amsgrad:False', 'betas:(0.9,0.999)', 'eps:1e-08', 'lr:0.003', 'weight_decay:0.0']  |  100   |    50   | SRMALPHA |   10  |  5.0  |  5.0   |    2     |   1    |    1     |   {'start': 0, 'stop': 50}  | {True: 90, False: 10}  | ['Downsample(time_factor=0.001,spatial_factor=1)', 'ToFrame(sensor_size=(128,128,2),time_window=None,event_count=None,n_time_bins=None,n_event_bins=50,overlap=0,include_incomplete=False)'] |
| 43 |  16 3 2022 21:30:06 | dvsgesture_1l.py |  cuda  | 344.3852939605713  |  (0.9480037140204272, 0.7651515151515151)  |                 (26.692199962052793, 34.913674325654)                 |   25   |     8      |  ['amsgrad:False', 'betas:(0.9,0.999)', 'eps:1e-08', 'lr:0.003', 'weight_decay:0.0']  |  100   |    50   | SRMALPHA |   10  |  5.0  |  10.0  |    2     |   1    |    1     |   {'start': 0, 'stop': 50}  | {True: 90, False: 10}  | ['Downsample(time_factor=0.001,spatial_factor=1)', 'ToFrame(sensor_size=(128,128,2),time_window=None,event_count=None,n_time_bins=None,n_event_bins=50,overlap=0,include_incomplete=False)'] |
| 44 |  16 3 2022 21:35:58 | dvsgesture_1l.py |  cuda  | 340.5619649887085  |         (1.0, 0.7689393939393939)          |                (19.732692750383553, 34.46825749946363)                |   25   |     8      |  ['amsgrad:False', 'betas:(0.9,0.999)', 'eps:1e-08', 'lr:0.003', 'weight_decay:0.0']  |  100   |    50   | SRMALPHA |   10  |  10.0 |  5.0   |    2     |   1    |    1     |   {'start': 0, 'stop': 50}  | {True: 90, False: 10}  | ['Downsample(time_factor=0.001,spatial_factor=1)', 'ToFrame(sensor_size=(128,128,2),time_window=None,event_count=None,n_time_bins=None,n_event_bins=50,overlap=0,include_incomplete=False)'] |
| 45 |  16 3 2022 21:42:23 | dvsgesture_1l.py |  cuda  | 344.38706064224243 |  (0.9981429897864438, 0.7651515151515151)  |                (21.001532176521607, 35.10117455684777)                |   25   |     8      |  ['amsgrad:False', 'betas:(0.9,0.999)', 'eps:1e-08', 'lr:0.003', 'weight_decay:0.0']  |  100   |    50   | SRMALPHA |   10  |  10.0 |  10.0  |    2     |   1    |    1     |   {'start': 0, 'stop': 50}  | {True: 90, False: 10}  | ['Downsample(time_factor=0.001,spatial_factor=1)', 'ToFrame(sensor_size=(128,128,2),time_window=None,event_count=None,n_time_bins=None,n_event_bins=50,overlap=0,include_incomplete=False)'] |
| 46 |  16 3 2022 21:51:25 | dvsgesture_1l.py |  cuda  | 340.37868428230286 |  (0.8653667595171773, 0.6287878787878788)  |                (36.54920184490519, 47.044658892082445)                |   25   |     8      |  ['amsgrad:False', 'betas:(0.9,0.999)', 'eps:1e-08', 'lr:0.003', 'weight_decay:0.0']  |  100   |    50   | SRMALPHA |   1   |  10.0 |  1.0   |    2     |   1    |    1     |   {'start': 0, 'stop': 50}  | {True: 90, False: 10}  | ['Downsample(time_factor=0.001,spatial_factor=1)', 'ToFrame(sensor_size=(128,128,2),time_window=None,event_count=None,n_time_bins=None,n_event_bins=50,overlap=0,include_incomplete=False)'] |
| 47 |  16 3 2022 21:57:40 | dvsgesture_1l.py |  cuda  | 338.6839323043823  |  (0.7836583101207056, 0.6136363636363636)  |                (39.60279473576595, 49.145264712246984)                |   25   |     8      |  ['amsgrad:False', 'betas:(0.9,0.999)', 'eps:1e-08', 'lr:0.003', 'weight_decay:0.0']  |  100   |    50   | SRMALPHA |   1   |  10.0 |  5.0   |    2     |   1    |    1     |   {'start': 0, 'stop': 50}  | {True: 90, False: 10}  | ['Downsample(time_factor=0.001,spatial_factor=1)', 'ToFrame(sensor_size=(128,128,2),time_window=None,event_count=None,n_time_bins=None,n_event_bins=50,overlap=0,include_incomplete=False)'] |
| 48 |  16 3 2022 22:03:39 | dvsgesture_1l.py |  cuda  | 333.6281156539917  |  (0.7985143918291551, 0.571969696969697)   |                (30.308031710852266, 40.941022872924805)               |   25   |     8      |  ['amsgrad:False', 'betas:(0.9,0.999)', 'eps:1e-08', 'lr:0.003', 'weight_decay:0.0']  |  100   |    50   | SRMALPHA |   1   |  10.0 |  10.0  |    2     |   1    |    1     |   {'start': 0, 'stop': 50}  | {True: 90, False: 10}  | ['Downsample(time_factor=0.001,spatial_factor=1)', 'ToFrame(sensor_size=(128,128,2),time_window=None,event_count=None,n_time_bins=None,n_event_bins=50,overlap=0,include_incomplete=False)'] |
| 49 |  17 3 2022 09:28:16 | dvsgesture_1l.py |  cuda  | 350.4404876232147  |  (0.9888579387186629, 0.7386363636363636)  |                (22.154614575172644, 34.87878782098944)                |   25   |     8      |  ['amsgrad:False', 'betas:(0.9,0.999)', 'eps:1e-08', 'lr:0.003', 'weight_decay:0.0']  |  100   |    50   | SRMALPHA |   5   |  10.0 |  10.0  |    2     |   1    |    1     |   {'start': 0, 'stop': 50}  | {True: 90, False: 10}  | ['Downsample(time_factor=0.001,spatial_factor=1)', 'ToFrame(sensor_size=(128,128,2),time_window=None,event_count=None,n_time_bins=None,n_event_bins=50,overlap=0,include_incomplete=False)'] |
| 50 |  17 3 2022 09:36:06 | dvsgesture_1l.py |  cuda  | 358.46762204170227 |         (1.0, 0.8333333333333334)          |                 (18.16891282558884, 31.79999912146366)                |   25   |     8      |  ['amsgrad:False', 'betas:(0.9,0.999)', 'eps:1e-08', 'lr:0.003', 'weight_decay:0.0']  |  100   |    50   | SRMALPHA |   5   |  1.0  |  1.0   |    2     |   1    |    1     |   {'start': 0, 'stop': 50}  | {True: 90, False: 10}  | ['Downsample(time_factor=0.001,spatial_factor=1)', 'ToFrame(sensor_size=(128,128,2),time_window=None,event_count=None,n_time_bins=None,n_event_bins=50,overlap=0,include_incomplete=False)'] |
| 51 |  17 3 2022 09:42:36 | dvsgesture_1l.py |  cuda  | 327.33205580711365 |  (0.8579387186629527, 0.6931818181818182)  |                (28.593509202990802, 38.143825299812086)               |   25   |     8      |  ['amsgrad:False', 'betas:(0.9,0.999)', 'eps:1e-08', 'lr:0.003', 'weight_decay:0.0']  |  100   |    50   | SRMALPHA |   5   |  1.0  |  5.0   |    2     |   1    |    1     |   {'start': 0, 'stop': 50}  | {True: 90, False: 10}  | ['Downsample(time_factor=0.001,spatial_factor=1)', 'ToFrame(sensor_size=(128,128,2),time_window=None,event_count=None,n_time_bins=None,n_event_bins=50,overlap=0,include_incomplete=False)'] |
| 52 |  17 3 2022 09:48:22 | dvsgesture_1l.py |  cuda  | 340.93387055397034 |  (0.7465181058495822, 0.6060606060606061)  |                (33.29157791916928, 39.904090765750766)                |   25   |     8      |  ['amsgrad:False', 'betas:(0.9,0.999)', 'eps:1e-08', 'lr:0.003', 'weight_decay:0.0']  |  100   |    50   | SRMALPHA |   5   |  1.0  |  10.0  |    2     |   1    |    1     |   {'start': 0, 'stop': 50}  | {True: 90, False: 10}  | ['Downsample(time_factor=0.001,spatial_factor=1)', 'ToFrame(sensor_size=(128,128,2),time_window=None,event_count=None,n_time_bins=None,n_event_bins=50,overlap=0,include_incomplete=False)'] |
| 53 |  18 3 2022 00:51:21 | dvsgesture_1l.py |  cuda  | 976.5983240604401  |  (0.9870009285051068, 0.8712121212121212)  |                (22.41455853107137, 30.248295292709813)                |   50   |     8      |  ['amsgrad:False', 'betas:(0.9,0.999)', 'eps:1e-08', 'lr:0.003', 'weight_decay:0.01'] |  100   |    50   | SRMALPHA |   5   |  1.0  |  1.0   |    2     |   1    |    1     |   {'start': 0, 'stop': 50}  | {True: 90, False: 10}  | ['Downsample(time_factor=0.001,spatial_factor=1)', 'ToFrame(sensor_size=(128,128,2),time_window=None,event_count=None,n_time_bins=None,n_event_bins=50,overlap=0,include_incomplete=False)'] |
+----+---------------------+------------------+--------+--------------------+--------------------------------------------+-----------------------------------------------------------------------+--------+------------+---------------------------------------------------------------------------------------+--------+---------+----------+-------+-------+--------+----------+--------+----------+-----------------------------+------------------------+----------------------------------------------------------------------------------------------------------------------------------------------------------------------------------------------+