n, date, filename, device, runtime," accuracy (train, test)"," samples (train, test)", network, epochs, batch_size, nu, layers, exc, inh, wmin, wmax, norm, transform
0,15 12 2021 16:40:34,pokerdvs_supervised.py,cuda,1.3204503059387207,"(0.75, 0.3)","(48, 20)",DiehlAndCook2015,1,1,"[0.0001, 0.01]",16,22.5,120,0.0,1.0,490.0,"['Downsample(time_factor=0.001,spatial_factor=1)', 'ToFrame(sensor_size=(35,35,2),time_window=1,event_count=None,n_time_bins=None,n_event_bins=None,overlap=0,include_incomplete=False)']"
1,15 12 2021 16:45:25,pokerdvs_unsupervised_cnn.py,cuda,1.7658507823944092,"(0.22916666666666666, 0.15)","(48, 20)",TwoLayerConvNetwork,1,16,"[0.0001, 0.01]",34x34x2-16c8,22.5,120,0.0,1.0,12.5,"['Downsample(time_factor=0.001,spatial_factor=1)', 'ToFrame(sensor_size=(35,35,2),time_window=1,event_count=None,n_time_bins=None,n_event_bins=None,overlap=0,include_incomplete=False)']"
2,15 12 2021 16:46:06,pokerdvs_unsupervised_cnn.py,cuda,18.719690561294556,"(0.5416666666666666, 0.75)","(48, 20)",TwoLayerConvNetwork,25,8,"[0.0001, 0.01]",34x34x2-16c8,22.5,120,0.0,1.0,12.5,"['Downsample(time_factor=0.001,spatial_factor=1)', 'ToFrame(sensor_size=(35,35,2),time_window=1,event_count=None,n_time_bins=None,n_event_bins=None,overlap=0,include_incomplete=False)']"
3,16 12 2021 14:24:59,pokerdvs_unsupervised_cnn.py,cuda,43.361072301864624,"(0.5, 0.5)","(48, 20)",TwoLayerConvNetwork,25,8,"[0.0001, 0.01]",35x35x2-8c31,22.5,120,0.0,1.0,490.0,"['Downsample(time_factor=0.001,spatial_factor=1)', 'ToFrame(sensor_size=(35,35,2),time_window=1,event_count=None,n_time_bins=None,n_event_bins=None,overlap=0,include_incomplete=False)']"
4,17 12 2021 12:55:09,pokerdvs_unsupervised_cnn.py,cuda,49.260040044784546,"(0.6041666666666666, 0.55)","(48, 20)",TwoLayerConvNetwork_LIF,25,8,"[0.0001, 0.01]",35x35x2-8c33,22.5,120,0.0,1.0,490.0,"['Downsample(time_factor=0.001,spatial_factor=1)', 'ToFrame(sensor_size=(35,35,2),time_window=1,event_count=None,n_time_bins=None,n_event_bins=None,overlap=0,include_incomplete=False)']"
5,17 12 2021 12:58:21,pokerdvs_unsupervised_cnn.py,cuda,111.94423842430115,"(0.5833333333333334, 0.55)","(48, 20)",TwoLayerConvNetwork_LIF,25,8,"[0.0001, 0.01]",35x35x2-16c33,22.5,120,0.0,1.0,490.0,"['Downsample(time_factor=0.001,spatial_factor=1)', 'ToFrame(sensor_size=(35,35,2),time_window=1,event_count=None,n_time_bins=None,n_event_bins=None,overlap=0,include_incomplete=False)']"
6,17 12 2021 13:03:08,pokerdvs_unsupervised_cnn.py,cuda,225.31764554977417,"(0.5, 0.4)","(48, 20)",TwoLayerConvNetwork_LIF,25,8,"[0.0001, 0.01]",35x35x2-25c33,22.5,120,0.0,1.0,490.0,"['Downsample(time_factor=0.001,spatial_factor=1)', 'ToFrame(sensor_size=(35,35,2),time_window=1,event_count=None,n_time_bins=None,n_event_bins=None,overlap=0,include_incomplete=False)']"
7,17 12 2021 13:05:27,pokerdvs_unsupervised_cnn.py,cuda,54.97923135757446,"(0.5416666666666666, 0.55)","(48, 20)",TwoLayerConvNetwork_LIF,25,8,"[0.0001, 0.01]",35x35x2-8c35,22.5,120,0.0,1.0,490.0,"['Downsample(time_factor=0.001,spatial_factor=1)', 'ToFrame(sensor_size=(35,35,2),time_window=1,event_count=None,n_time_bins=None,n_event_bins=None,overlap=0,include_incomplete=False)']"
8,17 12 2021 13:06:47,pokerdvs_unsupervised_cnn.py,cuda,34.02324604988098,"(0.5833333333333334, 0.5)","(48, 20)",TwoLayerConvNetwork_LIF,25,8,"[0.0001, 0.01]",35x35x2-8c33,22.5,120,0.0,1.0,490.0,"['Downsample(time_factor=0.001,spatial_factor=1)', 'ToFrame(sensor_size=(35,35,2),time_window=1,event_count=None,n_time_bins=None,n_event_bins=None,overlap=0,include_incomplete=False)']"
9,17 12 2021 13:07:51,pokerdvs_unsupervised_cnn.py,cuda,35.847846031188965,"(0.4375, 0.75)","(48, 20)",TwoLayerConvNetwork_LIF,25,8,"[0.0001, 0.01]",35x35x2-8c33,22.5,120,0.0,1.0,490.0,"['Downsample(time_factor=0.001,spatial_factor=1)', 'ToFrame(sensor_size=(35,35,2),time_window=1,event_count=None,n_time_bins=None,n_event_bins=None,overlap=0,include_incomplete=False)']"
10,17 12 2021 13:08:36,pokerdvs_unsupervised_cnn.py,cuda,35.7663791179657,"(0.4791666666666667, 0.55)","(48, 20)",TwoLayerConvNetwork_LIF,25,8,"[0.0001, 0.01]",35x35x2-8c33,22.5,120,0.0,1.0,490.0,"['Downsample(time_factor=0.001,spatial_factor=1)', 'ToFrame(sensor_size=(35,35,2),time_window=1,event_count=None,n_time_bins=None,n_event_bins=None,overlap=0,include_incomplete=False)']"
11,23 12 2021 12:21:46,pokerdvs_supervised.py,cuda,1.1282258033752441,"(0.7083333333333334, 0.35)","(48, 20)",DiehlAndCook2015,1,1,"[0.0001, 0.01]",16,22.5,120,0.0,1.0,490.0,"['Downsample(time_factor=0.001,spatial_factor=1)', 'ToFrame(sensor_size=(35,35,2),time_window=1,event_count=None,n_time_bins=None,n_event_bins=None,overlap=0,include_incomplete=False)']"
12,27 12 2021 12:21:58,pokerdvs_supervised.py,cuda,8.675045490264893,"(0.9375, 0.25)","(48, 20)",TestNet,1,1,"[0.0001, 0.01]",100,22.5,120,0.0,1.0,490.0,"['Downsample(time_factor=0.001,spatial_factor=1)', 'ToFrame(sensor_size=(35,35,2),time_window=1,event_count=None,n_time_bins=None,n_event_bins=None,overlap=0,include_incomplete=False)']"
13,27 12 2021 12:25:12,pokerdvs_supervised.py,cuda,133.17113494873047,"(1.0, 0.25)","(48, 20)",TestNet,25,1,"[0.0001, 0.01]",100,22.5,120,0.0,1.0,490.0,"['Downsample(time_factor=0.001,spatial_factor=1)', 'ToFrame(sensor_size=(35,35,2),time_window=1,event_count=None,n_time_bins=None,n_event_bins=None,overlap=0,include_incomplete=False)']"
14,27 12 2021 12:29:55,pokerdvs_supervised.py,cuda,53.93242049217224,"(1.0, 0.25)","(48, 20)",TestNet,10,1,"[0.0001, 0.01]",100,22.5,120,0.0,1.0,367.5,"['Downsample(time_factor=0.001,spatial_factor=1)', 'ToFrame(sensor_size=(35,35,2),time_window=1,event_count=None,n_time_bins=None,n_event_bins=None,overlap=0,include_incomplete=False)']"
15,27 12 2021 12:34:14,pokerdvs_supervised.py,cuda,54.07886481285095,"(1.0, 0.25)","(48, 20)",TestNet,10,1,"[0.0001, 0.01]",100,22.5,120,0.0,1.0,367.5,"['Downsample(time_factor=0.001,spatial_factor=1)', 'ToFrame(sensor_size=(35,35,2),time_window=1,event_count=None,n_time_bins=None,n_event_bins=None,overlap=0,include_incomplete=False)']"
16,27 12 2021 12:42:06,pokerdvs_supervised.py,cuda,102.69831156730652,"(1.0, 0.25)","(48, 20)",TestNet,10,1,"[0.0001, 0.01]",100,22.5,120,0.0,1.0,183.75,"['ToVoxelGrid(sensor_size=(35,35,2),n_time_bins=100)']"
17,27 12 2021 12:44:15,pokerdvs_supervised.py,cuda,103.19078993797302,"(1.0, 0.25)","(48, 20)",TestNet,10,1,"[0.0001, 0.01]",100,22.5,120,0.0,1.0,183.75,"['ToVoxelGrid(sensor_size=(35,35,2),n_time_bins=100)']"
18,27 12 2021 12:46:14,pokerdvs_supervised.py,cuda,102.77958559989929,"(1.0, 0.25)","(48, 20)",TestNet,10,1,"[0.0001, 0.01]",100,22.5,120,0.0,1.0,183.75,"['ToVoxelGrid(sensor_size=(35,35,2),n_time_bins=100)']"
19,27 12 2021 12:52:04,pokerdvs_supervised.py,cuda,76.09586238861084,"(1.0, 0.25)","(48, 20)",LIF_Readout,10,1,"[0.0001, 0.01]",100,22.5,120,0.0,1.0,183.75,"['ToVoxelGrid(sensor_size=(35,35,2),n_time_bins=100)']"
20,27 12 2021 12:54:18,pokerdvs_supervised.py,cuda,75.76248502731323,"(1.0, 0.25)","(48, 20)",LIF_Readout,10,1,"[0.0001, 0.01]",100,22.5,120,0.0,1.0,183.75,"['ToVoxelGrid(sensor_size=(35,35,2),n_time_bins=100)']"
21,27 12 2021 12:57:02,pokerdvs_supervised.py,cuda,37.88533163070679,"(1.0, 0.35)","(48, 20)",LIF_Readout,10,1,"[0.0001, 0.01]",100,22.5,120,0.0,1.0,183.75,"['ToVoxelGrid(sensor_size=(35,35,2),n_time_bins=25)']"
22,27 12 2021 12:58:52,pokerdvs_supervised.py,cuda,93.22406554222107,"(1.0, 0.4)","(48, 20)",LIF_Readout,25,1,"[0.0001, 0.01]",100,22.5,120,0.0,1.0,183.75,"['ToVoxelGrid(sensor_size=(35,35,2),n_time_bins=25)']"
23,27 12 2021 13:00:22,pokerdvs_supervised.py,cuda,72.7952835559845,"(1.0, 0.35)","(48, 20)",LIF_Readout,50,1,"[0.0001, 0.01]",100,22.5,120,0.0,1.0,183.75,"['ToVoxelGrid(sensor_size=(35,35,2),n_time_bins=25)']"
24,27 12 2021 13:01:49,pokerdvs_supervised.py,cuda,73.16910290718079,"(1.0, 0.4)","(48, 20)",LIF_Readout,50,1,"[0.0001, 0.01]",100,22.5,120,0.0,1.0,245.0,"['ToVoxelGrid(sensor_size=(35,35,2),n_time_bins=25)']"
25,27 12 2021 13:09:11,pokerdvs_supervised.py,cuda,178.86624598503113,"(1.0, 0.3)","(48, 20)",LIF_Readout,50,1,"[0.0001, 0.01]",100,22.5,120,0.0,1.0,490.0,"['Downsample(time_factor=0.001,spatial_factor=1)', 'ToFrame(sensor_size=(35,35,2),time_window=1,event_count=None,n_time_bins=None,n_event_bins=None,overlap=0,include_incomplete=False)']"
26,27 12 2021 13:24:14,pokerdvs_supervised.py,cuda,885.4558832645416,"(1.0, 0.25)","(48, 20)",LIF_Readout,50,1,"[0.0001, 0.01]",100,22.5,120,0.0,1.0,490.0,"['Downsample(time_factor=0.001,spatial_factor=1)', 'ToFrame(sensor_size=(35,35,2),time_window=None,event_count=10,n_time_bins=None,n_event_bins=None,overlap=0,include_incomplete=False)']"
27,27 12 2021 14:15:57,pokerdvs_unsupervised_cnn.py,cuda,44.2971293926239,"(0.5625, 0.55)","(48, 20)",TwoLayerConvNetwork_LIF,25,8,"[0.0001, 0.01]",35x35x2-8c33,22.5,120,0.0,1.0,245.0,"['ToVoxelGrid(sensor_size=(35,35,2),n_time_bins=100)']"
28,27 12 2021 14:17:05,pokerdvs_unsupervised_cnn.py,cuda,47.04505944252014,"(0.625, 0.6)","(48, 20)",TwoLayerConvNetwork_LIF,25,8,"[0.0001, 0.01]",35x35x2-8c35,22.5,120,0.0,1.0,245.0,"['ToVoxelGrid(sensor_size=(35,35,2),n_time_bins=100)']"
29,27 12 2021 14:18:05,pokerdvs_unsupervised_cnn.py,cuda,46.82793426513672,"(0.6666666666666666, 0.6)","(48, 20)",TwoLayerConvNetwork_LIF,25,8,"[0.0001, 0.01]",35x35x2-8c35,22.5,120,0.0,1.0,245.0,"['ToVoxelGrid(sensor_size=(35,35,2),n_time_bins=100)']"
30,27 12 2021 14:19:23,pokerdvs_unsupervised_cnn.py,cuda,59.28101086616516,"(0.6875, 0.6)","(48, 20)",TwoLayerConvNetwork_LIF,25,8,"[0.0001, 0.01]",35x35x2-12c35,22.5,120,0.0,1.0,245.0,"['ToVoxelGrid(sensor_size=(35,35,2),n_time_bins=100)']"
31,27 12 2021 14:21:29,pokerdvs_unsupervised_cnn.py,cuda,59.05268836021423,"(0.5833333333333334, 0.6)","(48, 20)",TwoLayerConvNetwork_LIF,25,8,"[0.0001, 0.01]",35x35x2-12c35,22.5,120,0.0,1.0,245.0,"['ToVoxelGrid(sensor_size=(35,35,2),n_time_bins=100)']"
32,27 12 2021 14:23:04,pokerdvs_unsupervised_cnn.py,cuda,59.65651750564575,"(0.6041666666666666, 0.6)","(48, 20)",TwoLayerConvNetwork_LIF,25,8,"[0.0001, 0.01]",35x35x2-12c35,22.5,120,0.0,1.0,245.0,"['ToVoxelGrid(sensor_size=(35,35,2),n_time_bins=100)']"
33,27 12 2021 14:24:17,pokerdvs_unsupervised_cnn.py,cuda,44.01224899291992,"(0.6875, 0.8)","(48, 20)",TwoLayerConvNetwork_LIF,25,8,"[0.0001, 0.01]",35x35x2-12c35,22.5,120,0.0,1.0,245.0,"['ToVoxelGrid(sensor_size=(35,35,2),n_time_bins=10)']"
34,27 12 2021 14:25:41,pokerdvs_unsupervised_cnn.py,cuda,55.63863205909729,"(0.25, 0.25)","(48, 20)",TwoLayerConvNetwork_LIF,25,8,"[0.0001, 0.01]",35x35x2-12c35,22.5,120,0.0,1.0,245.0,"['Denoise(filter_time=1)', 'ToVoxelGrid(sensor_size=(35,35,2),n_time_bins=10)']"
35,27 12 2021 14:26:43,pokerdvs_unsupervised_cnn.py,cuda,44.88387703895569,"(0.6666666666666666, 0.75)","(48, 20)",TwoLayerConvNetwork_LIF,25,8,"[0.0001, 0.01]",35x35x2-12c35,22.5,120,0.0,1.0,245.0,"['Downsample(time_factor=0.001,spatial_factor=1)', 'ToVoxelGrid(sensor_size=(35,35,2),n_time_bins=10)']"
36,27 12 2021 14:27:55,pokerdvs_unsupervised_cnn.py,cuda,54.00655508041382,"(0.7291666666666666, 0.7)","(48, 20)",TwoLayerConvNetwork_LIF,25,8,"[0.0001, 0.01]",35x35x2-12c35,22.5,120,0.0,1.0,245.0,"['Downsample(time_factor=0.001,spatial_factor=1)', 'Denoise(filter_time=10)', 'ToVoxelGrid(sensor_size=(35,35,2),n_time_bins=10)']"
37,27 12 2021 14:29:07,pokerdvs_unsupervised_cnn.py,cuda,55.60953378677368,"(0.2916666666666667, 0.15)","(48, 20)",TwoLayerConvNetwork_LIF,25,8,"[0.0001, 0.01]",35x35x2-12c35,22.5,120,0.0,1.0,245.0,"['Denoise(filter_time=10)', 'ToVoxelGrid(sensor_size=(35,35,2),n_time_bins=10)']"
38,27 12 2021 14:31:18,pokerdvs_unsupervised_cnn.py,cuda,91.31602263450623,"(0.6666666666666666, 0.75)","(48, 20)",TwoLayerConvNetwork_LIF,25,8,"[0.0001, 0.01]",35x35x2-25c35,22.5,120,0.0,1.0,245.0,"['Denoise(filter_time=100)', 'ToVoxelGrid(sensor_size=(35,35,2),n_time_bins=10)']"
39,27 12 2021 14:33:41,pokerdvs_unsupervised_cnn.py,cuda,123.63038444519043,"(0.5625, 0.55)","(48, 20)",TwoLayerConvNetwork_LIF,25,8,"[0.0001, 0.01]",35x35x2-25c35,22.5,120,0.0,1.0,245.0,"['ToVoxelGrid(sensor_size=(35,35,2),n_time_bins=200)']"
40,27 12 2021 14:35:05,pokerdvs_unsupervised_cnn.py,cuda,58.77705931663513,"(0.625, 0.65)","(48, 20)",TwoLayerConvNetwork_LIF,25,8,"[0.0001, 0.01]",35x35x2-16c35,22.5,120,0.0,1.0,245.0,"['ToVoxelGrid(sensor_size=(35,35,2),n_time_bins=25)']"
41,27 12 2021 14:44:46,pokerdvs_unsupervised_cnn.py,cuda,60.13765072822571,"(0.5, 0.5)","(48, 20)",TwoLayerConvNetwork_LIF,25,8,"[0.0001, 0.01]",35x35x2-16c35,22.5,120,0.0,1.0,490.0,"['Downsample(time_factor=0.001,spatial_factor=1)', 'ToFrame(sensor_size=(35,35,2),time_window=1,event_count=None,n_time_bins=None,n_event_bins=None,overlap=0,include_incomplete=False)']"
42,27 12 2021 14:47:29,pokerdvs_unsupervised_cnn.py,cuda,83.84707856178284,"(0.5416666666666666, 0.5)","(48, 20)",TwoLayerConvNetwork_LIF,25,8,"[0.0001, 0.01]",35x35x2-25c35,22.5,120,0.0,1.0,490.0,"['Downsample(time_factor=0.001,spatial_factor=1)', 'ToFrame(sensor_size=(35,35,2),time_window=1,event_count=None,n_time_bins=None,n_event_bins=None,overlap=0,include_incomplete=False)']"
43,28 12 2021 11:11:32,pokerdvs_unsupervised_cnn.py,cuda,65.01465511322021,"(0.3125, 0.25)","(48, 20)",TwoLayerConvNetwork_LIF,25,8,"[0.0001, 0.01]",2450-8c35,22.5,120,0.0,1.0,490.0,"['Downsample(time_factor=0.001,spatial_factor=1)', 'ToFrame(sensor_size=(35,35,2),time_window=1,event_count=None,n_time_bins=None,n_event_bins=None,overlap=0,include_incomplete=False)']"
44,28 12 2021 11:13:16,pokerdvs_unsupervised_cnn.py,cuda,28.148642539978027,"(0.25, 0.25)","(48, 20)",TwoLayerConvNetwork_LIF,25,8,"[0.0001, 0.01]",2450-8c35,22.5,120,0.0,1.0,490.0,"['Downsample(time_factor=0.001,spatial_factor=1)', 'ToFrame(sensor_size=(35,35,2),time_window=1,event_count=None,n_time_bins=None,n_event_bins=None,overlap=0,include_incomplete=False)']"
45,28 12 2021 11:14:33,pokerdvs_unsupervised_cnn.py,cuda,26.187803268432617,"(0.25, 0.25)","(48, 20)",TwoLayerConvNetwork_LIF,25,8,"[0.0001, 0.01]",2450-8c35,22.5,120,0.0,1.0,490.0,"['Downsample(time_factor=0.001,spatial_factor=1)', 'ToFrame(sensor_size=(35,35,2),time_window=1,event_count=None,n_time_bins=None,n_event_bins=None,overlap=0,include_incomplete=False)']"
46,28 12 2021 11:16:07,pokerdvs_unsupervised_cnn.py,cuda,15.930828332901001,"(0.2708333333333333, 0.3)","(48, 20)",TwoLayerConvNetwork_LIF,25,8,"[0.0001, 0.01]",2450-8c35,22.5,120,0.0,1.0,490.0,"['Downsample(time_factor=0.001,spatial_factor=1)', 'ToFrame(sensor_size=(35,35,2),time_window=1,event_count=None,n_time_bins=None,n_event_bins=None,overlap=0,include_incomplete=False)']"
47,28 12 2021 11:16:49,pokerdvs_unsupervised_cnn.py,cuda,15.909899234771729,"(0.25, 0.25)","(48, 20)",TwoLayerConvNetwork_LIF,25,8,"[0.0001, 0.01]",2450-8c35,22.5,120,0.0,1.0,490.0,"['Downsample(time_factor=0.001,spatial_factor=1)', 'ToFrame(sensor_size=(35,35,2),time_window=1,event_count=None,n_time_bins=None,n_event_bins=None,overlap=0,include_incomplete=False)']"
48,28 12 2021 11:18:14,pokerdvs_unsupervised_cnn.py,cuda,16.138017416000366,"(0.2708333333333333, 0.2)","(48, 20)",TwoLayerConvNetwork_LIF,25,8,"[0.0001, 0.01]",1225-8c35,22.5,120,0.0,1.0,245.0,"['ToVoxelGrid(sensor_size=(35,35,2),n_time_bins=25)']"
49,28 12 2021 11:19:21,pokerdvs_unsupervised_cnn.py,cuda,16.36421847343445,"(0.25, 0.25)","(48, 20)",TwoLayerConvNetwork_LIF,25,8,"[0.0001, 0.01]",1225-8c35,22.5,120,0.0,1.0,245.0,"['ToVoxelGrid(sensor_size=(35,35,2),n_time_bins=25)']"
50,28 12 2021 12:51:37,pokerdvs_unsupervised_cnn.py,cuda,113.48289084434509,"(3.875, 0.25)","(48, 20)",TwoLayerConvNetwork_LIF,25,1,"[0.0001, 0.01]",2450-8c16,22.5,120,0.0,1.0,490.0,"['Downsample(time_factor=0.001,spatial_factor=1)', 'ToFrame(sensor_size=(35,35,2),time_window=1,event_count=None,n_time_bins=None,n_event_bins=None,overlap=0,include_incomplete=False)']"
51,28 12 2021 13:24:29,pokerdvs_unsupervised_cnn.py,cuda,21.848783493041992,"(0.25, 0.25)","(48, 20)",TwoLayerConvNetwork_LIF,25,8,"[0.0001, 0.01]",2450-8c16,22.5,120,0.0,1.0,490.0,"['Downsample(time_factor=0.001,spatial_factor=1)', 'ToFrame(sensor_size=(35,35,2),time_window=1,event_count=None,n_time_bins=None,n_event_bins=None,overlap=0,include_incomplete=False)']"
52,28 12 2021 13:25:44,pokerdvs_unsupervised_cnn.py,cuda,19.777313470840454,"(0.25, 0.25)","(48, 20)",TwoLayerConvNetwork_LIF,25,8,"[0.0001, 0.01]",2450-8c16,22.5,120,0.0,1.0,490.0,"['Downsample(time_factor=0.001,spatial_factor=1)', 'ToFrame(sensor_size=(35,35,2),time_window=1,event_count=None,n_time_bins=None,n_event_bins=None,overlap=0,include_incomplete=False)']"
53,28 12 2021 13:28:30,pokerdvs_unsupervised_cnn.py,cuda,23.13717818260193,"(0.25, 0.25)","(48, 20)",TwoLayerConvNetwork_LIF,25,8,"[0.0001, 0.01]",2450-8c16,22.5,120,0.0,1.0,490.0,"['Downsample(time_factor=0.001,spatial_factor=1)', 'ToFrame(sensor_size=(35,35,2),time_window=1,event_count=None,n_time_bins=None,n_event_bins=None,overlap=0,include_incomplete=False)']"
54,28 12 2021 13:29:16,pokerdvs_unsupervised_cnn.py,cuda,24.389402151107788,"(0.25, 0.25)","(48, 20)",TwoLayerConvNetwork_LIF,25,8,"[0.0001, 0.01]",2450-8c16,22.5,120,0.0,1.0,490.0,"['Downsample(time_factor=0.001,spatial_factor=1)', 'ToFrame(sensor_size=(35,35,2),time_window=1,event_count=None,n_time_bins=None,n_event_bins=None,overlap=0,include_incomplete=False)']"
55,28 12 2021 13:30:11,pokerdvs_unsupervised_cnn.py,cuda,23.50639533996582,"(0.25, 0.25)","(48, 20)",TwoLayerConvNetwork_LIF,25,8,"[0.0001, 0.01]",2450-8c16,22.5,120,0.0,1.0,490.0,"['Downsample(time_factor=0.001,spatial_factor=1)', 'ToFrame(sensor_size=(35,35,2),time_window=1,event_count=None,n_time_bins=None,n_event_bins=None,overlap=0,include_incomplete=False)']"
56,28 12 2021 13:31:10,pokerdvs_unsupervised_cnn.py,cuda,23.132100820541382,"(0.25, 0.25)","(48, 20)",TwoLayerConvNetwork_LIF,25,8,"[0.0001, 0.01]",2450-8c16,22.5,120,0.0,1.0,490.0,"['Downsample(time_factor=0.001,spatial_factor=1)', 'ToFrame(sensor_size=(35,35,2),time_window=1,event_count=None,n_time_bins=None,n_event_bins=None,overlap=0,include_incomplete=False)']"
57,28 12 2021 13:31:55,pokerdvs_unsupervised_cnn.py,cuda,23.160218000411987,"(0.25, 0.25)","(48, 20)",TwoLayerConvNetwork_LIF,25,8,"[0.0001, 0.01]",2450-8c16,22.5,120,0.0,1.0,490.0,"['Downsample(time_factor=0.001,spatial_factor=1)', 'ToFrame(sensor_size=(35,35,2),time_window=1,event_count=None,n_time_bins=None,n_event_bins=None,overlap=0,include_incomplete=False)']"
58,28 12 2021 13:32:26,pokerdvs_unsupervised_cnn.py,cuda,22.818962812423706,"(0.25, 0.25)","(48, 20)",TwoLayerConvNetwork_LIF,25,8,"[0.0001, 0.01]",2450-8c16,22.5,120,0.0,1.0,490.0,"['Downsample(time_factor=0.001,spatial_factor=1)', 'ToFrame(sensor_size=(35,35,2),time_window=1,event_count=None,n_time_bins=None,n_event_bins=None,overlap=0,include_incomplete=False)']"
59,28 12 2021 13:33:00,pokerdvs_unsupervised_cnn.py,cuda,23.536682605743408,"(0.25, 0.35)","(48, 20)",TwoLayerConvNetwork_LIF,25,8,"[0.0001, 0.01]",2450-8c16,22.5,120,0.0,1.0,490.0,"['Downsample(time_factor=0.001,spatial_factor=1)', 'ToFrame(sensor_size=(35,35,2),time_window=1,event_count=None,n_time_bins=None,n_event_bins=None,overlap=0,include_incomplete=False)']"
60,28 12 2021 13:34:50,pokerdvs_unsupervised_cnn.py,cuda,22.186892986297607,"(0.25, 0.25)","(48, 20)",TwoLayerConvNetwork_LIF,25,8,"[0.0001, 0.01]",2450-8c16,22.5,120,0.0,1.0,490.0,"['Downsample(time_factor=0.001,spatial_factor=1)', 'ToFrame(sensor_size=(35,35,2),time_window=1,event_count=None,n_time_bins=None,n_event_bins=None,overlap=0,include_incomplete=False)']"
61,28 12 2021 13:35:58,pokerdvs_unsupervised_cnn.py,cuda,22.506063222885132,"(0.25, 0.25)","(48, 20)",TwoLayerConvNetwork_LIF,25,8,"[0.0001, 0.01]",2450-8c16,22.5,120,0.0,1.0,490.0,"['Downsample(time_factor=0.001,spatial_factor=1)', 'ToFrame(sensor_size=(35,35,2),time_window=1,event_count=None,n_time_bins=None,n_event_bins=None,overlap=0,include_incomplete=False)']"
62,28 12 2021 13:38:23,pokerdvs_unsupervised_cnn.py,cuda,29.025972366333008,"(0.25, 0.25)","(48, 20)",TwoLayerConvNetwork_LIF,25,8,"[0.0001, 0.01]",2450-8c16,22.5,120,0.0,1.0,490.0,"['Downsample(time_factor=0.001,spatial_factor=1)', 'ToFrame(sensor_size=(35,35,2),time_window=1,event_count=None,n_time_bins=None,n_event_bins=None,overlap=0,include_incomplete=False)']"
63,28 12 2021 13:41:39,pokerdvs_unsupervised_cnn.py,cuda,25.80242657661438,"(0.25, 0.25)","(48, 20)",TwoLayerConvNetwork_LIF,25,8,"[0.0001, 0.01]",2450-8c16,22.5,120,0.0,1.0,490.0,"['Downsample(time_factor=0.001,spatial_factor=1)', 'ToFrame(sensor_size=(35,35,2),time_window=1,event_count=None,n_time_bins=None,n_event_bins=None,overlap=0,include_incomplete=False)']"
64,28 12 2021 13:44:13,pokerdvs_unsupervised_cnn.py,cuda,27.161332845687866,"(0.2916666666666667, 0.2)","(48, 20)",TwoLayerConvNetwork_LIF,25,8,"[0.0001, 0.01]",2450-8c16,22.5,120,0.0,1.0,490.0,"['Downsample(time_factor=0.001,spatial_factor=1)', 'ToFrame(sensor_size=(35,35,2),time_window=1,event_count=None,n_time_bins=None,n_event_bins=None,overlap=0,include_incomplete=False)']"
65,28 12 2021 14:14:21,pokerdvs_unsupervised_cnn.py,cuda,30.807382345199585,"(0.25, 0.25)","(48, 20)",TwoLayerConvNetwork_LIF,25,8,"[0.0001, 0.01]",2450-8c18,22.5,120,0.0,1.0,490.0,"['Downsample(time_factor=0.001,spatial_factor=1)', 'ToFrame(sensor_size=(35,35,2),time_window=1,event_count=None,n_time_bins=None,n_event_bins=None,overlap=0,include_incomplete=False)']"
66,28 12 2021 14:15:01,pokerdvs_unsupervised_cnn.py,cuda,30.78222370147705,"(0.25, 0.25)","(48, 20)",TwoLayerConvNetwork_LIF,25,8,"[0.0001, 0.01]",2450-8c18,22.5,120,0.0,1.0,490.0,"['Downsample(time_factor=0.001,spatial_factor=1)', 'ToFrame(sensor_size=(35,35,2),time_window=1,event_count=None,n_time_bins=None,n_event_bins=None,overlap=0,include_incomplete=False)']"
67,29 12 2021 09:51:11,pokerdvs_unsupervised_cnn.py,cuda,31.729432106018066,"(0.25, 0.25)","(48, 20)",TwoLayerConvNetwork_LIF,25,8,"[0.0001, 0.01]",2450-8c18,22.5,120,0.0,1.0,490.0,"['Downsample(time_factor=0.001,spatial_factor=1)', 'ToFrame(sensor_size=(35,35,2),time_window=1,event_count=None,n_time_bins=None,n_event_bins=None,overlap=0,include_incomplete=False)']"
68,29 12 2021 09:53:10,pokerdvs_unsupervised_cnn.py,cuda,30.029085159301758,"(0.2708333333333333, 0.25)","(48, 20)",TwoLayerConvNetwork_LIF,25,8,"[0.0001, 0.01]",2450-8c18,22.5,120,0.0,1.0,490.0,"['Downsample(time_factor=0.001,spatial_factor=1)', 'ToFrame(sensor_size=(35,35,2),time_window=1,event_count=None,n_time_bins=None,n_event_bins=None,overlap=0,include_incomplete=False)']"
69,29 12 2021 09:54:05,pokerdvs_unsupervised_cnn.py,cuda,34.877639293670654,"(0.2708333333333333, 0.25)","(48, 20)",TwoLayerConvNetwork_LIF,25,8,"[0.0001, 0.01]",2450-8c18,22.5,120,0.0,1.0,490.0,"['Downsample(time_factor=0.001,spatial_factor=1)', 'ToFrame(sensor_size=(35,35,2),time_window=1,event_count=None,n_time_bins=None,n_event_bins=None,overlap=0,include_incomplete=False)']"
70,29 12 2021 09:55:04,pokerdvs_unsupervised_cnn.py,cuda,37.49768257141113,"(0.20833333333333334, 0.25)","(48, 20)",TwoLayerConvNetwork_LIF,25,8,"[0.0001, 0.01]",2450-8c16,22.5,120,0.0,1.0,490.0,"['Downsample(time_factor=0.001,spatial_factor=1)', 'ToFrame(sensor_size=(35,35,2),time_window=1,event_count=None,n_time_bins=None,n_event_bins=None,overlap=0,include_incomplete=False)']"
71,29 12 2021 11:15:36,pokerdvs_unsupervised_cnn.py,cuda,31.211719274520874,"(0.25, 0.25)","(48, 20)",TwoLayerConvNetwork_LIF,25,8,"[0.0001, 0.01]",2450-8c16,22.5,120,0.0,1.0,490.0,"['Downsample(time_factor=0.001,spatial_factor=1)', 'ToFrame(sensor_size=(35,35,2),time_window=1,event_count=None,n_time_bins=None,n_event_bins=None,overlap=0,include_incomplete=False)']"
72,29 12 2021 13:02:53,pokerdvs_unsupervised_cnn.py,cuda,34.315739154815674,"(0.1875, 0.4)","(48, 20)",TwoLayerConvNetwork_LIF,25,8,"[0.0001, 0.01]",2450-8c18,22.5,120,0.0,1.0,1225.0,"['Downsample(time_factor=0.001,spatial_factor=1)', 'ToFrame(sensor_size=(35,35,2),time_window=1,event_count=None,n_time_bins=None,n_event_bins=None,overlap=0,include_incomplete=False)']"
73,29 12 2021 13:04:47,pokerdvs_unsupervised_cnn.py,cuda,34.34445261955261,"(0.25, 0.15)","(48, 20)",TwoLayerConvNetwork_LIF,25,8,"[0.0001, 0.01]",2450-8c18,22.5,120,0.0,1.0,1225.0,"['Downsample(time_factor=0.001,spatial_factor=1)', 'ToFrame(sensor_size=(35,35,2),time_window=1,event_count=None,n_time_bins=None,n_event_bins=None,overlap=0,include_incomplete=False)']"
74,29 12 2021 13:07:41,pokerdvs_unsupervised_cnn.py,cuda,34.36567401885986,"(0.2916666666666667, 0.3)","(48, 20)",TwoLayerConvNetwork_LIF,25,8,"[0.0001, 0.01]",2450-8c18,22.5,120,0.0,1.0,1225.0,"['Downsample(time_factor=0.001,spatial_factor=1)', 'ToFrame(sensor_size=(35,35,2),time_window=1,event_count=None,n_time_bins=None,n_event_bins=None,overlap=0,include_incomplete=False)']"
75,29 12 2021 13:08:57,pokerdvs_unsupervised_cnn.py,cuda,29.306259632110596,"(0.3333333333333333, 0.3)","(48, 20)",TwoLayerConvNetwork_LIF,25,8,"[0.0001, 0.01]",2450-8c18,22.5,120,0.0,1.0,1225.0,"['Downsample(time_factor=0.001,spatial_factor=1)', 'ToFrame(sensor_size=(35,35,2),time_window=1,event_count=None,n_time_bins=None,n_event_bins=None,overlap=0,include_incomplete=False)']"
76,29 12 2021 13:28:58,pokerdvs_unsupervised_cnn.py,cuda,33.18719720840454,"(0.2708333333333333, 0.3)","(48, 20)",TwoLayerConvNetwork_LIF,25,8,"[0.0001, 0.01]",2450-8c18,22.5,120,0.0,1.0,1225.0,"['Downsample(time_factor=0.001,spatial_factor=1)', 'ToFrame(sensor_size=(35,35,2),time_window=1,event_count=None,n_time_bins=None,n_event_bins=None,overlap=0,include_incomplete=False)']"
77,29 12 2021 13:29:58,pokerdvs_unsupervised_cnn.py,cuda,33.96268916130066,"(0.22916666666666666, 0.15)","(48, 20)",TwoLayerConvNetwork_LIF,25,8,"[0.0001, 0.01]",2450-8c18,22.5,120,0.0,1.0,1225.0,"['Downsample(time_factor=0.001,spatial_factor=1)', 'ToFrame(sensor_size=(35,35,2),time_window=1,event_count=None,n_time_bins=None,n_event_bins=None,overlap=0,include_incomplete=False)']"
78,29 12 2021 13:31:16,pokerdvs_unsupervised_cnn.py,cuda,33.700475215911865,"(0.2916666666666667, 0.35)","(48, 20)",TwoLayerConvNetwork_LIF,25,8,"[0.0001, 0.01]",2450-8c18,22.5,120,0.0,1.0,1225.0,"['Downsample(time_factor=0.001,spatial_factor=1)', 'ToFrame(sensor_size=(35,35,2),time_window=1,event_count=None,n_time_bins=None,n_event_bins=None,overlap=0,include_incomplete=False)']"
79,29 12 2021 13:32:01,pokerdvs_unsupervised_cnn.py,cuda,33.994282484054565,"(0.2916666666666667, 0.35)","(48, 20)",TwoLayerConvNetwork_LIF,25,8,"[0.0001, 0.01]",2450-8c18,22.5,120,0.0,1.0,1225.0,"['Downsample(time_factor=0.001,spatial_factor=1)', 'ToFrame(sensor_size=(35,35,2),time_window=1,event_count=None,n_time_bins=None,n_event_bins=None,overlap=0,include_incomplete=False)']"
80,29 12 2021 13:32:47,pokerdvs_unsupervised_cnn.py,cuda,34.0263569355011,"(0.2708333333333333, 0.2)","(48, 20)",TwoLayerConvNetwork_LIF,25,8,"[0.0001, 0.01]",2450-8c18,22.5,120,0.0,1.0,1225.0,"['Downsample(time_factor=0.001,spatial_factor=1)', 'ToFrame(sensor_size=(35,35,2),time_window=1,event_count=None,n_time_bins=None,n_event_bins=None,overlap=0,include_incomplete=False)']"
81,29 12 2021 13:33:31,pokerdvs_unsupervised_cnn.py,cuda,33.693788051605225,"(0.16666666666666666, 0.35)","(48, 20)",TwoLayerConvNetwork_LIF,25,8,"[0.0001, 0.01]",2450-8c18,22.5,120,0.0,1.0,1225.0,"['Downsample(time_factor=0.001,spatial_factor=1)', 'ToFrame(sensor_size=(35,35,2),time_window=1,event_count=None,n_time_bins=None,n_event_bins=None,overlap=0,include_incomplete=False)']"
82,29 12 2021 13:34:53,pokerdvs_unsupervised_cnn.py,cuda,33.714242458343506,"(0.22916666666666666, 0.3)","(48, 20)",TwoLayerConvNetwork_LIF,25,8,"[0.0001, 0.01]",2450-8c18,22.5,120,0.0,1.0,1225.0,"['Downsample(time_factor=0.001,spatial_factor=1)', 'ToFrame(sensor_size=(35,35,2),time_window=1,event_count=None,n_time_bins=None,n_event_bins=None,overlap=0,include_incomplete=False)']"
83,29 12 2021 13:37:43,pokerdvs_unsupervised_cnn.py,cuda,38.00796580314636,"(0.16666666666666666, 0.2)","(48, 20)",TwoLayerConvNetwork_LIF,25,8,"[0.0001, 0.01]",2450-8c18,22.5,120,0.0,1.0,1225.0,"['Downsample(time_factor=0.001,spatial_factor=1)', 'ToFrame(sensor_size=(35,35,2),time_window=1,event_count=None,n_time_bins=None,n_event_bins=None,overlap=0,include_incomplete=False)']"
84,29 12 2021 13:38:56,pokerdvs_unsupervised_cnn.py,cuda,35.68753671646118,"(0.20833333333333334, 0.2)","(48, 20)",TwoLayerConvNetwork_LIF,25,8,"[0.0001, 0.01]",2450-8c18,22.5,120,0.0,1.0,1225.0,"['Downsample(time_factor=0.001,spatial_factor=1)', 'ToFrame(sensor_size=(35,35,2),time_window=1,event_count=None,n_time_bins=None,n_event_bins=None,overlap=0,include_incomplete=False)']"
85,29 12 2021 13:39:44,pokerdvs_unsupervised_cnn.py,cuda,35.74118709564209,"(0.3333333333333333, 0.15)","(48, 20)",TwoLayerConvNetwork_LIF,25,8,"[0.0001, 0.01]",2450-8c18,22.5,120,0.0,1.0,1225.0,"['Downsample(time_factor=0.001,spatial_factor=1)', 'ToFrame(sensor_size=(35,35,2),time_window=1,event_count=None,n_time_bins=None,n_event_bins=None,overlap=0,include_incomplete=False)']"
86,29 12 2021 13:40:35,pokerdvs_unsupervised_cnn.py,cuda,38.78984522819519,"(0.20833333333333334, 0.25)","(48, 20)",TwoLayerConvNetwork_LIF,25,8,"[0.0001, 0.01]",2450-8c18,22.5,120,0.0,1.0,1225.0,"['Downsample(time_factor=0.001,spatial_factor=1)', 'ToFrame(sensor_size=(35,35,2),time_window=1,event_count=None,n_time_bins=None,n_event_bins=None,overlap=0,include_incomplete=False)']"
87,29 12 2021 13:41:26,pokerdvs_unsupervised_cnn.py,cuda,36.60610365867615,"(0.125, 0.15)","(48, 20)",TwoLayerConvNetwork_LIF,25,8,"[0.0001, 0.01]",2450-8c18,22.5,120,0.0,1.0,1225.0,"['Downsample(time_factor=0.001,spatial_factor=1)', 'ToFrame(sensor_size=(35,35,2),time_window=1,event_count=None,n_time_bins=None,n_event_bins=None,overlap=0,include_incomplete=False)']"
88,29 12 2021 13:54:42,pokerdvs_unsupervised_cnn.py,cuda,35.70940327644348,"(0.3333333333333333, 0.25)","(48, 20)",TwoLayerConvNetwork_LIF,25,8,"[0.0001, 0.01]",2450-8c18,22.5,120,0.0,1.0,1225.0,"['Downsample(time_factor=0.001,spatial_factor=1)', 'ToFrame(sensor_size=(35,35,2),time_window=1,event_count=None,n_time_bins=None,n_event_bins=None,overlap=0,include_incomplete=False)']"
89,29 12 2021 14:00:33,pokerdvs_unsupervised_cnn.py,cuda,36.82784676551819,"(0.4375, 0.3)","(48, 20)",TwoLayerConvNetwork_LIF,25,8,"[0.0001, 0.01]",2450-8c18,22.5,120,0.0,1.0,1225.0,"['Downsample(time_factor=0.001,spatial_factor=1)', 'ToFrame(sensor_size=(35,35,2),time_window=1,event_count=None,n_time_bins=None,n_event_bins=None,overlap=0,include_incomplete=False)']"
90,29 12 2021 14:01:22,pokerdvs_unsupervised_cnn.py,cuda,36.49200081825256,"(0.22916666666666666, 0.25)","(48, 20)",TwoLayerConvNetwork_LIF,25,8,"[0.0001, 0.01]",2450-8c18,22.5,120,0.0,1.0,1225.0,"['Downsample(time_factor=0.001,spatial_factor=1)', 'ToFrame(sensor_size=(35,35,2),time_window=1,event_count=None,n_time_bins=None,n_event_bins=None,overlap=0,include_incomplete=False)']"
91,29 12 2021 14:02:08,pokerdvs_unsupervised_cnn.py,cuda,36.46425008773804,"(0.3333333333333333, 0.4)","(48, 20)",TwoLayerConvNetwork_LIF,25,8,"[0.0001, 0.01]",2450-8c18,22.5,120,0.0,1.0,1225.0,"['Downsample(time_factor=0.001,spatial_factor=1)', 'ToFrame(sensor_size=(35,35,2),time_window=1,event_count=None,n_time_bins=None,n_event_bins=None,overlap=0,include_incomplete=False)']"
92,29 12 2021 14:02:59,pokerdvs_unsupervised_cnn.py,cuda,36.5794460773468,"(0.3125, 0.2)","(48, 20)",TwoLayerConvNetwork_LIF,25,8,"[0.0001, 0.01]",2450-8c18,22.5,120,0.0,1.0,1225.0,"['Downsample(time_factor=0.001,spatial_factor=1)', 'ToFrame(sensor_size=(35,35,2),time_window=1,event_count=None,n_time_bins=None,n_event_bins=None,overlap=0,include_incomplete=False)']"
93,29 12 2021 14:03:48,pokerdvs_unsupervised_cnn.py,cuda,36.81715250015259,"(0.1875, 0.25)","(48, 20)",TwoLayerConvNetwork_LIF,25,8,"[0.0001, 0.01]",2450-8c18,22.5,120,0.0,1.0,1225.0,"['Downsample(time_factor=0.001,spatial_factor=1)', 'ToFrame(sensor_size=(35,35,2),time_window=1,event_count=None,n_time_bins=None,n_event_bins=None,overlap=0,include_incomplete=False)']"
94,29 12 2021 14:04:34,pokerdvs_unsupervised_cnn.py,cuda,21.44696545600891,"(0.2708333333333333, 0.25)","(48, 20)",TwoLayerConvNetwork_LIF,25,8,"[0.0001, 0.01]",2450-8c18,22.5,120,0.0,1.0,1225.0,"['Downsample(time_factor=0.001,spatial_factor=1)', 'ToFrame(sensor_size=(35,35,2),time_window=10,event_count=None,n_time_bins=None,n_event_bins=None,overlap=0,include_incomplete=False)']"
95,29 12 2021 14:08:31,pokerdvs_unsupervised_cnn.py,cuda,138.15677046775818,"(0.20833333333333334, 0.2)","(48, 20)",TwoLayerConvNetwork_LIF,25,8,"[0.0001, 0.01]",2450-8c18,22.5,120,0.0,1.0,1225.0,"['Downsample(time_factor=0.001,spatial_factor=1)', 'ToFrame(sensor_size=(35,35,2),time_window=None,event_count=25,n_time_bins=None,n_event_bins=None,overlap=0,include_incomplete=False)']"
96,29 12 2021 14:10:56,pokerdvs_unsupervised_cnn.py,cuda,131.70873498916626,"(0.25, 0.25)","(48, 20)",TwoLayerConvNetwork_LIF,25,8,"[0.0001, 0.01]",2450-8c18,22.5,120,0.0,1.0,1225.0,"['Downsample(time_factor=0.001,spatial_factor=1)', 'ToFrame(sensor_size=(35,35,2),time_window=None,event_count=25,n_time_bins=None,n_event_bins=None,overlap=0,include_incomplete=False)']"
97,29 12 2021 14:13:24,pokerdvs_unsupervised_cnn.py,cuda,129.6411588191986,"(0.25, 0.25)","(48, 20)",TwoLayerConvNetwork_LIF,25,8,"[0.0001, 0.01]",2450-8c18,22.5,120,0.0,1.0,1225.0,"['Downsample(time_factor=0.001,spatial_factor=1)', 'ToFrame(sensor_size=(35,35,2),time_window=None,event_count=25,n_time_bins=None,n_event_bins=None,overlap=0,include_incomplete=False)']"
98,29 12 2021 14:17:19,pokerdvs_unsupervised_cnn.py,cuda,134.42309975624084,"(0.25, 0.25)","(48, 20)",TwoLayerConvNetwork_LIF,25,8,"[0.0001, 0.01]",2450-8c18,22.5,120,0.0,1.0,1225.0,"['Downsample(time_factor=0.001,spatial_factor=1)', 'ToFrame(sensor_size=(35,35,2),time_window=None,event_count=25,n_time_bins=None,n_event_bins=None,overlap=0,include_incomplete=False)']"
99,29 12 2021 14:24:08,pokerdvs_unsupervised_cnn.py,cuda,131.60574316978455,"(0.25, 0.25)","(48, 20)",TwoLayerConvNetwork_LIF,25,8,"[0.0001, 0.01]",2450-8c18,22.5,120,0.0,1.0,1225.0,"['Downsample(time_factor=0.001,spatial_factor=1)', 'ToFrame(sensor_size=(35,35,2),time_window=None,event_count=25,n_time_bins=None,n_event_bins=None,overlap=0,include_incomplete=False)']"
100,29 12 2021 16:49:14,pokerdvs_unsupervised_cnn.py,cuda,64.4790415763855,"(0.25, 0.25)","(48, 20)",TwoLayerConvNetwork_LIF,25,8,"[0.0001, 0.01]",2450-25c7,22.5,120,0.0,1.0,1225.0,"['Downsample(time_factor=0.001,spatial_factor=1)', 'ToFrame(sensor_size=(35,35,2),time_window=None,event_count=25,n_time_bins=None,n_event_bins=None,overlap=0,include_incomplete=False)']"
101,31 12 2021 13:07:11,pokerdvs_unsupervised_cnn.py,cuda,25.346076488494873,"(0.3333333333333333, 0.35)","(48, 20)",TwoLayerConvNetwork_Izhi,25,8,"[0.0001, 0.01]",2450-25c7,22.5,120,0.0,1.0,1225.0,"['Downsample(time_factor=0.001,spatial_factor=1)', 'ToFrame(sensor_size=(35,35,2),time_window=1,event_count=None,n_time_bins=None,n_event_bins=None,overlap=0,include_incomplete=False)']"
102,31 12 2021 13:09:40,pokerdvs_unsupervised_cnn.py,cuda,23.113214015960693,"(0.2916666666666667, 0.25)","(48, 20)",TwoLayerConvNetwork_Izhi,25,8,"[0.0001, 0.01]",2450-25c7,22.5,120,0.0,1.0,1225.0,"['Downsample(time_factor=0.001,spatial_factor=1)', 'ToFrame(sensor_size=(35,35,2),time_window=1,event_count=None,n_time_bins=None,n_event_bins=None,overlap=0,include_incomplete=False)']"
103,31 12 2021 13:10:23,pokerdvs_unsupervised_cnn.py,cuda,22.06338381767273,"(0.3333333333333333, 0.3)","(48, 20)",TwoLayerConvNetwork_Izhi,25,8,"[0.0001, 0.01]",2450-25c7,22.5,120,0.0,1.0,1225.0,"['Downsample(time_factor=0.001,spatial_factor=1)', 'ToFrame(sensor_size=(35,35,2),time_window=1,event_count=None,n_time_bins=None,n_event_bins=None,overlap=0,include_incomplete=False)']"
104,31 12 2021 13:12:43,pokerdvs_unsupervised_cnn.py,cuda,43.55804753303528,"(0.3541666666666667, 0.25)","(48, 20)",TwoLayerConvNetwork_Izhi,50,8,"[0.0001, 0.01]",2450-25c7,22.5,120,0.0,1.0,1225.0,"['Downsample(time_factor=0.001,spatial_factor=1)', 'ToFrame(sensor_size=(35,35,2),time_window=1,event_count=None,n_time_bins=None,n_event_bins=None,overlap=0,include_incomplete=False)']"
105,7 3 2022 17:50:10,pokerdvs_unsupervised.py,cpu,213.2404420375824,"(0.4791666666666667, 0.5)","(48, 20)",DiehlAndCook2015,25,8,"[0.0001, 0.01]",100,22.5,120,0.0,1.0,490.0,"['Downsample(time_factor=0.001,spatial_factor=1)', 'ToFrame(sensor_size=(35,35,2),time_window=None,event_count=10,n_time_bins=None,n_event_bins=None,overlap=0,include_incomplete=False)']"
106,7 3 2022 18:00:16,pokerdvs_unsupervised.py,cpu,386.50482416152954,"(0.7291666666666666, 0.45)","(48, 20)",DiehlAndCook2015,25,8,"[0.0001, 0.01]",100,22.5,120,0.0,1.0,245.0,"['Downsample(time_factor=0.001,spatial_factor=1)', 'ToFrame(sensor_size=(35,35,2),time_window=None,event_count=5,n_time_bins=None,n_event_bins=None,overlap=0,include_incomplete=False)']"
107,7 3 2022 18:01:44,pokerdvs_unsupervised.py,cpu,59.50901794433594,"(0.8333333333333334, 0.75)","(48, 20)",DiehlAndCook2015,25,8,"[0.0001, 0.01]",100,22.5,120,0.0,1.0,245.0,"['Downsample(time_factor=0.001,spatial_factor=1)', 'ToFrame(sensor_size=(35,35,2),time_window=None,event_count=None,n_time_bins=None,n_event_bins=100,overlap=0,include_incomplete=False)']"
108,7 3 2022 18:04:03,pokerdvs_unsupervised.py,cpu,122.17359685897827,"(0.8125, 0.55)","(48, 20)",DiehlAndCook2015,25,8,"[0.0001, 0.01]",100,22.5,120,0.0,1.0,245.0,"['Downsample(time_factor=0.001,spatial_factor=1)', 'ToFrame(sensor_size=(35,35,2),time_window=None,event_count=None,n_time_bins=None,n_event_bins=250,overlap=0,include_incomplete=False)']"
109,7 3 2022 18:04:41,pokerdvs_unsupervised.py,cpu,29.94580912590027,"(0.8125, 0.8)","(48, 20)",DiehlAndCook2015,25,8,"[0.0001, 0.01]",100,22.5,120,0.0,1.0,245.0,"['Downsample(time_factor=0.001,spatial_factor=1)', 'ToFrame(sensor_size=(35,35,2),time_window=None,event_count=None,n_time_bins=None,n_event_bins=50,overlap=0,include_incomplete=False)']"
110,7 3 2022 18:05:17,pokerdvs_unsupervised.py,cpu,17.409854412078857,"(0.5208333333333334, 0.65)","(48, 20)",DiehlAndCook2015,25,8,"[0.0001, 0.01]",100,22.5,120,0.0,1.0,245.0,"['Downsample(time_factor=0.001,spatial_factor=1)', 'ToFrame(sensor_size=(35,35,2),time_window=None,event_count=None,n_time_bins=None,n_event_bins=25,overlap=0,include_incomplete=False)']"
111,7 3 2022 18:06:13,pokerdvs_unsupervised.py,cpu,41.15823674201965,"(0.7708333333333334, 0.75)","(48, 20)",DiehlAndCook2015,25,8,"[0.0001, 0.01]",100,22.5,120,0.0,1.0,245.0,"['Downsample(time_factor=0.001,spatial_factor=1)', 'ToFrame(sensor_size=(35,35,2),time_window=None,event_count=None,n_time_bins=None,n_event_bins=75,overlap=0,include_incomplete=False)']"
112,7 3 2022 18:08:16,pokerdvs_unsupervised.py,cpu,33.89818096160889,"(0.7291666666666666, 0.75)","(48, 20)",DiehlAndCook2015,25,8,"[0.0001, 0.01]",100,22.5,120,0.0,1.0,245.0,"['Downsample(time_factor=0.001,spatial_factor=1)', 'ToFrame(sensor_size=(35,35,2),time_window=None,event_count=None,n_time_bins=None,n_event_bins=50,overlap=0,include_incomplete=False)']"
113,7 3 2022 18:09:15,pokerdvs_unsupervised.py,cpu,33.538660764694214,"(0.7083333333333334, 0.8)","(48, 20)",DiehlAndCook2015,25,8,"[0.0001, 0.01]",100,22.5,120,0.0,1.0,245.0,"['Downsample(time_factor=0.001,spatial_factor=1)', 'ToFrame(sensor_size=(35,35,2),time_window=None,event_count=None,n_time_bins=None,n_event_bins=50,overlap=0,include_incomplete=False)']"
114,7 3 2022 18:10:00,pokerdvs_unsupervised.py,cpu,33.44829225540161,"(0.625, 0.65)","(48, 20)",DiehlAndCook2015,25,8,"[0.0001, 0.01]",100,22.5,120,0.0,1.0,245.0,"['Downsample(time_factor=0.001,spatial_factor=1)', 'ToFrame(sensor_size=(35,35,2),time_window=None,event_count=None,n_time_bins=None,n_event_bins=50,overlap=0,include_incomplete=False)']"
115,7 3 2022 18:10:58,pokerdvs_unsupervised.py,cpu,30.318393230438232,"(0.7708333333333334, 0.75)","(48, 20)",DiehlAndCook2015,25,8,"[0.0001, 0.01]",100,22.5,120,0.0,1.0,245.0,"['Downsample(time_factor=0.001,spatial_factor=1)', 'ToFrame(sensor_size=(35,35,2),time_window=None,event_count=None,n_time_bins=None,n_event_bins=50,overlap=0,include_incomplete=False)']"
116,7 3 2022 18:11:37,pokerdvs_unsupervised.py,cpu,30.075145483016968,"(0.8125, 0.8)","(48, 20)",DiehlAndCook2015,25,8,"[0.0001, 0.01]",100,22.5,120,0.0,1.0,245.0,"['Downsample(time_factor=0.001,spatial_factor=1)', 'ToFrame(sensor_size=(35,35,2),time_window=None,event_count=None,n_time_bins=None,n_event_bins=50,overlap=0,include_incomplete=False)']"
117,7 3 2022 18:12:27,pokerdvs_unsupervised.py,cpu,31.835509777069092,"(0.7291666666666666, 0.75)","(48, 20)",DiehlAndCook2015,25,8,"[0.0001, 0.01]",100,22.5,120,0.0,1.0,122.5,"['Downsample(time_factor=0.001,spatial_factor=1)', 'ToFrame(sensor_size=(35,35,2),time_window=None,event_count=None,n_time_bins=None,n_event_bins=50,overlap=0,include_incomplete=False)']"
118,7 3 2022 18:15:45,pokerdvs_unsupervised.py,cpu,30.221945762634277,"(0.5833333333333334, 0.55)","(48, 20)",DiehlAndCook2015,25,8,"[0.0001, 0.01]",100,22.5,120,0.0,1.0,490.0,"['Downsample(time_factor=0.001,spatial_factor=1)', 'ToFrame(sensor_size=(35,35,2),time_window=None,event_count=None,n_time_bins=None,n_event_bins=50,overlap=0,include_incomplete=False)']"
119,7 3 2022 18:16:50,pokerdvs_unsupervised.py,cpu,30.29062294960022,"(0.4375, 0.35)","(48, 20)",DiehlAndCook2015,25,8,"[0.0001, 0.01]",100,22.5,17.5,0.0,1.0,245.0,"['Downsample(time_factor=0.001,spatial_factor=1)', 'ToFrame(sensor_size=(35,35,2),time_window=None,event_count=None,n_time_bins=None,n_event_bins=50,overlap=0,include_incomplete=False)']"
120,7 3 2022 18:17:29,pokerdvs_unsupervised.py,cpu,29.652735233306885,"(0.6666666666666666, 0.8)","(48, 20)",DiehlAndCook2015,25,8,"[0.0001, 0.01]",100,22.5,150,0.0,1.0,245.0,"['Downsample(time_factor=0.001,spatial_factor=1)', 'ToFrame(sensor_size=(35,35,2),time_window=None,event_count=None,n_time_bins=None,n_event_bins=50,overlap=0,include_incomplete=False)']"
