Epoch Train Test
0 0.8199880123138428 0.916015625
1 0.9280151724815369 0.9375
2 0.9507787227630615 0.94140625
3 0.9626597166061401 0.9501953125
4 0.9717451930046082 0.9482421875
5 0.9752395749092102 0.9501953125
6 0.9802315831184387 0.951171875
7 0.9831269979476929 0.9521484375
8 0.9858226776123047 0.95703125
9 0.9875199794769287 0.95703125
