n, date, filename, device, runtime," accuracy (train, test)"," loss (train, test)", epochs, batch_size, lr, layers, method, alpha, a, b, c, d, bias, tau_inv, v_th, transform
0,7 12 2021 08:38:55,shd_izhi_1l.py,cuda,54.50947570800781,"(0.0517578125, 0.0546875)","(2.9957327842712402, 2.9957327842712402)",1,128,0.002,100,super,80,0.01,0.5,-50,8,150,250,30,None
1,7 12 2021 08:44:13,shd_izhi_1l.py,cuda,55.504441261291504,"(0.0419921875, 0.05078125)","(2.9957327842712402, 2.9957327842712402)",1,128,0.002,100,super,100,0.01,0.2,-40,8,150,250,20,None
2,7 12 2021 08:50:32,shd_izhi_2l.py,cuda,55.92968964576721,"(0.0546875, 0.0)","(2.9957327842712402, 2.9957327842712402)",5,128,0.002,"(100, 100)",super,100,0.02,0.25,-65,8,140,250,30,None
3,7 12 2021 09:22:50,shd_izhi_rec.py,cuda,326.77151441574097,"(0.0478515625, 0.05078125)","(2.9957327842712402, 2.9957327842712402)",5,128,0.002,100,super,100,0.02,0.25,-50,8,140,250,30,None
4,27 12 2021 10:57:04,shd_izhi_1l.py,cuda,132.91091966629028,"(0.056640625, 0.046875)","(5.2659613490104675, 6.238996148109436)",2,128,0.002,100,super,100,0.01,0.2,-40,8,150,250,40,None
5,27 12 2021 11:08:16,shd_izhi_1l.py,cuda,641.218964099884,"(0.1162109375, 0.126953125)","(4.432334065437317, 5.113529086112976)",10,128,0.002,100,super,50,0.01,0.2,-55,8,150,250,40,None
