n, date, filename, device, runtime," accuracy (train, test)"," loss (train, test)", epochs, batch_size, opt, layers, alpha, beta, v_th, slope, first saccade only, loss function, spike gradient, transform
0,7 12 2021 13:37:28,nmnist_lif_1l.py,cuda,333.4327943325043,"(0.971640625, 0.95)","(1.577259806394577, 0.012500969134271145)",5,128,0.002,100,0.9,0.6,1.0,25,True,ce_rate_loss,fast_sigmoid,"['Downsample(time_factor=0.001,spatial_factor=1)', 'ToFrame(sensor_size=(34,34,2),time_window=1,event_count=None,n_time_bins=None,n_event_bins=None,overlap=0,include_incomplete=True)']"
1,7 12 2021 13:51:09,nmnist_lif_2l.py,cuda,362.83551812171936,"(0.972578125, 0.95859375)","(1.5774506831169128, 0.012443480826914311)",5,128,0.002,"(100, 100)",0.9,0.6,1.0,25,True,ce_rate_loss,fast_sigmoid,"['Downsample(time_factor=0.001,spatial_factor=1)', 'ToFrame(sensor_size=(34,34,2),time_window=1,event_count=None,n_time_bins=None,n_event_bins=None,overlap=0,include_incomplete=True)']"
2,7 12 2021 13:58:28,nmnist_lif_3l.py,cuda,409.91091871261597,"(0.953046875, 0.94453125)","(1.6172156488895417, 0.012695015128701925)",5,128,0.002,"(100, 100, 100)",0.9,0.6,1.0,25,True,ce_rate_loss,fast_sigmoid,"['Downsample(time_factor=0.001,spatial_factor=1)', 'ToFrame(sensor_size=(34,34,2),time_window=1,event_count=None,n_time_bins=None,n_event_bins=None,overlap=0,include_incomplete=True)']"
3,7 12 2021 14:09:29,nmnist_lif_cnn.py,cuda,73.05990362167358,"(0.78, 0.81015625)","(1.8694955062866212, 0.014266879344359041)",2,128,0.002,34x34x2-8c3-2p-16c3-2p-32c3-2048-10,0.9,0.6,1.0,25,True,ce_rate_loss,fast_sigmoid,"['Downsample(time_factor=0.001,spatial_factor=1)', 'ToFrame(sensor_size=(34,34,2),time_window=10,event_count=None,n_time_bins=None,n_event_bins=None,overlap=0,include_incomplete=True)']"
4,7 12 2021 14:31:55,nmnist_lif_rec.py,cuda,402.81924414634705,"(0.947890625, 0.9296875)","(1.5881104981899261, 0.012543503381311893)",5,128,0.002,100,0.9,0.6,1.0,20,True,ce_rate_loss,fast_sigmoid,"['Downsample(time_factor=0.001,spatial_factor=1)', 'ToFrame(sensor_size=(34,34,2),time_window=1,event_count=None,n_time_bins=None,n_event_bins=None,overlap=0,include_incomplete=True)']"
5,7 12 2021 14:36:26,nmnist_lif_cnn.py,cuda,247.27271819114685,"(0.09953125, 0.094140625)","(2.302583477497101, 0.01798892952501774)",2,128,0.002,34x34x2-8c3-2p-16c3-2p-32c3-2048-10,0.9,0.6,1.0,25,True,ce_rate_loss,fast_sigmoid,"['Downsample(time_factor=0.001,spatial_factor=1)', 'ToFrame(sensor_size=(34,34,2),time_window=1,event_count=None,n_time_bins=None,n_event_bins=None,overlap=0,include_incomplete=True)']"
6,17 1 2022 17:54:45,nmnist_lif_1l.py,cuda,15350.55194401741,"(0.9577666666666667, 0.9547)","(1.6663228392855192, 0.026071759486198425)",10,64,"['amsgrad:False', 'betas:(0.9,0.999)', 'eps:1e-08', 'lr:0.002', 'weight_decay:0']",100,0.5,0.5,0.5,25,False,ce_rate_loss,fast_sigmoid,"['Downsample(time_factor=0.001,spatial_factor=1)', 'ToFrame(sensor_size=(34,34,2),time_window=1,event_count=None,n_time_bins=None,n_event_bins=None,overlap=0,include_incomplete=False)']"
7,11 3 2022 13:38:32,nmnist_lif_3l.py,cuda,381.14013504981995,"(0.9631, 0.941)","(1.522799806989682, 1.544719636440277)",10,64,"['amsgrad:False', 'betas:(0.9,0.999)', 'eps:1e-08', 'lr:0.001', 'weight_decay:0.01']","(100, 100, 100)",0.5,0.5,0.5,25,True,ce_rate_loss,fast_sigmoid,"['Downsample(time_factor=0.001,spatial_factor=1)', 'ToFrame(sensor_size=(34,34,2),time_window=None,event_count=None,n_time_bins=None,n_event_bins=25,overlap=0,include_incomplete=False)']"
8,11 3 2022 13:47:49,nmnist_lif_3l.py,cuda,393.2017025947571,"(0.9759, 0.949)","(0.012712243588487054, 0.01707774045644328)",10,64,"['amsgrad:False', 'betas:(0.9,0.999)', 'eps:1e-08', 'lr:0.001', 'weight_decay:0.01']","(100, 100, 100)",0.5,0.5,0.5,25,True,mse_membrane_loss,fast_sigmoid,"['Downsample(time_factor=0.001,spatial_factor=1)', 'ToFrame(sensor_size=(34,34,2),time_window=None,event_count=None,n_time_bins=None,n_event_bins=25,overlap=0,include_incomplete=False)']"
9,11 3 2022 14:04:58,nmnist_lif_3l.py,cuda,460.1949863433838,"(0.9736, 0.94)","(0.014211915172399229, 0.02083150378894061)",10,64,"['amsgrad:False', 'betas:(0.9,0.999)', 'eps:1e-08', 'lr:0.001', 'weight_decay:0.01']","(100, 100, 100)",0.5,0.5,0.5,25,True,mse_membrane_loss,fast_sigmoid,"['Downsample(time_factor=0.001,spatial_factor=1)', 'ToFrame(sensor_size=(34,34,2),time_window=None,event_count=None,n_time_bins=None,n_event_bins=25,overlap=0,include_incomplete=False)']"
10,11 3 2022 14:12:26,nmnist_lif_3l.py,cuda,441.4070625305176,"(0.9801, 0.95)","(0.011888629027233002, 0.019692706991918385)",10,64,"['amsgrad:False', 'betas:(0.9,0.999)', 'eps:1e-08', 'lr:0.001', 'weight_decay:0.01']","(100, 100, 100)",0.5,0.5,0.5,25,True,mse_membrane_loss,fast_sigmoid,"['Downsample(time_factor=0.001,spatial_factor=1)', 'ToFrame(sensor_size=(34,34,2),time_window=None,event_count=None,n_time_bins=None,n_event_bins=25,overlap=0,include_incomplete=False)']"
11,11 3 2022 14:19:47,nmnist_lif_3l.py,cuda,434.7012903690338,"(0.9757, 0.953)","(0.013602303109683429, 0.01888805505586788)",10,64,"['amsgrad:False', 'betas:(0.9,0.999)', 'eps:1e-08', 'lr:0.001', 'weight_decay:0.01']","(100, 100, 100)",0.5,0.5,0.5,25,True,mse_membrane_loss,fast_sigmoid,"['Downsample(time_factor=0.001,spatial_factor=1)', 'ToFrame(sensor_size=(34,34,2),time_window=None,event_count=None,n_time_bins=None,n_event_bins=25,overlap=0,include_incomplete=False)']"
12,17 3 2022 12:48:39,nmnist_lif_1l.py,cuda,119.94460344314575,"(0.8857, 0.872)","(1.599644455180806, 1.6036475449800491)",10,64,"['amsgrad:False', 'betas:(0.9,0.999)', 'eps:1e-08', 'lr:0.002', 'weight_decay:0']",100,0.5,0.5,0.5,25,False,ce_rate_loss,fast_sigmoid,"['Downsample(time_factor=0.001,spatial_factor=1)', 'ToFrame(sensor_size=(34,34,2),time_window=None,event_count=None,n_time_bins=None,n_event_bins=5,overlap=0,include_incomplete=False)']"
13,17 3 2022 12:50:48,nmnist_lif_1l.py,cuda,119.37877750396729,"(0.8817, 0.877)","(1.5925060981398176, 1.592682659626007)",10,64,"['amsgrad:False', 'betas:(0.9,0.999)', 'eps:1e-08', 'lr:0.002', 'weight_decay:0']",100,0.5,0.5,0.5,25,False,ce_rate_loss,fast_sigmoid,"['Downsample(time_factor=0.001,spatial_factor=1)', 'ToFrame(sensor_size=(34,34,2),time_window=None,event_count=None,n_time_bins=None,n_event_bins=5,overlap=0,include_incomplete=False)']"
14,17 3 2022 12:53:09,nmnist_lif_1l.py,cuda,118.04829812049866,"(0.8699, 0.835)","(0.476790002197217, 0.5620234701782465)",10,64,"['amsgrad:False', 'betas:(0.9,0.999)', 'eps:1e-08', 'lr:0.002', 'weight_decay:0']",100,0.5,0.5,0.5,25,False,ce_count_loss,fast_sigmoid,"['Downsample(time_factor=0.001,spatial_factor=1)', 'ToFrame(sensor_size=(34,34,2),time_window=None,event_count=None,n_time_bins=None,n_event_bins=5,overlap=0,include_incomplete=False)']"
15,17 3 2022 12:57:28,nmnist_lif_1l.py,cuda,120.80832147598267,"(0.9287, 0.886)","(0.027760088894587413, 0.03767516987863928)",10,64,"['amsgrad:False', 'betas:(0.9,0.999)', 'eps:1e-08', 'lr:0.002', 'weight_decay:0']",100,0.5,0.5,0.5,25,False,mse_membrane_loss,fast_sigmoid,"['Downsample(time_factor=0.001,spatial_factor=1)', 'ToFrame(sensor_size=(34,34,2),time_window=None,event_count=None,n_time_bins=None,n_event_bins=5,overlap=0,include_incomplete=False)']"
16,17 3 2022 12:59:31,nmnist_lif_1l.py,cuda,117.77180624008179,"(0.9015, 0.889)","(0.31624362318758753, 0.35173989553004503)",10,64,"['amsgrad:False', 'betas:(0.9,0.999)', 'eps:1e-08', 'lr:0.002', 'weight_decay:0']",100,0.5,0.5,0.5,25,False,ce_max_membrane_loss,fast_sigmoid,"['Downsample(time_factor=0.001,spatial_factor=1)', 'ToFrame(sensor_size=(34,34,2),time_window=None,event_count=None,n_time_bins=None,n_event_bins=5,overlap=0,include_incomplete=False)']"
17,17 3 2022 13:03:23,nmnist_lif_1l.py,cuda,199.99289226531982,"(0.9422, 0.884)","(0.9182199387793328, 1.0110027641057968)",10,64,"['amsgrad:False', 'betas:(0.9,0.999)', 'eps:1e-08', 'lr:0.002', 'weight_decay:0']",100,0.5,0.5,0.5,25,False,ce_rate_loss,fast_sigmoid,"['Downsample(time_factor=0.001,spatial_factor=1)', 'ToFrame(sensor_size=(34,34,2),time_window=None,event_count=None,n_time_bins=5,n_event_bins=None,overlap=0,include_incomplete=False)']"
18,17 3 2022 13:06:26,nmnist_lif_1l.py,cuda,171.60466647148132,"(0.9811, 0.939)","(0.8463605084237019, 0.9322589784860611)",10,64,"['amsgrad:False', 'betas:(0.9,0.999)', 'eps:1e-08', 'lr:0.002', 'weight_decay:0']",100,0.5,0.5,0.5,25,False,ce_rate_loss,fast_sigmoid,"['Downsample(time_factor=0.001,spatial_factor=1)', 'ToFrame(sensor_size=(34,34,2),time_window=None,event_count=None,n_time_bins=None,n_event_bins=10,overlap=0,include_incomplete=False)']"
19,17 3 2022 13:09:59,nmnist_lif_2l.py,cuda,190.6601254940033,"(0.9208, 0.905)","(1.5625181691661763, 1.5733076632022858)",10,64,"['amsgrad:False', 'betas:(0.9,0.999)', 'eps:1e-08', 'lr:0.002', 'weight_decay:0']","(100, 100)",0.5,0.5,0.5,25,False,ce_rate_loss,fast_sigmoid,"['Downsample(time_factor=0.001,spatial_factor=1)', 'ToFrame(sensor_size=(34,34,2),time_window=None,event_count=None,n_time_bins=None,n_event_bins=10,overlap=0,include_incomplete=False)']"
20,17 3 2022 13:14:40,nmnist_lif_2l.py,cuda,188.89254117012024,"(0.9131, 0.913)","(1.5701217203383233, 1.5720386654138565)",10,64,"['amsgrad:False', 'betas:(0.9,0.999)', 'eps:1e-08', 'lr:0.002', 'weight_decay:0']","(100, 100)",0.5,0.5,0.5,25,False,ce_rate_loss,fast_sigmoid,"['Downsample(time_factor=0.001,spatial_factor=1)', 'ToFrame(sensor_size=(34,34,2),time_window=None,event_count=None,n_time_bins=None,n_event_bins=10,overlap=0,include_incomplete=False)']"
21,17 3 2022 13:18:01,nmnist_lif_2l.py,cuda,195.2087481021881,"(0.911, 0.889)","(1.5741172429103, 1.5879337266087532)",10,64,"['amsgrad:False', 'betas:(0.9,0.999)', 'eps:1e-08', 'lr:0.002', 'weight_decay:0']","(100, 100)",0.5,0.5,0.5,25,False,ce_rate_loss,fast_sigmoid,"['Downsample(time_factor=0.001,spatial_factor=1)', 'ToFrame(sensor_size=(34,34,2),time_window=None,event_count=None,n_time_bins=None,n_event_bins=10,overlap=0,include_incomplete=False)']"
22,17 3 2022 13:23:16,nmnist_lif_2l.py,cuda,186.1419095993042,"(0.9346, 0.917)","(0.12078921556188042, 0.14800195675343275)",10,64,"['amsgrad:False', 'betas:(0.9,0.999)', 'eps:1e-08', 'lr:0.002', 'weight_decay:0']","(100, 100)",0.5,0.5,0.5,25,False,mse_count_loss,fast_sigmoid,"['Downsample(time_factor=0.001,spatial_factor=1)', 'ToFrame(sensor_size=(34,34,2),time_window=None,event_count=None,n_time_bins=None,n_event_bins=10,overlap=0,include_incomplete=False)']"
23,17 3 2022 13:28:39,nmnist_lif_2l.py,cuda,239.97301721572876,"(0.9285, 0.906)","(0.13380772722469772, 0.16038672253489494)",10,64,"['amsgrad:False', 'betas:(0.9,0.999)', 'eps:1e-08', 'lr:0.002', 'weight_decay:0']","(100, 100)",0.5,0.5,0.5,25,False,mse_count_loss,fast_sigmoid,"['Downsample(time_factor=0.001,spatial_factor=1)', 'ToFrame(sensor_size=(34,34,2),time_window=None,event_count=None,n_time_bins=10,n_event_bins=None,overlap=0,include_incomplete=False)']"
24,17 3 2022 13:37:38,nmnist_lif_1l.py,cuda,268.09944224357605,"(0.992, 0.957)","(0.8088607138888851, 0.898326076567173)",10,64,"['amsgrad:False', 'betas:(0.9,0.999)', 'eps:1e-08', 'lr:0.002', 'weight_decay:0']",100,0.5,0.5,0.5,25,False,ce_rate_loss,fast_sigmoid,"['Downsample(time_factor=0.001,spatial_factor=1)', 'ToFrame(sensor_size=(34,34,2),time_window=None,event_count=None,n_time_bins=None,n_event_bins=25,overlap=0,include_incomplete=False)']"
25,17 3 2022 13:42:25,nmnist_lif_1l.py,cuda,279.4077558517456,"(0.9903, 0.943)","(0.8129396537306962, 0.9336699433624744)",10,64,"['amsgrad:False', 'betas:(0.9,0.999)', 'eps:1e-08', 'lr:0.002', 'weight_decay:0']",100,0.5,0.5,0.5,25,False,ce_rate_loss,fast_sigmoid,"['Downsample(time_factor=0.001,spatial_factor=1)', 'ToFrame(sensor_size=(34,34,2),time_window=None,event_count=None,n_time_bins=None,n_event_bins=25,overlap=0,include_incomplete=False)']"
26,17 3 2022 13:49:03,nmnist_lif_1l.py,cuda,259.1401743888855,"(0.9768, 0.959)","(0.5767453922207948, 0.7655757665634155)",10,64,"['amsgrad:False', 'betas:(0.9,0.999)', 'eps:1e-08', 'lr:0.002', 'weight_decay:0']",100,0.5,0.5,0.5,25,False,mse_count_loss,fast_sigmoid,"['Downsample(time_factor=0.001,spatial_factor=1)', 'ToFrame(sensor_size=(34,34,2),time_window=None,event_count=None,n_time_bins=None,n_event_bins=25,overlap=0,include_incomplete=False)']"
27,17 3 2022 13:53:57,nmnist_lif_1l.py,cuda,259.99444580078125,"(0.9803, 0.951)","(0.5440095613716515, 0.8141839541494846)",10,64,"['amsgrad:False', 'betas:(0.9,0.999)', 'eps:1e-08', 'lr:0.002', 'weight_decay:0']",100,0.5,0.5,0.5,25,False,mse_count_loss,fast_sigmoid,"['Downsample(time_factor=0.001,spatial_factor=1)', 'ToFrame(sensor_size=(34,34,2),time_window=None,event_count=None,n_time_bins=None,n_event_bins=25,overlap=0,include_incomplete=False)']"
28,17 3 2022 13:59:45,nmnist_lif_2l.py,cuda,335.1187527179718,"(0.9594, 0.938)","(1.5299003488698584, 1.549044594168663)",10,64,"['amsgrad:False', 'betas:(0.9,0.999)', 'eps:1e-08', 'lr:0.002', 'weight_decay:0']","(100, 100)",0.5,0.5,0.5,25,False,ce_rate_loss,fast_sigmoid,"['Downsample(time_factor=0.001,spatial_factor=1)', 'ToFrame(sensor_size=(34,34,2),time_window=None,event_count=None,n_time_bins=None,n_event_bins=25,overlap=0,include_incomplete=False)']"
29,17 3 2022 14:05:07,nmnist_lif_2l.py,cuda,310.50862550735474,"(0.9657, 0.94)","(1.5236893482268996, 1.5497006922960281)",10,64,"['amsgrad:False', 'betas:(0.9,0.999)', 'eps:1e-08', 'lr:0.002', 'weight_decay:0']","(100, 100)",0.5,0.5,0.5,25,False,ce_rate_loss,fast_sigmoid,"['Downsample(time_factor=0.001,spatial_factor=1)', 'ToFrame(sensor_size=(34,34,2),time_window=None,event_count=None,n_time_bins=None,n_event_bins=25,overlap=0,include_incomplete=False)']"
30,17 3 2022 14:35:12,nmnist_lif_2l.py,cuda,358.4961829185486,"(0.9641, 0.928)","(1.5254067038274874, 1.555749662220478)",10,64,"['amsgrad:False', 'betas:(0.9,0.999)', 'eps:1e-08', 'lr:0.002', 'weight_decay:0']","(100, 100)",0.5,0.5,0.5,25,False,ce_rate_loss,fast_sigmoid,"['Downsample(time_factor=0.001,spatial_factor=1)', 'ToFrame(sensor_size=(34,34,2),time_window=None,event_count=None,n_time_bins=None,n_event_bins=25,overlap=0,include_incomplete=False)']"
31,17 3 2022 14:58:11,nmnist_lif_1l.py,cuda,454.7439227104187,"(0.9909, 0.946)","(0.8625400286571235, 1.0099624320864677)",10,64,"['amsgrad:False', 'betas:(0.9,0.999)', 'eps:1e-08', 'lr:0.002', 'weight_decay:0']",100,0.5,0.5,0.5,25,False,ce_rate_loss,fast_sigmoid,"['Downsample(time_factor=0.001,spatial_factor=1)', 'ToFrame(sensor_size=(34,34,2),time_window=None,event_count=None,n_time_bins=50,n_event_bins=None,overlap=0,include_incomplete=False)']"
32,17 3 2022 15:10:30,nmnist_lif_2l.py,cuda,524.9699745178223,"(0.9762, 0.96)","(1.537650443186426, 1.562644436955452)",10,64,"['amsgrad:False', 'betas:(0.9,0.999)', 'eps:1e-08', 'lr:0.002', 'weight_decay:0']","(100, 100)",0.5,0.5,0.5,25,False,ce_rate_loss,fast_sigmoid,"['Downsample(time_factor=0.001,spatial_factor=1)', 'ToFrame(sensor_size=(34,34,2),time_window=None,event_count=None,n_time_bins=50,n_event_bins=None,overlap=0,include_incomplete=False)']"
33,17 3 2022 15:26:38,nmnist_lif_3l.py,cuda,631.0686616897583,"(0.9984, 0.972)","(0.8319882511333295, 0.9536780901253223)",10,64,"['amsgrad:False', 'betas:(0.9,0.999)', 'eps:1e-08', 'lr:0.001', 'weight_decay:0.01']","(100, 100, 100)",0.5,0.5,0.5,25,False,ce_rate_loss,fast_sigmoid,"['Downsample(time_factor=0.001,spatial_factor=1)', 'ToFrame(sensor_size=(34,34,2),time_window=None,event_count=None,n_time_bins=50,n_event_bins=None,overlap=0,include_incomplete=False)']"
34,17 3 2022 15:33:50,nmnist_lif_rec.py,cuda,426.58100628852844,"(0.9434, 0.903)","(1.578237266297553, 1.6216761097311974)",10,64,"['amsgrad:False', 'betas:(0.9,0.999)', 'eps:1e-08', 'lr:0.002', 'weight_decay:0']",100,0.5,0.5,0.5,25,True,ce_rate_loss,fast_sigmoid,"['Downsample(time_factor=0.001,spatial_factor=1)', 'ToFrame(sensor_size=(34,34,2),time_window=None,event_count=None,n_time_bins=50,n_event_bins=None,overlap=0,include_incomplete=False)']"
35,17 3 2022 15:41:54,nmnist_lif_rec.py,cuda,448.6575858592987,"(0.9414, 0.907)","(1.5775552661555587, 1.6172077804803848)",10,64,"['amsgrad:False', 'betas:(0.9,0.999)', 'eps:1e-08', 'lr:0.002', 'weight_decay:0']",100,0.5,0.5,0.5,25,True,ce_rate_loss,fast_sigmoid,"['Downsample(time_factor=0.001,spatial_factor=1)', 'ToFrame(sensor_size=(34,34,2),time_window=None,event_count=None,n_time_bins=50,n_event_bins=None,overlap=0,include_incomplete=False)']"
36,17 3 2022 15:50:35,nmnist_lif_rec.py,cuda,451.7679805755615,"(0.9665, 0.941)","(1.5560803694330203, 1.596667654812336)",10,64,"['amsgrad:False', 'betas:(0.9,0.999)', 'eps:1e-08', 'lr:0.002', 'weight_decay:0']",100,0.5,0.5,0.5,25,True,ce_rate_loss,fast_sigmoid,"['Downsample(time_factor=0.001,spatial_factor=1)', 'ToFrame(sensor_size=(34,34,2),time_window=None,event_count=None,n_time_bins=50,n_event_bins=None,overlap=0,include_incomplete=False)']"
37,17 3 2022 16:02:21,nmnist_lif_3l.py,cuda,666.2224504947662,"(0.9976, 0.956)","(0.8291958395842534, 1.0133287496864796)",10,64,"['amsgrad:False', 'betas:(0.9,0.999)', 'eps:1e-08', 'lr:0.002', 'weight_decay:0']","(100, 100, 100)",0.5,0.5,0.5,25,False,ce_rate_loss,fast_sigmoid,"['Downsample(time_factor=0.001,spatial_factor=1)', 'ToFrame(sensor_size=(34,34,2),time_window=None,event_count=None,n_time_bins=50,n_event_bins=None,overlap=0,include_incomplete=False)']"
38,17 3 2022 16:13:18,nmnist_lif_3l.py,cuda,625.8889575004578,"(0.9989, 0.976)","(0.8254042301967646, 0.9395770095288754)",10,64,"['amsgrad:False', 'betas:(0.9,0.999)', 'eps:1e-08', 'lr:0.002', 'weight_decay:0']","(100, 100, 100)",0.5,0.5,0.5,25,False,ce_rate_loss,fast_sigmoid,"['Downsample(time_factor=0.001,spatial_factor=1)', 'ToFrame(sensor_size=(34,34,2),time_window=None,event_count=None,n_time_bins=50,n_event_bins=None,overlap=0,include_incomplete=False)']"
39,17 3 2022 20:55:35,nmnist_lif_3l.py,cuda,278.6800842285156,"(0.9628, 0.921)","(0.8691455027100387, 0.9633697681128979)",10,64,"['amsgrad:False', 'betas:(0.9,0.999)', 'eps:1e-08', 'lr:0.002', 'weight_decay:0']","(100, 100, 100)",0.5,0.5,0.5,25,False,ce_rate_loss,fast_sigmoid,"['Downsample(time_factor=0.001,spatial_factor=1)', 'ToFrame(sensor_size=(34,34,2),time_window=None,event_count=None,n_time_bins=None,n_event_bins=10,overlap=0,include_incomplete=False)']"
40,21 3 2022 13:58:15,nmnist_lif_3l.py,cuda,730.5164420604706,"(0.9883, 0.955)","(0.8178342022713582, 0.9198520965874195)",10,64,"['amsgrad:False', 'betas:(0.9,0.999)', 'eps:1e-08', 'lr:0.002', 'weight_decay:0']","(100, 100, 100)",0.5,0.5,0.5,25,False,ce_rate_loss,fast_sigmoid,"['Downsample(time_factor=0.001,spatial_factor=1)', 'ToFrame(sensor_size=(34,34,2),time_window=None,event_count=None,n_time_bins=None,n_event_bins=25,overlap=0,include_incomplete=False)']"
41,21 3 2022 13:58:31,nmnist_lif_3l.py,cuda,730.1632034778595,"(0.9913, 0.959)","(0.8296647159157285, 0.9366206377744675)",10,64,"['amsgrad:False', 'betas:(0.9,0.999)', 'eps:1e-08', 'lr:0.002', 'weight_decay:0']","(100, 100, 100)",0.5,0.5,0.5,25,False,ce_rate_loss,fast_sigmoid,"['Downsample(time_factor=0.001,spatial_factor=1)', 'ToFrame(sensor_size=(34,34,2),time_window=None,event_count=None,n_time_bins=25,n_event_bins=None,overlap=0,include_incomplete=False)']"
42,21 3 2022 14:14:06,nmnist_lif_3l.py,cuda,846.9538719654083,"(0.9943, 0.953)","(0.8304959584952919, 0.9645565859973431)",10,64,"['amsgrad:False', 'betas:(0.9,0.999)', 'eps:1e-08', 'lr:0.002', 'weight_decay:0']","(100, 100, 100)",0.5,0.5,0.5,25,False,ce_rate_loss,fast_sigmoid,"['Downsample(time_factor=0.001,spatial_factor=1)', 'ToFrame(sensor_size=(34,34,2),time_window=10,event_count=None,n_time_bins=None,n_event_bins=None,overlap=0,include_incomplete=False)']"
43,21 3 2022 14:28:24,nmnist_lif_3l.py,cuda,1682.4759967327118,"(0.9869, 0.959)","(1.0180513042553214, 1.0802457481622696)",10,64,"['amsgrad:False', 'betas:(0.9,0.999)', 'eps:1e-08', 'lr:0.002', 'weight_decay:0']","(100, 100, 100)",0.5,0.5,0.5,25,False,ce_rate_loss,fast_sigmoid,"['Downsample(time_factor=0.001,spatial_factor=1)', 'ToFrame(sensor_size=(34,34,2),time_window=None,event_count=100,n_time_bins=None,n_event_bins=None,overlap=0,include_incomplete=False)']"
44,21 3 2022 14:48:55,nmnist_lif_cnn.py,cuda,247.62742519378662,"(0.9398, 0.945)","(1.539441372178922, 1.5336475223302841)",10,64,"['amsgrad:False', 'betas:(0.9,0.999)', 'eps:1e-08', 'lr:0.002', 'weight_decay:0']",34x34x2-8c3-2p-12c3-2p-16c3-1024-10,0.5,0.5,0.5,25,False,ce_rate_loss,fast_sigmoid,"['Downsample(time_factor=0.001,spatial_factor=1)', 'ToFrame(sensor_size=(34,34,2),time_window=None,event_count=None,n_time_bins=None,n_event_bins=10,overlap=0,include_incomplete=False)']"
45,21 3 2022 15:06:45,nmnist_lif_cnn.py,cuda,762.4527015686035,"(0.9369, 0.93)","(1.5844528956018435, 1.5833148285746574)",10,64,"['amsgrad:False', 'betas:(0.9,0.999)', 'eps:1e-08', 'lr:0.002', 'weight_decay:0']",34x34x2-8c3-2p-12c3-2p-16c3-1024-10,0.5,0.5,0.5,25,False,ce_rate_loss,fast_sigmoid,"['Downsample(time_factor=0.001,spatial_factor=1)', 'ToFrame(sensor_size=(34,34,2),time_window=None,event_count=200,n_time_bins=None,n_event_bins=None,overlap=0,include_incomplete=False)']"
46,21 3 2022 15:14:51,nmnist_lif_cnn.py,cuda,388.2662396430969,"(0.9173, 0.908)","(1.562318918051993, 1.5770426914095879)",10,64,"['amsgrad:False', 'betas:(0.9,0.999)', 'eps:1e-08', 'lr:0.002', 'weight_decay:0']",34x34x2-8c3-2p-12c3-2p-16c3-1024-10,0.5,0.5,0.5,25,False,ce_rate_loss,fast_sigmoid,"['Downsample(time_factor=0.001,spatial_factor=1)', 'ToFrame(sensor_size=(34,34,2),time_window=None,event_count=500,n_time_bins=None,n_event_bins=None,overlap=0,include_incomplete=False)']"
47,21 3 2022 15:25:31,nmnist_lif_cnn.py,cuda,599.7100923061371,"(0.9545, 0.959)","(1.5448250687046416, 1.5394680574536324)",10,64,"['amsgrad:False', 'betas:(0.9,0.999)', 'eps:1e-08', 'lr:0.002', 'weight_decay:0']",34x34x2-8c3-2p-12c3-2p-16c3-1024-10,0.5,0.5,0.5,25,False,ce_rate_loss,fast_sigmoid,"['Downsample(time_factor=0.001,spatial_factor=1)', 'ToFrame(sensor_size=(34,34,2),time_window=None,event_count=None,n_time_bins=None,n_event_bins=25,overlap=0,include_incomplete=False)']"
48,21 3 2022 15:54:27,nmnist_lif_cnn.py,cuda,1053.3368282318115,"(0.9659, 0.972)","(1.5387309539090297, 1.5243883281946182)",10,64,"['amsgrad:False', 'betas:(0.9,0.999)', 'eps:1e-08', 'lr:0.002', 'weight_decay:0']",34x34x2-8c3-2p-12c3-2p-16c3-1024-10,0.5,0.5,0.5,25,False,ce_rate_loss,fast_sigmoid,"['Downsample(time_factor=0.001,spatial_factor=1)', 'ToFrame(sensor_size=(34,34,2),time_window=None,event_count=None,n_time_bins=None,n_event_bins=50,overlap=0,include_incomplete=False)']"
49,21 3 2022 16:24:44,nmnist_lif_cnn.py,cuda,1797.4034473896027,"(0.9691, 0.97)","(1.5376920950640538, 1.5322770550847054)",10,64,"['amsgrad:False', 'betas:(0.9,0.999)', 'eps:1e-08', 'lr:0.002', 'weight_decay:0']",34x34x2-8c3-2p-12c3-2p-16c3-1024-10,0.5,0.5,0.5,25,False,ce_rate_loss,fast_sigmoid,"['Downsample(time_factor=0.001,spatial_factor=1)', 'ToFrame(sensor_size=(34,34,2),time_window=None,event_count=None,n_time_bins=None,n_event_bins=100,overlap=0,include_incomplete=False)']"
50,21 3 2022 16:32:03,nmnist_lif_cnn.py,cuda,418.6763172149658,"(0.9651, 0.955)","(1.5327076608208334, 1.5325249582529068)",10,64,"['amsgrad:False', 'betas:(0.9,0.999)', 'eps:1e-08', 'lr:0.002', 'weight_decay:0']",34x34x2-8c3-2p-12c3-2p-16c3-1024-10,0.5,0.5,0.5,25,False,ce_rate_loss,fast_sigmoid,"['Downsample(time_factor=0.001,spatial_factor=1)', 'ToFrame(sensor_size=(34,34,2),time_window=None,event_count=None,n_time_bins=None,n_event_bins=25,overlap=0,include_incomplete=False)']"
51,21 3 2022 16:42:37,nmnist_lif_cnn.py,cuda,421.5370180606842,"(0.9457, 0.943)","(1.5501658559604814, 1.5534142926335335)",10,64,"['amsgrad:False', 'betas:(0.9,0.999)', 'eps:1e-08', 'lr:0.002', 'weight_decay:0']",34x34x2-8c3-2p-12c3-2p-16c3-1024-10,0.5,0.5,0.5,25,False,ce_rate_loss,fast_sigmoid,"['Downsample(time_factor=0.001,spatial_factor=1)', 'ToFrame(sensor_size=(34,34,2),time_window=None,event_count=None,n_time_bins=None,n_event_bins=25,overlap=0,include_incomplete=False)']"
52,21 3 2022 16:58:53,nmnist_lif_cnn.py,cuda,535.7235291004181,"(0.9585, 0.969)","(1.537657238875225, 1.5365896373987198)",10,64,"['amsgrad:False', 'betas:(0.9,0.999)', 'eps:1e-08', 'lr:0.002', 'weight_decay:0']",34x34x2-8c3-2p-12c3-2p-16c3-1024-10,0.5,0.5,0.5,25,False,ce_rate_loss,fast_sigmoid,"['Downsample(time_factor=0.001,spatial_factor=1)', 'ToFrame(sensor_size=(34,34,2),time_window=None,event_count=None,n_time_bins=None,n_event_bins=25,overlap=0,include_incomplete=False)']"
53,21 3 2022 17:01:59,nmnist_lif_rec.py,cuda,569.4097845554352,"(0.969, 0.936)","(1.5485819236488099, 1.5966101363301277)",10,64,"['amsgrad:False', 'betas:(0.9,0.999)', 'eps:1e-08', 'lr:0.002', 'weight_decay:0']",100,0.5,0.5,0.5,25,True,ce_rate_loss,fast_sigmoid,"['Downsample(time_factor=0.001,spatial_factor=1)', 'ToFrame(sensor_size=(34,34,2),time_window=None,event_count=None,n_time_bins=50,n_event_bins=None,overlap=0,include_incomplete=False)']"
54,21 3 2022 17:11:20,nmnist_lif_cnn.py,cuda,637.6638593673706,"(0.9611, 0.958)","(1.564191666378337, 1.557461217045784)",10,64,"['amsgrad:False', 'betas:(0.9,0.999)', 'eps:1e-08', 'lr:0.002', 'weight_decay:0']",34x34x2-8c3-2p-12c3-2p-16c3-1024-10,0.5,0.5,0.5,25,False,ce_rate_loss,fast_sigmoid,"['Downsample(time_factor=0.001,spatial_factor=1)', 'ToFrame(sensor_size=(34,34,2),time_window=None,event_count=None,n_time_bins=25,n_event_bins=None,overlap=0,include_incomplete=False)']"
55,21 3 2022 17:12:31,nmnist_lif_rec.py,cuda,600.8637390136719,"(0.9662, 0.951)","(1.55349211556137, 1.5862129181623459)",10,64,"['amsgrad:False', 'betas:(0.9,0.999)', 'eps:1e-08', 'lr:0.002', 'weight_decay:0']",100,0.5,0.5,0.5,25,True,ce_rate_loss,fast_sigmoid,"['Downsample(time_factor=0.001,spatial_factor=1)', 'ToFrame(sensor_size=(34,34,2),time_window=None,event_count=None,n_time_bins=50,n_event_bins=None,overlap=0,include_incomplete=False)']"
56,21 3 2022 17:30:29,nmnist_lif_rec.py,cuda,481.47455406188965,"(0.9651, 0.946)","(1.5575795879789218, 1.593542106449604)",10,64,"['amsgrad:False', 'betas:(0.9,0.999)', 'eps:1e-08', 'lr:0.002', 'weight_decay:0']",100,0.5,0.5,0.5,25,True,ce_rate_loss,fast_sigmoid,"['Downsample(time_factor=0.001,spatial_factor=1)', 'ToFrame(sensor_size=(34,34,2),time_window=None,event_count=None,n_time_bins=50,n_event_bins=None,overlap=0,include_incomplete=False)']"
57,21 3 2022 18:19:20,nmnist_lif_rec.py,cuda,420.8661997318268,"(0.9707, 0.952)","(1.5467366952045707, 1.5748882442712784)",10,64,"['amsgrad:False', 'betas:(0.9,0.999)', 'eps:1e-08', 'lr:0.002', 'weight_decay:0']",100,0.5,0.5,0.5,25,False,ce_rate_loss,fast_sigmoid,"['Downsample(time_factor=0.001,spatial_factor=1)', 'ToFrame(sensor_size=(34,34,2),time_window=None,event_count=None,n_time_bins=50,n_event_bins=None,overlap=0,include_incomplete=False)']"
58,21 3 2022 19:54:08,nmnist_lif_3l.py,cuda,1522.385532617569,"(0.9975, 0.963)","(0.8281380234250597, 0.9726894944906235)",10,64,"['amsgrad:False', 'betas:(0.9,0.999)', 'eps:1e-08', 'lr:0.002', 'weight_decay:0']","(100, 100, 100)",0.5,0.5,0.5,25,False,ce_rate_loss,fast_sigmoid,"['Downsample(time_factor=0.001,spatial_factor=1)', 'ToFrame(sensor_size=(34,34,2),time_window=None,event_count=None,n_time_bins=50,n_event_bins=None,overlap=0,include_incomplete=False)']"
59,21 3 2022 20:03:11,nmnist_lif_3l.py,cuda,426.2603118419647,"(0.9412, 0.922)","(0.9182088211843162, 0.9626785665750504)",10,64,"['amsgrad:False', 'betas:(0.9,0.999)', 'eps:1e-08', 'lr:0.002', 'weight_decay:0']","(100, 100, 100)",0.5,0.5,0.5,25,False,ce_rate_loss,fast_sigmoid,"['Downsample(time_factor=0.001,spatial_factor=1)', 'ToFrame(sensor_size=(34,34,2),time_window=None,event_count=None,n_time_bins=10,n_event_bins=None,overlap=0,include_incomplete=False)']"
60,21 3 2022 20:07:12,nmnist_lif_3l.py,cuda,233.08265733718872,"(0.9068, 0.895)","(0.9713836976676989, 0.999409843236208)",10,64,"['amsgrad:False', 'betas:(0.9,0.999)', 'eps:1e-08', 'lr:0.002', 'weight_decay:0']","(100, 100, 100)",0.5,0.5,0.5,25,False,ce_rate_loss,fast_sigmoid,"['Downsample(time_factor=0.001,spatial_factor=1)', 'ToFrame(sensor_size=(34,34,2),time_window=None,event_count=None,n_time_bins=None,n_event_bins=5,overlap=0,include_incomplete=False)']"
61,21 3 2022 20:16:33,nmnist_lif_3l.py,cuda,541.8502840995789,"(0.9914, 0.962)","(0.838704795594428, 0.9564524404704571)",10,64,"['amsgrad:False', 'betas:(0.9,0.999)', 'eps:1e-08', 'lr:0.002', 'weight_decay:0']","(100, 100, 100)",0.5,0.5,0.5,25,False,ce_rate_loss,fast_sigmoid,"['Downsample(time_factor=0.001,spatial_factor=1)', 'ToFrame(sensor_size=(34,34,2),time_window=None,event_count=None,n_time_bins=25,n_event_bins=None,overlap=0,include_incomplete=False)']"
62,21 3 2022 20:29:27,nmnist_lif_2l.py,cuda,690.0325286388397,"(0.9779, 0.956)","(1.5352491466862381, 1.5664611458778381)",10,64,"['amsgrad:False', 'betas:(0.9,0.999)', 'eps:1e-08', 'lr:0.002', 'weight_decay:0']","(100, 100)",0.5,0.5,0.5,25,False,ce_rate_loss,fast_sigmoid,"['Downsample(time_factor=0.001,spatial_factor=1)', 'ToFrame(sensor_size=(34,34,2),time_window=None,event_count=None,n_time_bins=50,n_event_bins=None,overlap=0,include_incomplete=False)']"
63,21 3 2022 20:41:43,nmnist_lif_2l.py,cuda,400.61427998542786,"(0.9691, 0.944)","(1.529748895365721, 1.556726612150669)",10,64,"['amsgrad:False', 'betas:(0.9,0.999)', 'eps:1e-08', 'lr:0.002', 'weight_decay:0']","(100, 100)",0.5,0.5,0.5,25,False,ce_rate_loss,fast_sigmoid,"['Downsample(time_factor=0.001,spatial_factor=1)', 'ToFrame(sensor_size=(34,34,2),time_window=None,event_count=None,n_time_bins=25,n_event_bins=None,overlap=0,include_incomplete=False)']"
64,21 3 2022 20:53:40,nmnist_lif_2l.py,cuda,362.31083583831787,"(0.9692, 0.945)","(1.5299916237023226, 1.554187685251236)",10,64,"['amsgrad:False', 'betas:(0.9,0.999)', 'eps:1e-08', 'lr:0.002', 'weight_decay:0']","(100, 100)",0.5,0.5,0.5,25,False,ce_rate_loss,fast_sigmoid,"['Downsample(time_factor=0.001,spatial_factor=1)', 'ToFrame(sensor_size=(34,34,2),time_window=None,event_count=None,n_time_bins=25,n_event_bins=None,overlap=0,include_incomplete=False)']"
65,21 3 2022 21:06:30,nmnist_lif_2l.py,cuda,200.41382098197937,"(0.9009, 0.872)","(1.5809351501950792, 1.6144617423415184)",10,64,"['amsgrad:False', 'betas:(0.9,0.999)', 'eps:1e-08', 'lr:0.002', 'weight_decay:0']","(100, 100)",0.5,0.5,0.5,25,False,ce_rate_loss,fast_sigmoid,"['Downsample(time_factor=0.001,spatial_factor=1)', 'ToFrame(sensor_size=(34,34,2),time_window=None,event_count=None,n_time_bins=10,n_event_bins=None,overlap=0,include_incomplete=False)']"
66,21 3 2022 21:09:25,nmnist_lif_2l.py,cuda,162.2446150779724,"(0.8179, 0.837)","(1.6391131726040202, 1.6212554275989532)",10,64,"['amsgrad:False', 'betas:(0.9,0.999)', 'eps:1e-08', 'lr:0.002', 'weight_decay:0']","(100, 100)",0.5,0.5,0.5,25,False,ce_rate_loss,fast_sigmoid,"['Downsample(time_factor=0.001,spatial_factor=1)', 'ToFrame(sensor_size=(34,34,2),time_window=None,event_count=None,n_time_bins=None,n_event_bins=5,overlap=0,include_incomplete=False)']"
67,22 3 2022 09:23:11,nmnist_lif_1l.py,cuda,175.74306440353394,"(0.9738, 0.941)","(0.8620652655127702, 0.9382092319428921)",10,64,"['amsgrad:False', 'betas:(0.9,0.999)', 'eps:1e-08', 'lr:0.002', 'weight_decay:0']",100,0.5,0.5,0.5,25,False,ce_rate_loss,fast_sigmoid,"['Downsample(time_factor=0.001,spatial_factor=1)', 'ToFrame(sensor_size=(34,34,2),time_window=None,event_count=None,n_time_bins=None,n_event_bins=10,overlap=0,include_incomplete=False)']"
68,22 3 2022 09:26:29,nmnist_lif_2l.py,cuda,192.24023246765137,"(0.9127, 0.901)","(1.5686891807872019, 1.5739329755306244)",10,64,"['amsgrad:False', 'betas:(0.9,0.999)', 'eps:1e-08', 'lr:0.002', 'weight_decay:0']","(100, 100)",0.5,0.5,0.5,25,False,ce_rate_loss,fast_sigmoid,"['Downsample(time_factor=0.001,spatial_factor=1)', 'ToFrame(sensor_size=(34,34,2),time_window=None,event_count=None,n_time_bins=None,n_event_bins=10,overlap=0,include_incomplete=False)']"
69,22 3 2022 09:30:30,nmnist_lif_3l.py,cuda,236.19397473335266,"(0.9605, 0.943)","(0.8712864351120724, 0.9356801994144917)",10,64,"['amsgrad:False', 'betas:(0.9,0.999)', 'eps:1e-08', 'lr:0.002', 'weight_decay:0']","(100, 100, 100)",0.5,0.5,0.5,25,False,ce_rate_loss,fast_sigmoid,"['Downsample(time_factor=0.001,spatial_factor=1)', 'ToFrame(sensor_size=(34,34,2),time_window=None,event_count=None,n_time_bins=None,n_event_bins=10,overlap=0,include_incomplete=False)']"
70,22 3 2022 09:33:42,nmnist_lif_rec.py,cuda,186.1738634109497,"(0.9238, 0.919)","(1.5685551629704275, 1.5753867477178574)",10,64,"['amsgrad:False', 'betas:(0.9,0.999)', 'eps:1e-08', 'lr:0.002', 'weight_decay:0']",100,0.5,0.5,0.5,25,False,ce_rate_loss,fast_sigmoid,"['Downsample(time_factor=0.001,spatial_factor=1)', 'ToFrame(sensor_size=(34,34,2),time_window=None,event_count=None,n_time_bins=None,n_event_bins=10,overlap=0,include_incomplete=False)']"
71,22 3 2022 09:37:43,nmnist_lif_cnn.py,cuda,236.26382064819336,"(0.9412, 0.942)","(1.5425307560878194, 1.5427518412470818)",10,64,"['amsgrad:False', 'betas:(0.9,0.999)', 'eps:1e-08', 'lr:0.002', 'weight_decay:0']",34x34x2-8c3-2p-12c3-2p-16c3-1024-10,0.5,0.5,0.5,25,False,ce_rate_loss,fast_sigmoid,"['Downsample(time_factor=0.001,spatial_factor=1)', 'ToFrame(sensor_size=(34,34,2),time_window=None,event_count=None,n_time_bins=None,n_event_bins=10,overlap=0,include_incomplete=False)']"
72,22 3 2022 10:06:28,nmnist_lif_1l.py,cuda,170.26543354988098,"(0.9751, 0.943)","(0.8587843809917475, 0.9253490157425404)",10,64,"['amsgrad:False', 'betas:(0.9,0.999)', 'eps:1e-08', 'lr:0.002', 'weight_decay:0']",100,0.5,0.5,0.5,25,False,ce_rate_loss,fast_sigmoid,"['Downsample(time_factor=0.001,spatial_factor=1)', 'ToFrame(sensor_size=(34,34,2),time_window=None,event_count=None,n_time_bins=None,n_event_bins=10,overlap=0,include_incomplete=False)']"
73,22 3 2022 10:10:08,nmnist_lif_2l.py,cuda,214.62619996070862,"(0.9202, 0.898)","(1.5613599970082568, 1.5831659734249115)",10,64,"['amsgrad:False', 'betas:(0.9,0.999)', 'eps:1e-08', 'lr:0.002', 'weight_decay:0']","(100, 100)",0.5,0.5,0.5,25,False,ce_rate_loss,fast_sigmoid,"['Downsample(time_factor=0.001,spatial_factor=1)', 'ToFrame(sensor_size=(34,34,2),time_window=None,event_count=None,n_time_bins=None,n_event_bins=10,overlap=0,include_incomplete=False)']"
74,22 3 2022 10:14:20,nmnist_lif_3l.py,cuda,246.0190224647522,"(0.9604, 0.93)","(0.8759353772090499, 0.9559439234435558)",10,64,"['amsgrad:False', 'betas:(0.9,0.999)', 'eps:1e-08', 'lr:0.002', 'weight_decay:0']","(100, 100, 100)",0.5,0.5,0.5,25,False,ce_rate_loss,fast_sigmoid,"['Downsample(time_factor=0.001,spatial_factor=1)', 'ToFrame(sensor_size=(34,34,2),time_window=None,event_count=None,n_time_bins=None,n_event_bins=10,overlap=0,include_incomplete=False)']"
75,22 3 2022 10:17:24,nmnist_lif_rec.py,cuda,178.64419651031494,"(0.9069, 0.908)","(1.5847048250732907, 1.5851139724254608)",10,64,"['amsgrad:False', 'betas:(0.9,0.999)', 'eps:1e-08', 'lr:0.002', 'weight_decay:0']",100,0.5,0.5,0.5,25,False,ce_rate_loss,fast_sigmoid,"['Downsample(time_factor=0.001,spatial_factor=1)', 'ToFrame(sensor_size=(34,34,2),time_window=None,event_count=None,n_time_bins=None,n_event_bins=10,overlap=0,include_incomplete=False)']"
76,22 3 2022 10:21:26,nmnist_lif_cnn.py,cuda,237.38881921768188,"(0.9428, 0.951)","(1.5376226332536929, 1.5354552119970322)",10,64,"['amsgrad:False', 'betas:(0.9,0.999)', 'eps:1e-08', 'lr:0.002', 'weight_decay:0']",34x34x2-8c3-2p-12c3-2p-16c3-1024-10,0.5,0.5,0.5,25,False,ce_rate_loss,fast_sigmoid,"['Downsample(time_factor=0.001,spatial_factor=1)', 'ToFrame(sensor_size=(34,34,2),time_window=None,event_count=None,n_time_bins=None,n_event_bins=10,overlap=0,include_incomplete=False)']"
77,22 3 2022 10:48:03,nmnist_lif_1l.py,cuda,178.2619547843933,"(0.9755, 0.943)","(0.8540699876797427, 0.9259768724441528)",10,64,"['amsgrad:False', 'betas:(0.9,0.999)', 'eps:1e-08', 'lr:0.002', 'weight_decay:0']",100,0.5,0.5,0.5,25,False,ce_rate_loss,fast_sigmoid,"['Downsample(time_factor=0.001,spatial_factor=1)', 'ToFrame(sensor_size=(34,34,2),time_window=None,event_count=None,n_time_bins=None,n_event_bins=10,overlap=0,include_incomplete=False)']"
78,22 3 2022 10:51:25,nmnist_lif_2l.py,cuda,196.61750960350037,"(0.9195, 0.884)","(1.5642427927369524, 1.586969517171383)",10,64,"['amsgrad:False', 'betas:(0.9,0.999)', 'eps:1e-08', 'lr:0.002', 'weight_decay:0']","(100, 100)",0.5,0.5,0.5,25,False,ce_rate_loss,fast_sigmoid,"['Downsample(time_factor=0.001,spatial_factor=1)', 'ToFrame(sensor_size=(34,34,2),time_window=None,event_count=None,n_time_bins=None,n_event_bins=10,overlap=0,include_incomplete=False)']"
79,22 3 2022 10:55:31,nmnist_lif_3l.py,cuda,240.13018774986267,"(0.9535, 0.932)","(0.8972079400803633, 0.9596361443400383)",10,64,"['amsgrad:False', 'betas:(0.9,0.999)', 'eps:1e-08', 'lr:0.002', 'weight_decay:0']","(100, 100, 100)",0.5,0.5,0.5,25,False,ce_rate_loss,fast_sigmoid,"['Downsample(time_factor=0.001,spatial_factor=1)', 'ToFrame(sensor_size=(34,34,2),time_window=None,event_count=None,n_time_bins=None,n_event_bins=10,overlap=0,include_incomplete=False)']"
80,22 3 2022 10:58:33,nmnist_lif_rec.py,cuda,176.93272829055786,"(0.9243, 0.902)","(1.5649372521479419, 1.5870216712355614)",10,64,"['amsgrad:False', 'betas:(0.9,0.999)', 'eps:1e-08', 'lr:0.002', 'weight_decay:0']",100,0.5,0.5,0.5,25,False,ce_rate_loss,fast_sigmoid,"['Downsample(time_factor=0.001,spatial_factor=1)', 'ToFrame(sensor_size=(34,34,2),time_window=None,event_count=None,n_time_bins=None,n_event_bins=10,overlap=0,include_incomplete=False)']"
81,22 3 2022 11:03:19,nmnist_lif_cnn.py,cuda,280.6307396888733,"(0.9437, 0.947)","(1.5398212458677352, 1.5358569845557213)",10,64,"['amsgrad:False', 'betas:(0.9,0.999)', 'eps:1e-08', 'lr:0.002', 'weight_decay:0']",34x34x2-8c3-2p-12c3-2p-16c3-1024-10,0.5,0.5,0.5,25,False,ce_rate_loss,fast_sigmoid,"['Downsample(time_factor=0.001,spatial_factor=1)', 'ToFrame(sensor_size=(34,34,2),time_window=None,event_count=None,n_time_bins=None,n_event_bins=10,overlap=0,include_incomplete=False)']"
82,22 3 2022 11:30:57,nmnist_lif_1l.py,cuda,191.99479603767395,"(0.9732, 0.946)","(0.8638728101542041, 0.9221922755241394)",10,64,"['amsgrad:False', 'betas:(0.9,0.999)', 'eps:1e-08', 'lr:0.002', 'weight_decay:0']",100,0.5,0.5,0.5,25,False,ce_rate_loss,fast_sigmoid,"['Downsample(time_factor=0.001,spatial_factor=1)', 'ToFrame(sensor_size=(34,34,2),time_window=None,event_count=None,n_time_bins=None,n_event_bins=10,overlap=0,include_incomplete=False)']"
83,22 3 2022 11:34:22,nmnist_lif_2l.py,cuda,199.40881776809692,"(0.9117, 0.914)","(1.5737602057730316, 1.5758591368794441)",10,64,"['amsgrad:False', 'betas:(0.9,0.999)', 'eps:1e-08', 'lr:0.002', 'weight_decay:0']","(100, 100)",0.5,0.5,0.5,25,False,ce_rate_loss,fast_sigmoid,"['Downsample(time_factor=0.001,spatial_factor=1)', 'ToFrame(sensor_size=(34,34,2),time_window=None,event_count=None,n_time_bins=None,n_event_bins=10,overlap=0,include_incomplete=False)']"
84,22 3 2022 11:39:29,nmnist_lif_3l.py,cuda,301.4954676628113,"(0.9556, 0.932)","(0.885520059971293, 0.949266605079174)",10,64,"['amsgrad:False', 'betas:(0.9,0.999)', 'eps:1e-08', 'lr:0.002', 'weight_decay:0']","(100, 100, 100)",0.5,0.5,0.5,25,False,ce_rate_loss,fast_sigmoid,"['Downsample(time_factor=0.001,spatial_factor=1)', 'ToFrame(sensor_size=(34,34,2),time_window=None,event_count=None,n_time_bins=None,n_event_bins=10,overlap=0,include_incomplete=False)']"
85,22 3 2022 13:02:53,nmnist_lif_2l.py,cuda,515.8401618003845,"(0.9587, 0.94)","(1.5340667659310019, 1.5562838166952133)",10,64,"['amsgrad:False', 'betas:(0.9,0.999)', 'eps:1e-08', 'lr:0.002', 'weight_decay:0']","(100, 100)",0.5,0.5,0.5,25,False,ce_rate_loss,fast_sigmoid,"['Downsample(time_factor=0.001,spatial_factor=1)', 'ToFrame(sensor_size=(34,34,2),time_window=None,event_count=None,n_time_bins=None,n_event_bins=25,overlap=0,include_incomplete=False)']"
86,22 3 2022 13:11:12,nmnist_lif_2l.py,cuda,487.1228675842285,"(0.963, 0.949)","(1.5241509607643078, 1.5433383360505104)",10,64,"['amsgrad:False', 'betas:(0.9,0.999)', 'eps:1e-08', 'lr:0.002', 'weight_decay:0']","(100, 100)",0.5,0.5,0.5,25,False,ce_rate_loss,fast_sigmoid,"['Downsample(time_factor=0.001,spatial_factor=1)', 'ToFrame(sensor_size=(34,34,2),time_window=None,event_count=None,n_time_bins=None,n_event_bins=25,overlap=0,include_incomplete=False)']"
87,22 3 2022 13:18:51,nmnist_lif_1l.py,cuda,451.39790987968445,"(0.9899, 0.959)","(0.8187863944442408, 0.9094275608658791)",10,64,"['amsgrad:False', 'betas:(0.9,0.999)', 'eps:1e-08', 'lr:0.002', 'weight_decay:0']",100,0.5,0.5,0.5,25,False,ce_rate_loss,fast_sigmoid,"['Downsample(time_factor=0.001,spatial_factor=1)', 'ToFrame(sensor_size=(34,34,2),time_window=None,event_count=None,n_time_bins=None,n_event_bins=25,overlap=0,include_incomplete=False)']"
88,22 3 2022 13:28:25,nmnist_lif_3l.py,cuda,566.4951496124268,"(0.9891, 0.959)","(0.8132721515977459, 0.9049577601253986)",10,64,"['amsgrad:False', 'betas:(0.9,0.999)', 'eps:1e-08', 'lr:0.002', 'weight_decay:0']","(100, 100, 100)",0.5,0.5,0.5,25,False,ce_rate_loss,fast_sigmoid,"['Downsample(time_factor=0.001,spatial_factor=1)', 'ToFrame(sensor_size=(34,34,2),time_window=None,event_count=None,n_time_bins=None,n_event_bins=25,overlap=0,include_incomplete=False)']"
89,22 3 2022 13:35:35,nmnist_lif_rec.py,cuda,423.78014087677,"(0.9513, 0.934)","(1.550730571625339, 1.5706195384263992)",10,64,"['amsgrad:False', 'betas:(0.9,0.999)', 'eps:1e-08', 'lr:0.002', 'weight_decay:0']",100,0.5,0.5,0.5,25,False,ce_rate_loss,fast_sigmoid,"['Downsample(time_factor=0.001,spatial_factor=1)', 'ToFrame(sensor_size=(34,34,2),time_window=None,event_count=None,n_time_bins=None,n_event_bins=25,overlap=0,include_incomplete=False)']"
90,22 3 2022 13:47:48,nmnist_lif_cnn.py,cuda,725.2943449020386,"(0.9576, 0.962)","(1.5374950261632347, 1.534962072968483)",10,64,"['amsgrad:False', 'betas:(0.9,0.999)', 'eps:1e-08', 'lr:0.002', 'weight_decay:0']",34x34x2-8c3-2p-12c3-2p-16c3-1024-10,0.5,0.5,0.5,25,False,ce_rate_loss,fast_sigmoid,"['Downsample(time_factor=0.001,spatial_factor=1)', 'ToFrame(sensor_size=(34,34,2),time_window=None,event_count=None,n_time_bins=None,n_event_bins=25,overlap=0,include_incomplete=False)']"
91,22 3 2022 13:56:31,nmnist_lif_2l.py,cuda,516.0922229290009,"(0.9628, 0.949)","(1.5261533738701207, 1.5502782985568047)",10,64,"['amsgrad:False', 'betas:(0.9,0.999)', 'eps:1e-08', 'lr:0.002', 'weight_decay:0']","(100, 100)",0.5,0.5,0.5,25,False,ce_rate_loss,fast_sigmoid,"['Downsample(time_factor=0.001,spatial_factor=1)', 'ToFrame(sensor_size=(34,34,2),time_window=None,event_count=None,n_time_bins=None,n_event_bins=25,overlap=0,include_incomplete=False)']"
92,22 3 2022 14:04:52,nmnist_lif_1l.py,cuda,480.7275013923645,"(0.9893, 0.965)","(0.8161763188185965, 0.8992467634379864)",10,64,"['amsgrad:False', 'betas:(0.9,0.999)', 'eps:1e-08', 'lr:0.002', 'weight_decay:0']",100,0.5,0.5,0.5,25,False,ce_rate_loss,fast_sigmoid,"['Downsample(time_factor=0.001,spatial_factor=1)', 'ToFrame(sensor_size=(34,34,2),time_window=None,event_count=None,n_time_bins=None,n_event_bins=25,overlap=0,include_incomplete=False)']"
93,22 3 2022 14:17:24,nmnist_lif_3l.py,cuda,744.5756938457489,"(0.9874, 0.962)","(0.8233224316767067, 0.9317360855638981)",10,64,"['amsgrad:False', 'betas:(0.9,0.999)', 'eps:1e-08', 'lr:0.002', 'weight_decay:0']","(100, 100, 100)",0.5,0.5,0.5,25,False,ce_rate_loss,fast_sigmoid,"['Downsample(time_factor=0.001,spatial_factor=1)', 'ToFrame(sensor_size=(34,34,2),time_window=None,event_count=None,n_time_bins=None,n_event_bins=25,overlap=0,include_incomplete=False)']"
94,22 3 2022 14:24:56,nmnist_lif_rec.py,cuda,443.2790472507477,"(0.9555, 0.948)","(1.5437274169010722, 1.5608015060424805)",10,64,"['amsgrad:False', 'betas:(0.9,0.999)', 'eps:1e-08', 'lr:0.002', 'weight_decay:0']",100,0.5,0.5,0.5,25,False,ce_rate_loss,fast_sigmoid,"['Downsample(time_factor=0.001,spatial_factor=1)', 'ToFrame(sensor_size=(34,34,2),time_window=None,event_count=None,n_time_bins=None,n_event_bins=25,overlap=0,include_incomplete=False)']"
95,22 3 2022 14:36:17,nmnist_lif_cnn.py,cuda,674.4966425895691,"(0.9462, 0.946)","(1.552063555474494, 1.5518903210759163)",10,64,"['amsgrad:False', 'betas:(0.9,0.999)', 'eps:1e-08', 'lr:0.002', 'weight_decay:0']",34x34x2-8c3-2p-12c3-2p-16c3-1024-10,0.5,0.5,0.5,25,False,ce_rate_loss,fast_sigmoid,"['Downsample(time_factor=0.001,spatial_factor=1)', 'ToFrame(sensor_size=(34,34,2),time_window=None,event_count=None,n_time_bins=None,n_event_bins=25,overlap=0,include_incomplete=False)']"
96,22 3 2022 14:46:25,nmnist_lif_cnn.py,cuda,538.5269591808319,"(0.9521, 0.945)","(1.5502348341000307, 1.55509402602911)",10,64,"['amsgrad:False', 'betas:(0.9,0.999)', 'eps:1e-08', 'lr:0.002', 'weight_decay:0']",34x34x2-8c3-2p-12c3-2p-16c3-1024-10,0.5,0.5,0.5,25,False,ce_rate_loss,fast_sigmoid,"['Downsample(time_factor=0.001,spatial_factor=1)', 'ToFrame(sensor_size=(34,34,2),time_window=None,event_count=None,n_time_bins=None,n_event_bins=25,overlap=0,include_incomplete=False)']"
97,22 3 2022 14:51:19,nmnist_lif_cnn.py,cuda,288.81461906433105,"(0.9101, 0.915)","(1.5573590933137638, 1.557770662009716)",10,64,"['amsgrad:False', 'betas:(0.9,0.999)', 'eps:1e-08', 'lr:0.002', 'weight_decay:0']",34x34x2-8c3-2p-12c3-2p-16c3-1024-10,0.5,0.5,0.5,25,False,ce_rate_loss,fast_sigmoid,"['Downsample(time_factor=0.001,spatial_factor=1)', 'ToFrame(sensor_size=(34,34,2),time_window=None,event_count=1000,n_time_bins=None,n_event_bins=None,overlap=0,include_incomplete=False)']"
98,22 3 2022 14:55:01,nmnist_lif_cnn.py,cuda,214.55684065818787,"(0.9033, 0.904)","(1.5733147335659927, 1.5629007816314697)",10,64,"['amsgrad:False', 'betas:(0.9,0.999)', 'eps:1e-08', 'lr:0.002', 'weight_decay:0']",34x34x2-8c3-2p-12c3-2p-16c3-1024-10,0.5,0.5,0.5,25,False,ce_rate_loss,fast_sigmoid,"['Downsample(time_factor=0.001,spatial_factor=1)', 'ToFrame(sensor_size=(34,34,2),time_window=None,event_count=None,n_time_bins=None,n_event_bins=5,overlap=0,include_incomplete=False)']"
99,22 3 2022 14:58:20,nmnist_lif_cnn.py,cuda,192.716459274292,"(0.9224, 0.931)","(1.5455478217191756, 1.540883019566536)",10,64,"['amsgrad:False', 'betas:(0.9,0.999)', 'eps:1e-08', 'lr:0.002', 'weight_decay:0']",34x34x2-8c3-2p-12c3-2p-16c3-1024-10,0.5,0.5,0.5,25,False,ce_rate_loss,fast_sigmoid,"['Downsample(time_factor=0.001,spatial_factor=1)', 'ToFrame(sensor_size=(34,34,2),time_window=None,event_count=None,n_time_bins=None,n_event_bins=5,overlap=0,include_incomplete=False)']"
100,22 3 2022 15:01:32,nmnist_lif_cnn.py,cuda,186.03110885620117,"(0.9193, 0.933)","(1.5479084253311157, 1.5412250459194183)",10,64,"['amsgrad:False', 'betas:(0.9,0.999)', 'eps:1e-08', 'lr:0.002', 'weight_decay:0']",34x34x2-8c3-2p-12c3-2p-16c3-1024-10,0.5,0.5,0.5,25,False,ce_rate_loss,fast_sigmoid,"['Downsample(time_factor=0.001,spatial_factor=1)', 'ToFrame(sensor_size=(34,34,2),time_window=None,event_count=None,n_time_bins=None,n_event_bins=5,overlap=0,include_incomplete=False)']"
101,22 3 2022 15:04:50,nmnist_lif_cnn.py,cuda,191.08568739891052,"(0.9074, 0.916)","(1.5587033762294016, 1.5567672699689865)",10,64,"['amsgrad:False', 'betas:(0.9,0.999)', 'eps:1e-08', 'lr:0.002', 'weight_decay:0']",34x34x2-8c3-2p-12c3-2p-16c3-1024-10,0.5,0.5,0.5,25,False,ce_rate_loss,fast_sigmoid,"['Downsample(time_factor=0.001,spatial_factor=1)', 'ToFrame(sensor_size=(34,34,2),time_window=None,event_count=None,n_time_bins=None,n_event_bins=5,overlap=0,include_incomplete=False)']"
102,22 3 2022 15:28:16,nmnist_lif_cnn.py,cuda,1011.5875396728516,"(0.9633, 0.958)","(1.5678450051386645, 1.5715713128447533)",10,64,"['amsgrad:False', 'betas:(0.9,0.999)', 'eps:1e-08', 'lr:0.002', 'weight_decay:0']",34x34x2-8c3-2p-12c3-2p-16c3-1024-10,0.5,0.5,0.5,25,False,ce_rate_loss,fast_sigmoid,"['Downsample(time_factor=0.001,spatial_factor=1)', 'ToFrame(sensor_size=(34,34,2),time_window=None,event_count=None,n_time_bins=50,n_event_bins=None,overlap=0,include_incomplete=False)']"
