,0,1
0,3.007417574115828,2.9878079857624753
1,2.9643549741483204,2.9467503890185287
2,2.934478077234006,2.910595588281121
3,2.929509027331483,2.961085618381769
4,2.9147188785029394,2.8591496642206757
5,2.8092084781796323,2.815258005974998
6,2.7900958930744846,2.7952336291192283
7,2.7636701780207016,2.770881350611297
8,2.7528904185575596,2.7681370318775445
9,2.7291429734697528,2.723257501360396
10,2.684029498754763,2.6848580333548533
11,2.65350001746533,2.6654478294748656
12,2.6379837185728783,2.6769919361866696
13,2.6231483431423412,2.651748237475543
14,2.6087325713213754,2.6433487811558685
15,2.591658690396477,2.655728608789578
16,2.564120498358035,2.5358991589344724
17,2.51416018149432,2.52969341210916
18,2.493832186156628,2.495661584424301
19,2.4355883355234185,2.476211947454533
20,2.411266314749624,2.4378416403918197
21,2.399321927276312,2.453448302309278
22,2.392285820082122,2.477042084008875
23,2.3991598671557854,2.4365448817400863
24,2.3909045743007287,2.428286525565134
25,2.378097838046504,2.446894729641122
26,2.371781488493377,2.403701241587249
27,2.3661280632019044,2.4188545656875826
28,2.36455750652388,2.4092618881816596
29,2.3563595846587537,2.4093286991119385
30,2.35835939949634,2.4206333865582104
31,2.3473000273985023,2.447529634959261
32,2.343593405742271,2.4290040580319685
33,2.3319537508721444,2.4219469587567826
34,2.3301789956934313,2.400858348524067
35,2.315008314918069,2.4123658764530234
36,2.3165527203503777,2.3921123155405826
37,2.306368611840641,2.3864522383246625
38,2.325681447982788,2.389299093837469
39,2.318177989884919,2.3879458165504563
40,2.311476396111881,2.3789182212990774
41,2.3141731150010054,2.3666708402230707
42,2.296720873140821,2.3855258310344856
43,2.298531718347587,2.384653752958271
44,2.2952694612390854,2.41949484717678
45,2.302779313629749,2.396778304811934
46,2.2932416130514706,2.385686565452898
47,2.2879628527398204,2.3956583620796743
48,2.277420639524273,2.371428990028274
49,2.2747134068432975,2.37389677679035
