n, date, filename, device, runtime," accuracy (train, test)"," loss (train, test)", epochs, batch_size, lr, layers, first saccade only, method, alpha, tau_mem_inv, tau_syn_inv, v_leak, v_reset, v_th, transform
0,6 12 2021 17:10:21,nmnist_lif_1l.py,cuda,202.53759336471558,"(0.98125, 0.8984375)","(0.12367607960477471, 0.3025772385299206)",5,32,0.002,100,False,super,100,200.0,100.0,0.0,0.0,1.0,"['Downsample(time_factor=0.001,spatial_factor=1)', 'ToFrame(sensor_size=(34,34,2),time_window=1,event_count=None,n_time_bins=None,n_event_bins=None,overlap=0,include_incomplete=True)']"
1,6 12 2021 17:12:16,nmnist_lif_cnn.py,cuda,148.09553146362305,"(0.9390625, 0.91796875)","(0.17934554284438492, 0.297947256360203)",5,32,0.002,34x34x2-8c5-2p-16c5-2p-32c5-800-10,True,super,100,200.0,100.0,0.0,0.0,1.0,"['Downsample(time_factor=0.001,spatial_factor=1)', 'ToFrame(sensor_size=(34,34,2),time_window=1,event_count=None,n_time_bins=None,n_event_bins=None,overlap=0,include_incomplete=True)']"
3,6 12 2021 17:38:02,nmnist_lif_2l.py,cuda,369.59857535362244,"(0.097, 0.05)","(2.3025848418474197, 2.3025847625732423)",10,64,0.002,"(100, 100)",False,super,100,200.0,100.0,0.0,0.0,1.0,"['Downsample(time_factor=0.001,spatial_factor=1)', 'ToFrame(sensor_size=(34,34,2),time_window=1,event_count=None,n_time_bins=None,n_event_bins=None,overlap=0,include_incomplete=False)']"
3,6 12 2021 17:45:33,nmnist_lif_2l.py,cuda,330.1348657608032,"(0.105, 0.11)","(2.3025848418474197, 2.3025847625732423)",10,64,0.002,"(100, 100)",False,super,100,200.0,100.0,0.0,0.0,1.0,"['Downsample(time_factor=0.001,spatial_factor=1)', 'ToFrame(sensor_size=(34,34,2),time_window=1,event_count=None,n_time_bins=None,n_event_bins=None,overlap=0,include_incomplete=False)']"
