n, date, filename, device, runtime," accuracy (train, test)"," loss (train, test)", epochs, batch_size, lr, layers, alpha, beta, v_th, slope, loss function, spike gradient, transform
0,7 12 2021 11:39:08,pokerdvs_lif_cnn.py,cuda,14.284329891204834,"(1.0, 1.0)","(0.8746995727221171, 0.08875428438186646)",25,16,0.002,35x35x2-8c3-2p-16c3-2p-32c3-2048-4,0.9,0.5,1.0,5,ce_rate_loss,fast_sigmoid,"['Downsample(time_factor=0.001,spatial_factor=1)', 'ToFrame(sensor_size=(35,35,2),time_window=1,event_count=None,n_time_bins=None,n_event_bins=None,overlap=0,include_incomplete=True)']"
1,7 12 2021 11:39:49,pokerdvs_lif_cnn.py,cuda,13.914631128311157,"(0.25, 0.25)","(1.4438444375991821, 0.1466469645500183)",25,16,0.002,35x35x2-8c3-2p-16c3-2p-32c3-2048-4,0.9,0.5,1.0,50,ce_rate_loss,fast_sigmoid,"['Downsample(time_factor=0.001,spatial_factor=1)', 'ToFrame(sensor_size=(35,35,2),time_window=1,event_count=None,n_time_bins=None,n_event_bins=None,overlap=0,include_incomplete=True)']"
2,7 12 2021 11:40:10,pokerdvs_lif_cnn.py,cuda,13.855627059936523,"(0.7708333333333334, 0.8)","(1.002069075902303, 0.10180476307868958)",25,16,0.002,35x35x2-8c3-2p-16c3-2p-32c3-2048-4,0.9,0.5,1.0,5,ce_rate_loss,fast_sigmoid,"['Downsample(time_factor=0.001,spatial_factor=1)', 'ToFrame(sensor_size=(35,35,2),time_window=1,event_count=None,n_time_bins=None,n_event_bins=None,overlap=0,include_incomplete=True)']"
3,7 12 2021 11:40:43,pokerdvs_lif_cnn.py,cuda,14.108379602432251,"(0.25, 0.25)","(1.4657986164093018, 0.15375147461891175)",25,16,0.002,35x35x2-8c5-2p-16c3-2p-32c3-2048-4,0.9,0.5,1.0,5,ce_rate_loss,fast_sigmoid,"['Downsample(time_factor=0.001,spatial_factor=1)', 'ToFrame(sensor_size=(35,35,2),time_window=1,event_count=None,n_time_bins=None,n_event_bins=None,overlap=0,include_incomplete=True)']"
4,7 12 2021 11:41:06,pokerdvs_lif_cnn.py,cuda,13.807096242904663,"(0.25, 0.25)","(1.1957977612813313, 0.11680821776390075)",25,16,0.002,35x35x2-8c3-2p-16c3-2p-32c5-1152-4,0.9,0.5,1.0,5,ce_rate_loss,fast_sigmoid,"['Downsample(time_factor=0.001,spatial_factor=1)', 'ToFrame(sensor_size=(35,35,2),time_window=1,event_count=None,n_time_bins=None,n_event_bins=None,overlap=0,include_incomplete=True)']"
5,7 12 2021 11:41:31,pokerdvs_lif_cnn.py,cuda,14.17850399017334,"(0.6458333333333334, 0.6)","(1.1064270337422688, 0.113304603099823)",25,16,0.002,35x35x2-8c3-2p-16c3-2p-32c3-2048-4,0.9,0.5,1.0,5,ce_rate_loss,fast_sigmoid,"['Downsample(time_factor=0.001,spatial_factor=1)', 'ToFrame(sensor_size=(35,35,2),time_window=1,event_count=None,n_time_bins=None,n_event_bins=None,overlap=0,include_incomplete=True)']"
6,7 12 2021 11:42:05,pokerdvs_lif_cnn.py,cuda,13.682263851165771,"(0.9791666666666666, 0.9)","(0.9604131182034811, 0.10478428900241851)",25,16,0.002,35x35x2-8c3-2p-16c3-4p-32c3-512-4,0.9,0.5,1.0,5,ce_rate_loss,fast_sigmoid,"['Downsample(time_factor=0.001,spatial_factor=1)', 'ToFrame(sensor_size=(35,35,2),time_window=1,event_count=None,n_time_bins=None,n_event_bins=None,overlap=0,include_incomplete=True)']"
7,7 12 2021 11:42:26,pokerdvs_lif_cnn.py,cuda,14.669780492782593,"(0.6041666666666666, 0.25)","(1.2527237733205159, 0.1237055480480194)",25,16,0.002,35x35x2-8c3-2p-16c3-4p-32c3-512-4,0.9,0.5,1.0,5,ce_rate_loss,fast_sigmoid,"['Downsample(time_factor=0.001,spatial_factor=1)', 'ToFrame(sensor_size=(35,35,2),time_window=1,event_count=None,n_time_bins=None,n_event_bins=None,overlap=0,include_incomplete=True)']"
8,7 12 2021 11:42:49,pokerdvs_lif_cnn.py,cuda,14.150502681732178,"(0.5, 0.45)","(1.2962249914805095, 0.12008369565010071)",25,16,0.002,35x35x2-8c3-2p-16c3-2p-32c3-2048-4,0.9,0.5,1.0,5,ce_rate_loss,fast_sigmoid,"['Downsample(time_factor=0.001,spatial_factor=1)', 'ToFrame(sensor_size=(35,35,2),time_window=1,event_count=None,n_time_bins=None,n_event_bins=None,overlap=0,include_incomplete=True)']"
9,7 12 2021 11:43:18,pokerdvs_lif_cnn.py,cuda,14.127923250198364,"(1.0, 0.9)","(0.9128166635831197, 0.0900180846452713)",25,16,0.002,35x35x2-8c3-2p-16c3-2p-32c3-2048-4,0.9,0.5,0.5,5,ce_rate_loss,fast_sigmoid,"['Downsample(time_factor=0.001,spatial_factor=1)', 'ToFrame(sensor_size=(35,35,2),time_window=1,event_count=None,n_time_bins=None,n_event_bins=None,overlap=0,include_incomplete=True)']"
10,7 12 2021 11:43:42,pokerdvs_lif_cnn.py,cuda,14.777463674545288,"(1.0, 1.0)","(0.9118193984031677, 0.0929527759552002)",25,16,0.002,35x35x2-8c3-2p-16c3-2p-32c3-2048-4,0.9,0.5,0.5,5,ce_rate_loss,fast_sigmoid,"['Downsample(time_factor=0.001,spatial_factor=1)', 'ToFrame(sensor_size=(35,35,2),time_window=1,event_count=None,n_time_bins=None,n_event_bins=None,overlap=0,include_incomplete=True)']"
11,7 12 2021 11:44:06,pokerdvs_lif_cnn.py,cuda,14.153619050979614,"(1.0, 0.9)","(0.8909748792648315, 0.0955972671508789)",25,16,0.002,35x35x2-8c3-2p-16c3-2p-32c3-2048-4,0.9,0.5,0.5,5,ce_rate_loss,fast_sigmoid,"['Downsample(time_factor=0.001,spatial_factor=1)', 'ToFrame(sensor_size=(35,35,2),time_window=1,event_count=None,n_time_bins=None,n_event_bins=None,overlap=0,include_incomplete=True)']"
12,7 12 2021 11:44:34,pokerdvs_lif_cnn.py,cuda,15.101061582565308,"(0.4166666666666667, 0.3)","(1.3476003408432007, 0.13307102918624877)",25,16,0.002,35x35x2-8c3-2p-16c3-2p-32c3-2048-4,0.9,0.5,0.5,5,ce_rate_loss,fast_sigmoid,"['Downsample(time_factor=0.001,spatial_factor=1)', 'ToFrame(sensor_size=(35,35,2),time_window=1,event_count=None,n_time_bins=None,n_event_bins=None,overlap=0,include_incomplete=True)']"
13,7 12 2021 11:44:55,pokerdvs_lif_cnn.py,cuda,15.04604458808899,"(1.0, 1.0)","(0.8880364497502645, 0.08861503005027771)",25,16,0.002,35x35x2-8c3-2p-16c3-2p-32c3-2048-4,0.9,0.5,0.5,5,ce_rate_loss,fast_sigmoid,"['Downsample(time_factor=0.001,spatial_factor=1)', 'ToFrame(sensor_size=(35,35,2),time_window=1,event_count=None,n_time_bins=None,n_event_bins=None,overlap=0,include_incomplete=True)']"
14,7 12 2021 11:54:58,pokerdvs_lif_cnn.py,cuda,14.441275835037231,"(0.3125, 0.25)","(1.3802236715952556, 0.13836168646812438)",25,16,0.002,35x35x2-8c3-2p-16c3-2p-32c3-2048-4,0.9,0.5,0.5,0.1,ce_rate_loss,LSO,"['Downsample(time_factor=0.001,spatial_factor=1)', 'ToFrame(sensor_size=(35,35,2),time_window=1,event_count=None,n_time_bins=None,n_event_bins=None,overlap=0,include_incomplete=True)']"
15,7 12 2021 11:55:22,pokerdvs_lif_cnn.py,cuda,14.592300653457642,"(0.3541666666666667, 0.15)","(1.347611943880717, 0.13162851929664612)",25,16,0.002,35x35x2-8c3-2p-16c3-2p-32c3-2048-4,0.9,0.5,0.5,0.3,ce_rate_loss,LSO,"['Downsample(time_factor=0.001,spatial_factor=1)', 'ToFrame(sensor_size=(35,35,2),time_window=1,event_count=None,n_time_bins=None,n_event_bins=None,overlap=0,include_incomplete=True)']"
16,7 12 2021 11:55:46,pokerdvs_lif_cnn.py,cuda,14.436039209365845,"(0.5625, 0.55)","(1.2719923655192058, 0.11963900923728943)",25,16,0.002,35x35x2-8c3-2p-16c3-2p-32c3-2048-4,0.9,0.5,0.5,0.05,ce_rate_loss,LSO,"['Downsample(time_factor=0.001,spatial_factor=1)', 'ToFrame(sensor_size=(35,35,2),time_window=1,event_count=None,n_time_bins=None,n_event_bins=None,overlap=0,include_incomplete=True)']"
17,7 12 2021 12:02:10,pokerdvs_lif_cnn.py,cuda,14.762489795684814,"(0.2916666666666667, 0.3)","(1.383365233739217, 0.13829479217529297)",25,16,0.002,35x35x2-8c3-2p-16c3-2p-32c3-2048-4,0.9,0.5,0.5,0.025,ce_rate_loss,LSO,"['Downsample(time_factor=0.001,spatial_factor=1)', 'ToFrame(sensor_size=(35,35,2),time_window=1,event_count=None,n_time_bins=None,n_event_bins=None,overlap=0,include_incomplete=True)']"
18,7 12 2021 12:02:41,pokerdvs_lif_cnn.py,cuda,15.077190637588501,"(0.3541666666666667, 0.4)","(1.382290244102478, 0.13779273629188538)",25,16,0.002,35x35x2-8c3-2p-16c3-2p-32c3-2048-4,0.9,0.4,0.5,0.05,ce_rate_loss,LSO,"['Downsample(time_factor=0.001,spatial_factor=1)', 'ToFrame(sensor_size=(35,35,2),time_window=1,event_count=None,n_time_bins=None,n_event_bins=None,overlap=0,include_incomplete=True)']"
19,7 12 2021 12:03:27,pokerdvs_lif_cnn.py,cuda,14.824902296066284,"(0.4375, 0.35)","(1.3588577111562092, 0.13813952207565308)",25,16,0.002,35x35x2-8c3-2p-16c3-2p-32c3-2048-4,0.9,0.4,0.5,0.05,ce_rate_loss,SSO,"['Downsample(time_factor=0.001,spatial_factor=1)', 'ToFrame(sensor_size=(35,35,2),time_window=1,event_count=None,n_time_bins=None,n_event_bins=None,overlap=0,include_incomplete=True)']"
20,7 12 2021 12:07:57,pokerdvs_lif_1l.py,cuda,11.805133581161499,"(1.0, 1.0)","(0.772991955280304, 0.1209959089756012)",25,8,0.002,100,0.9,0.6,1.0,25,ce_rate_loss,fast_sigmoid,"['Downsample(time_factor=0.001,spatial_factor=1)', 'ToFrame(sensor_size=(35,35,2),time_window=1,event_count=None,n_time_bins=None,n_event_bins=None,overlap=0,include_incomplete=True)']"
21,7 12 2021 12:12:40,pokerdvs_lif_2l.py,cuda,15.844238758087158,"(1.0, 1.0)","(0.8000673254330953, 0.12490053176879883)",25,8,0.002,"(100, 100)",0.9,0.6,1.0,25,ce_rate_loss,fast_sigmoid,"['Downsample(time_factor=0.001,spatial_factor=1)', 'ToFrame(sensor_size=(35,35,2),time_window=1,event_count=None,n_time_bins=None,n_event_bins=None,overlap=0,include_incomplete=True)']"
22,7 12 2021 12:19:11,pokerdvs_lif_3l.py,cuda,19.735608339309692,"(0.75, 0.75)","(0.956801156202952, 0.15415619313716888)",25,8,0.002,"(100, 100, 100)",0.9,0.6,1.0,25,ce_rate_loss,fast_sigmoid,"['Downsample(time_factor=0.001,spatial_factor=1)', 'ToFrame(sensor_size=(35,35,2),time_window=1,event_count=None,n_time_bins=None,n_event_bins=None,overlap=0,include_incomplete=True)']"
23,7 12 2021 12:19:42,pokerdvs_lif_3l.py,cuda,19.898791313171387,"(1.0, 1.0)","(0.8110484182834625, 0.12441986203193664)",25,8,0.002,"(100, 100, 100)",0.9,0.6,1.0,20,ce_rate_loss,fast_sigmoid,"['Downsample(time_factor=0.001,spatial_factor=1)', 'ToFrame(sensor_size=(35,35,2),time_window=1,event_count=None,n_time_bins=None,n_event_bins=None,overlap=0,include_incomplete=True)']"
24,7 12 2021 12:24:47,pokerdvs_lif_rec.py,cuda,15.445269107818604,"(0.5, 0.5)","(1.0677424669265747, 0.16107648909091948)",25,8,0.002,100,0.9,0.6,1.0,25,ce_rate_loss,fast_sigmoid,"['Downsample(time_factor=0.001,spatial_factor=1)', 'ToFrame(sensor_size=(35,35,2),time_window=1,event_count=None,n_time_bins=None,n_event_bins=None,overlap=0,include_incomplete=True)']"
25,7 12 2021 12:25:57,pokerdvs_lif_rec.py,cuda,15.65500259399414,"(1.0, 1.0)","(0.7522897819677988, 0.1206638753414154)",25,8,0.002,100,0.9,0.6,1.0,20,ce_rate_loss,fast_sigmoid,"['Downsample(time_factor=0.001,spatial_factor=1)', 'ToFrame(sensor_size=(35,35,2),time_window=1,event_count=None,n_time_bins=None,n_event_bins=None,overlap=0,include_incomplete=True)']"
26,9 12 2021 08:53:01,pokerdvs_lif_1l.py,cuda,10.64508581161499,"(1.0, 1.0)","(0.7671196460723877, 0.1210988312959671)",25,8,0.002,100,0.9,0.6,1.0,25,ce_rate_loss,fast_sigmoid,"['Downsample(time_factor=0.001,spatial_factor=1)', 'ToFrame(sensor_size=(35,35,2),time_window=1,event_count=None,n_time_bins=None,n_event_bins=None,overlap=0,include_incomplete=True)']"
