/work/home/joschroeder/senv/lib/python3.7/site-packages/torch/utils/data/dataloader.py:481: UserWarning: This DataLoader will create 4 worker processes in total. Our suggested max number of worker in current system is 2, which is smaller than what this DataLoader is going to create. Please be aware that excessive worker creation might get DataLoader running slow or even freeze, lower the worker number to avoid potential slowness/freeze if necessary.
  cpuset_checked))
Multi-processing is handled by Slurm.
GPU available: True, used: True
TPU available: False, using: 0 TPU cores
IPU available: False, using: 0 IPUs
initializing distributed: GLOBAL_RANK: 0, MEMBER: 1/1
----------------------------------------------------------------------------------------------------
distributed_backend=nccl
All distributed processes registered. Starting with 1 processes
----------------------------------------------------------------------------------------------------

LOCAL_RANK: 0 - CUDA_VISIBLE_DEVICES: [0]
Set SLURM handle signals.

  | Name | Type     | Params
----------------------------------
0 | fc1  | Linear   | 3.3 M 
1 | fc2  | Linear   | 1.1 K 
2 | lif1 | Synaptic | 0     
3 | lif2 | Synaptic | 0     
----------------------------------
3.3 M     Trainable params
0         Non-trainable params
3.3 M     Total params
13.112    Total estimated model params size (MB)
[W reducer.cpp:1303] Warning: find_unused_parameters=True was specified in DDP constructor, but did not find any unused parameters in the forward pass. This flag results in an extra traversal of the autograd graph every iteration,  which can adversely affect performance. If your model indeed never has any unused parameters in the forward pass, consider turning this flag off. Note that this warning may be a false positive if your model has flow control causing later iterations to have unused parameters. (function operator())
/work/home/joschroeder/senv/lib/python3.7/site-packages/torch/utils/data/dataloader.py:481: UserWarning: This DataLoader will create 4 worker processes in total. Our suggested max number of worker in current system is 2, which is smaller than what this DataLoader is going to create. Please be aware that excessive worker creation might get DataLoader running slow or even freeze, lower the worker number to avoid potential slowness/freeze if necessary.
  cpuset_checked))
Multi-processing is handled by Slurm.
GPU available: True, used: True
TPU available: False, using: 0 TPU cores
IPU available: False, using: 0 IPUs
initializing distributed: GLOBAL_RANK: 0, MEMBER: 1/1
----------------------------------------------------------------------------------------------------
distributed_backend=nccl
All distributed processes registered. Starting with 1 processes
----------------------------------------------------------------------------------------------------

LOCAL_RANK: 0 - CUDA_VISIBLE_DEVICES: [0]
Set SLURM handle signals.

  | Name      | Type       | Params
-----------------------------------------
0 | fc1       | Linear     | 3.3 M 
1 | fc2       | Linear     | 10.1 K
2 | fc3       | Linear     | 1.1 K 
3 | izhi1     | Izhikevich | 0     
4 | izhi2     | Izhikevich | 0     
5 | izhi3     | Izhikevich | 0     
6 | train_acc | Accuracy   | 0     
7 | test_acc  | Accuracy   | 0     
-----------------------------------------
3.3 M     Trainable params
0         Non-trainable params
3.3 M     Total params
13.152    Total estimated model params size (MB)
/work/home/joschroeder/senv/lib/python3.7/site-packages/pytorch_lightning/callbacks/model_checkpoint.py:631: UserWarning: Checkpoint directory /work/home/joschroeder/dvsgesture/snntorch/lightning_logs/version_230642/checkpoints exists and is not empty.
  rank_zero_warn(f"Checkpoint directory {dirpath} exists and is not empty.")
[W reducer.cpp:1303] Warning: find_unused_parameters=True was specified in DDP constructor, but did not find any unused parameters in the forward pass. This flag results in an extra traversal of the autograd graph every iteration,  which can adversely affect performance. If your model indeed never has any unused parameters in the forward pass, consider turning this flag off. Note that this warning may be a false positive if your model has flow control causing later iterations to have unused parameters. (function operator())
Multi-processing is handled by Slurm.
GPU available: True, used: True
TPU available: False, using: 0 TPU cores
IPU available: False, using: 0 IPUs
initializing distributed: GLOBAL_RANK: 0, MEMBER: 1/1
----------------------------------------------------------------------------------------------------
distributed_backend=nccl
All distributed processes registered. Starting with 1 processes
----------------------------------------------------------------------------------------------------

LOCAL_RANK: 0 - CUDA_VISIBLE_DEVICES: [0]
Set SLURM handle signals.

  | Name      | Type       | Params
-----------------------------------------
0 | fc1       | Linear     | 3.3 M 
1 | fc2       | Linear     | 10.1 K
2 | fc3       | Linear     | 10.1 K
3 | fc4       | Linear     | 1.1 K 
4 | izhi1     | Izhikevich | 0     
5 | izhi2     | Izhikevich | 0     
6 | izhi3     | Izhikevich | 0     
7 | izhi4     | Izhikevich | 0     
8 | train_acc | Accuracy   | 0     
9 | test_acc  | Accuracy   | 0     
-----------------------------------------
3.3 M     Trainable params
0         Non-trainable params
3.3 M     Total params
13.193    Total estimated model params size (MB)
/work/home/joschroeder/senv/lib/python3.7/site-packages/pytorch_lightning/callbacks/model_checkpoint.py:631: UserWarning: Checkpoint directory /work/home/joschroeder/dvsgesture/snntorch/lightning_logs/version_230642/checkpoints exists and is not empty.
  rank_zero_warn(f"Checkpoint directory {dirpath} exists and is not empty.")
/work/home/joschroeder/senv/lib/python3.7/site-packages/pytorch_lightning/trainer/data_loading.py:133: UserWarning: The dataloader, train_dataloader, does not have many workers which may be a bottleneck. Consider increasing the value of the `num_workers` argument` (try 20 which is the number of cpus on this machine) in the `DataLoader` init to improve performance.
  f"The dataloader, {name}, does not have many workers which may be a bottleneck."
/work/home/joschroeder/senv/lib/python3.7/site-packages/pytorch_lightning/trainer/data_loading.py:133: UserWarning: The dataloader, val_dataloader 0, does not have many workers which may be a bottleneck. Consider increasing the value of the `num_workers` argument` (try 20 which is the number of cpus on this machine) in the `DataLoader` init to improve performance.
  f"The dataloader, {name}, does not have many workers which may be a bottleneck."
[W reducer.cpp:1303] Warning: find_unused_parameters=True was specified in DDP constructor, but did not find any unused parameters in the forward pass. This flag results in an extra traversal of the autograd graph every iteration,  which can adversely affect performance. If your model indeed never has any unused parameters in the forward pass, consider turning this flag off. Note that this warning may be a false positive if your model has flow control causing later iterations to have unused parameters. (function operator())
/work/home/joschroeder/senv/lib/python3.7/site-packages/torch/utils/data/dataloader.py:481: UserWarning: This DataLoader will create 4 worker processes in total. Our suggested max number of worker in current system is 2, which is smaller than what this DataLoader is going to create. Please be aware that excessive worker creation might get DataLoader running slow or even freeze, lower the worker number to avoid potential slowness/freeze if necessary.
  cpuset_checked))
Multi-processing is handled by Slurm.
GPU available: True, used: True
TPU available: False, using: 0 TPU cores
IPU available: False, using: 0 IPUs
initializing distributed: GLOBAL_RANK: 0, MEMBER: 1/1
----------------------------------------------------------------------------------------------------
distributed_backend=nccl
All distributed processes registered. Starting with 1 processes
----------------------------------------------------------------------------------------------------

LOCAL_RANK: 0 - CUDA_VISIBLE_DEVICES: [0]
Set SLURM handle signals.

  | Name | Type     | Params
----------------------------------
0 | fc1  | Linear   | 3.3 M 
1 | fc2  | Linear   | 10.1 K
2 | fc3  | Linear   | 1.1 K 
3 | lif1 | Synaptic | 0     
4 | lif2 | Synaptic | 0     
5 | lif3 | Synaptic | 0     
----------------------------------
3.3 M     Trainable params
0         Non-trainable params
3.3 M     Total params
13.152    Total estimated model params size (MB)
/work/home/joschroeder/senv/lib/python3.7/site-packages/pytorch_lightning/callbacks/model_checkpoint.py:631: UserWarning: Checkpoint directory /work/home/joschroeder/dvsgesture/snntorch/lightning_logs/version_230643/checkpoints exists and is not empty.
  rank_zero_warn(f"Checkpoint directory {dirpath} exists and is not empty.")
[W reducer.cpp:1303] Warning: find_unused_parameters=True was specified in DDP constructor, but did not find any unused parameters in the forward pass. This flag results in an extra traversal of the autograd graph every iteration,  which can adversely affect performance. If your model indeed never has any unused parameters in the forward pass, consider turning this flag off. Note that this warning may be a false positive if your model has flow control causing later iterations to have unused parameters. (function operator())
/work/home/joschroeder/senv/lib/python3.7/site-packages/torch/utils/data/dataloader.py:481: UserWarning: This DataLoader will create 4 worker processes in total. Our suggested max number of worker in current system is 2, which is smaller than what this DataLoader is going to create. Please be aware that excessive worker creation might get DataLoader running slow or even freeze, lower the worker number to avoid potential slowness/freeze if necessary.
  cpuset_checked))
Multi-processing is handled by Slurm.
GPU available: True, used: True
TPU available: False, using: 0 TPU cores
IPU available: False, using: 0 IPUs
initializing distributed: GLOBAL_RANK: 0, MEMBER: 1/1
----------------------------------------------------------------------------------------------------
distributed_backend=nccl
All distributed processes registered. Starting with 1 processes
----------------------------------------------------------------------------------------------------

LOCAL_RANK: 0 - CUDA_VISIBLE_DEVICES: [0]
Set SLURM handle signals.

  | Name      | Type        | Params
------------------------------------------
0 | fc1       | Linear      | 3.3 M 
1 | fc2       | Linear      | 1.1 K 
2 | izhi1     | RIzhikevich | 3.3 M 
3 | izhi2     | Izhikevich  | 0     
4 | train_acc | Accuracy    | 0     
5 | test_acc  | Accuracy    | 0     
------------------------------------------
6.6 M     Trainable params
0         Non-trainable params
6.6 M     Total params
26.259    Total estimated model params size (MB)
/work/home/joschroeder/senv/lib/python3.7/site-packages/pytorch_lightning/callbacks/model_checkpoint.py:631: UserWarning: Checkpoint directory /work/home/joschroeder/dvsgesture/snntorch/lightning_logs/version_230642/checkpoints exists and is not empty.
  rank_zero_warn(f"Checkpoint directory {dirpath} exists and is not empty.")
/work/home/joschroeder/senv/lib/python3.7/site-packages/torch/utils/data/dataloader.py:481: UserWarning: This DataLoader will create 4 worker processes in total. Our suggested max number of worker in current system is 2, which is smaller than what this DataLoader is going to create. Please be aware that excessive worker creation might get DataLoader running slow or even freeze, lower the worker number to avoid potential slowness/freeze if necessary.
  cpuset_checked))
Multi-processing is handled by Slurm.
GPU available: True, used: True
TPU available: False, using: 0 TPU cores
IPU available: False, using: 0 IPUs
initializing distributed: GLOBAL_RANK: 0, MEMBER: 1/1
----------------------------------------------------------------------------------------------------
distributed_backend=nccl
All distributed processes registered. Starting with 1 processes
----------------------------------------------------------------------------------------------------

LOCAL_RANK: 0 - CUDA_VISIBLE_DEVICES: [0]
Set SLURM handle signals.

  | Name | Type     | Params
----------------------------------
0 | fc1  | Linear   | 3.3 M 
1 | fc2  | Linear   | 10.1 K
2 | fc3  | Linear   | 10.1 K
3 | fc4  | Linear   | 1.1 K 
4 | lif1 | Synaptic | 0     
5 | lif2 | Synaptic | 0     
6 | lif3 | Synaptic | 0     
7 | lif4 | Synaptic | 0     
----------------------------------
3.3 M     Trainable params
0         Non-trainable params
3.3 M     Total params
13.193    Total estimated model params size (MB)
/work/home/joschroeder/senv/lib/python3.7/site-packages/pytorch_lightning/callbacks/model_checkpoint.py:631: UserWarning: Checkpoint directory /work/home/joschroeder/dvsgesture/snntorch/lightning_logs/version_230643/checkpoints exists and is not empty.
  rank_zero_warn(f"Checkpoint directory {dirpath} exists and is not empty.")
[W reducer.cpp:1303] Warning: find_unused_parameters=True was specified in DDP constructor, but did not find any unused parameters in the forward pass. This flag results in an extra traversal of the autograd graph every iteration,  which can adversely affect performance. If your model indeed never has any unused parameters in the forward pass, consider turning this flag off. Note that this warning may be a false positive if your model has flow control causing later iterations to have unused parameters. (function operator())
/work/home/joschroeder/senv/lib/python3.7/site-packages/torch/utils/data/dataloader.py:481: UserWarning: This DataLoader will create 4 worker processes in total. Our suggested max number of worker in current system is 2, which is smaller than what this DataLoader is going to create. Please be aware that excessive worker creation might get DataLoader running slow or even freeze, lower the worker number to avoid potential slowness/freeze if necessary.
  cpuset_checked))
Multi-processing is handled by Slurm.
GPU available: True, used: True
TPU available: False, using: 0 TPU cores
IPU available: False, using: 0 IPUs
initializing distributed: GLOBAL_RANK: 0, MEMBER: 1/1
----------------------------------------------------------------------------------------------------
distributed_backend=nccl
All distributed processes registered. Starting with 1 processes
----------------------------------------------------------------------------------------------------

LOCAL_RANK: 0 - CUDA_VISIBLE_DEVICES: [0]
Set SLURM handle signals.

  | Name | Type      | Params
-----------------------------------
0 | fc1  | Linear    | 3.3 M 
1 | fc2  | Linear    | 1.1 K 
2 | lif1 | RSynaptic | 1     
3 | lif2 | Synaptic  | 0     
-----------------------------------
3.3 M     Trainable params
0         Non-trainable params
3.3 M     Total params
13.112    Total estimated model params size (MB)
/work/home/joschroeder/senv/lib/python3.7/site-packages/pytorch_lightning/callbacks/model_checkpoint.py:631: UserWarning: Checkpoint directory /work/home/joschroeder/dvsgesture/snntorch/lightning_logs/version_230643/checkpoints exists and is not empty.
  rank_zero_warn(f"Checkpoint directory {dirpath} exists and is not empty.")
[W reducer.cpp:1303] Warning: find_unused_parameters=True was specified in DDP constructor, but did not find any unused parameters in the forward pass. This flag results in an extra traversal of the autograd graph every iteration,  which can adversely affect performance. If your model indeed never has any unused parameters in the forward pass, consider turning this flag off. Note that this warning may be a false positive if your model has flow control causing later iterations to have unused parameters. (function operator())
