n, date, filename, device, runtime," accuracy (train, test)"," loss (train, test)", epochs, batch_size, lr, layers, first saccade only, method, alpha, a, b, c, d, bias, tau_inv, v_th, transform
0,6 12 2021 17:28:36,nmnist_izhi_cnn.py,cuda,226.2547574043274,"(0.0953125, 0.10546875)","(2.3286942839622498, 2.314909487962723)",5,32,0.002,34x34x2-8c5-2p-16c5-2p-32c5-800-10,True,super,20,0.02,0.2,-65,8,150,250,30,"['Downsample(time_factor=0.001,spatial_factor=1)', 'ToFrame(sensor_size=(34,34,2),time_window=1,event_count=None,n_time_bins=None,n_event_bins=None,overlap=0,include_incomplete=True)']"
1,6 12 2021 17:39:18,nmnist_izhi_cnn.py,cuda,338.4853081703186,"(0.1140625, 0.1171875)","(2.320895421504974, 2.312501221895218)",5,32,0.002,34x34x2-8c5-2p-16c5-2p-32c5-800-10,True,super,100,0.02,0.2,-65,8,150,250,30,"['Downsample(time_factor=0.001,spatial_factor=1)', 'ToFrame(sensor_size=(34,34,2),time_window=1,event_count=None,n_time_bins=None,n_event_bins=None,overlap=0,include_incomplete=True)']"
2,6 12 2021 17:43:47,nmnist_izhi_1l.py,cuda,202.9047496318817,"(0.194, 0.28)","(2.2525338232517242, 2.2429914093017578)",10,64,0.002,100,True,super,100,0.02,0.2,-65,8,150,250,30,"['Downsample(time_factor=0.001,spatial_factor=1)', 'ToFrame(sensor_size=(34,34,2),time_window=1,event_count=None,n_time_bins=None,n_event_bins=None,overlap=0,include_incomplete=False)']"
3,6 12 2021 17:49:41,nmnist_izhi_rec.py,cuda,98.26191592216492,"(0.1290625, 0.16796875)","(2.291183953285217, 2.254426097869873)",1,128,0.002,100,True,super,100,0.02,0.2,-65,8,150,250,30,"['Downsample(time_factor=0.001,spatial_factor=1)', 'ToFrame(sensor_size=(34,34,2),time_window=1,event_count=None,n_time_bins=None,n_event_bins=None,overlap=0,include_incomplete=False)']"
4,2 1 2022 11:53:07,nmnist_izhi_1l.py,cuda,1328.9142355918884,"(0.0608, 0.047)","(7.116499873656261, 7.411757141113282)",5,128,0.002,100,False,super,50,0.01,0.2,-55,8,150,250,20,"['Downsample(time_factor=0.001,spatial_factor=1)', 'ToFrame(sensor_size=(34,34,2),time_window=1,event_count=None,n_time_bins=None,n_event_bins=None,overlap=0,include_incomplete=False)']"
5,12 1 2022 23:58:42,nmnist_izhi_1l.py,cpu,51117.10041952133,"(0.09911666666666667, 0.099)","(4.106343605879273, 4.160573670196533)",10,128,0.002,100,False,super,25,0.02,0.25,-65,2,150,250,30,"['Downsample(time_factor=0.001,spatial_factor=1)', 'ToFrame(sensor_size=(34,34,2),time_window=1,event_count=None,n_time_bins=None,n_event_bins=None,overlap=0,include_incomplete=False)']"
6,14 1 2022 05:54:03,nmnist_izhi_1l.py,cpu,51647.300189971924,"(0.09698333333333334, 0.1065)","(11.731232830202147, 11.822778350830077)",10,128,0.002,100,False,super,100,0.02,0.2,-65,8,150,250,30,"['Downsample(time_factor=0.001,spatial_factor=1)', 'ToFrame(sensor_size=(34,34,2),time_window=1,event_count=None,n_time_bins=None,n_event_bins=None,overlap=0,include_incomplete=False)']"
7,31 1 2022 23:50:59,nmnist_izhi_1l.py,cpu,13213.284642219543,"(0.7053, 0.706)","(1.1437232275359548, 1.145710756778717)",10,32,0.002,100,False,super,100,0.01,0.25,-65,2,140,500,30,"['Downsample(time_factor=0.001,spatial_factor=1)', 'ToFrame(sensor_size=(34,34,2),time_window=1,event_count=None,n_time_bins=None,n_event_bins=None,overlap=0,include_incomplete=False)']"
8,1 2 2022 14:07:21,nmnist_izhi_1l.py,cpu,13194.725989341736,"(0.7081, 0.678)","(1.1876157592660703, 1.2200944709777832)",10,32,0.002,100,False,super,100,0.01,0.25,-65,2,140,500,25,"['Downsample(time_factor=0.001,spatial_factor=1)', 'ToFrame(sensor_size=(34,34,2),time_window=1,event_count=None,n_time_bins=None,n_event_bins=None,overlap=0,include_incomplete=False)']"
9,2 2 2022 00:32:23,nmnist_izhi_1l.py,cpu,13312.182894468307,"(0.7165, 0.709)","(1.1863397738804071, 1.1691676692962647)",10,32,0.002,100,False,super,100,0.02,0.25,-65,2,140,500,30,"['Downsample(time_factor=0.001,spatial_factor=1)', 'ToFrame(sensor_size=(34,34,2),time_window=1,event_count=None,n_time_bins=None,n_event_bins=None,overlap=0,include_incomplete=False)']"
10,2 2 2022 05:52:19,nmnist_izhi_2l.py,cpu,19187.994559288025,"(0.0976, 0.103)","(5.96652647710075, 6.629683841705322)",10,32,0.002,"(100, 100)",False,super,100,0.01,0.25,-65,2,145,500,30,"['Downsample(time_factor=0.001,spatial_factor=1)', 'ToFrame(sensor_size=(34,34,2),time_window=1,event_count=None,n_time_bins=None,n_event_bins=None,overlap=0,include_incomplete=False)']"
11,2 2 2022 13:03:21,nmnist_izhi_3l.py,cpu,25849.948614358902,"(0.0972, 0.105)","(5.450249930921073, 5.261411275863647)",10,32,0.002,"(100, 100, 100)",False,super,100,0.02,0.25,-65,2,150,500,30,"['Downsample(time_factor=0.001,spatial_factor=1)', 'ToFrame(sensor_size=(34,34,2),time_window=1,event_count=None,n_time_bins=None,n_event_bins=None,overlap=0,include_incomplete=False)']"
12,2 2 2022 17:09:25,nmnist_izhi_rec.py,cpu,14753.62423157692,"(0.7688, 0.777)","(1.0651412219666063, 1.0250198669433594)",10,32,0.002,100,False,super,100,0.02,0.25,-65,2,140,500,30,"['Downsample(time_factor=0.001,spatial_factor=1)', 'ToFrame(sensor_size=(34,34,2),time_window=1,event_count=None,n_time_bins=None,n_event_bins=None,overlap=0,include_incomplete=False)']"
13,3 2 2022 06:51:29,nmnist_izhi_cnn.py,cpu,49313.0002682209,"(0.0969, 0.083)","(8.006216697418651, 10.326621532440186)",10,32,0.002,34x34x2-8c3-2p-12c3-2p-16c3-1024-10,False,super,100,0.02,0.25,-65,2,150,500,30,"['Downsample(time_factor=0.001,spatial_factor=1)', 'ToFrame(sensor_size=(34,34,2),time_window=1,event_count=None,n_time_bins=None,n_event_bins=None,overlap=0,include_incomplete=False)']"
14,4 2 2022 02:38:35,nmnist_izhi_1l.py,cpu,13390.10413980484,"(0.1121, 0.104)","(3.019476581305361, 2.9603123054504397)",10,32,0.002,100,False,super,100,0.02,0.25,-65,2,140,500,30,"['Downsample(time_factor=0.001,spatial_factor=1)', 'ToFrame(sensor_size=(34,34,2),time_window=1,event_count=None,n_time_bins=None,n_event_bins=None,overlap=0,include_incomplete=False)']"
15,4 2 2022 06:40:27,nmnist_izhi_rec.py,cpu,14502.989893198013,"(0.1144, 0.126)","(2.3009551363631178, 2.300892951965332)",10,32,0.002,100,False,super,100,0.02,0.25,-65,2,140,500,30,"['Downsample(time_factor=0.001,spatial_factor=1)', 'ToFrame(sensor_size=(34,34,2),time_window=1,event_count=None,n_time_bins=None,n_event_bins=None,overlap=0,include_incomplete=False)']"
16,7 2 2022 01:19:32,nmnist_izhi_1l.py,cpu,12812.853884935379,"(0.1089, 0.113)","(2.3013767784776777, 2.3027483043670656)",10,32,0.002,100,False,super,100,0.02,0.25,-65,2,140,500,15,"['Downsample(time_factor=0.001,spatial_factor=1)', 'ToFrame(sensor_size=(34,34,2),time_window=1,event_count=None,n_time_bins=None,n_event_bins=None,overlap=0,include_incomplete=False)']"
17,7 2 2022 05:06:53,nmnist_izhi_rec.py,cpu,13627.14464211464,"(0.111, 0.125)","(2.3212299213622707, 2.428521587371826)",10,32,0.002,100,False,super,100,0.02,0.25,-65,2,140,500,30,"['Downsample(time_factor=0.001,spatial_factor=1)', 'ToFrame(sensor_size=(34,34,2),time_window=1,event_count=None,n_time_bins=None,n_event_bins=None,overlap=0,include_incomplete=False)']"
18,7 2 2022 14:01:22,nmnist_izhi_1l.py,cpu,13065.613276720047,"(0.7493, 0.789)","(0.9332904194871458, 0.8763834934234619)",10,32,0.002,100,False,super,100,0.02,0.25,-65,2,140,500,-10,"['Downsample(time_factor=0.001,spatial_factor=1)', 'ToFrame(sensor_size=(34,34,2),time_window=1,event_count=None,n_time_bins=None,n_event_bins=None,overlap=0,include_incomplete=False)']"
19,7 2 2022 17:51:10,nmnist_izhi_rec.py,cpu,13779.76392173767,"(0.7569, 0.81)","(1.0764558159124356, 1.043220404624939)",10,32,0.002,100,False,super,100,0.02,0.25,-65,2,140,500,0,"['Downsample(time_factor=0.001,spatial_factor=1)', 'ToFrame(sensor_size=(34,34,2),time_window=1,event_count=None,n_time_bins=None,n_event_bins=None,overlap=0,include_incomplete=False)']"
20,8 2 2022 00:57:09,nmnist_izhi_1l.py,cpu,12798.492397069931,"(0.1542, 0.151)","(6.171726224521478, 6.2874082145690915)",10,32,0.002,100,False,super,100,0.02,0.25,-80,2,140,500,30,"['Downsample(time_factor=0.001,spatial_factor=1)', 'ToFrame(sensor_size=(34,34,2),time_window=1,event_count=None,n_time_bins=None,n_event_bins=None,overlap=0,include_incomplete=False)']"
21,9 2 2022 00:28:23,nmnist_izhi_rec.py,cpu,13565.510750055313,"(0.1165, 0.106)","(2.3004488632701836, 2.3036244564056396)",10,32,0.002,100,False,super,100,0.1,0.25,-55,2,140,500,-40,"['Downsample(time_factor=0.001,spatial_factor=1)', 'ToFrame(sensor_size=(34,34,2),time_window=1,event_count=None,n_time_bins=None,n_event_bins=None,overlap=0,include_incomplete=False)']"
22,9 2 2022 04:02:48,nmnist_izhi_1l.py,cpu,12855.641379117966,"(0.117, 0.13)","(2.3002236468342545, 2.2990577812194823)",10,32,0.002,100,False,super,100,0.1,0.25,-55,2,140,500,-40,"['Downsample(time_factor=0.001,spatial_factor=1)', 'ToFrame(sensor_size=(34,34,2),time_window=1,event_count=None,n_time_bins=None,n_event_bins=None,overlap=0,include_incomplete=False)']"
23,9 2 2022 09:18:28,nmnist_izhi_2l.py,cpu,18931.093761205673,"(0.1102, 0.097)","(2.3009915885072165, 2.3038686351776123)",10,32,0.002,"(100, 100)",False,super,100,0.1,0.25,-55,2,140,500,-40,"['Downsample(time_factor=0.001,spatial_factor=1)', 'ToFrame(sensor_size=(34,34,2),time_window=1,event_count=None,n_time_bins=None,n_event_bins=None,overlap=0,include_incomplete=False)']"
24,9 2 2022 15:01:57,nmnist_izhi_rec.py,cpu,13826.19771361351,"(0.4788, 0.569)","(1.6076011718652499, 1.54702321434021)",10,32,0.002,100,False,super,100,0.1,0.25,-70,2,140,500,-45,"['Downsample(time_factor=0.001,spatial_factor=1)', 'ToFrame(sensor_size=(34,34,2),time_window=1,event_count=None,n_time_bins=None,n_event_bins=None,overlap=0,include_incomplete=False)']"
25,9 2 2022 18:37:08,nmnist_izhi_1l.py,cpu,12897.91747879982,"(0.1119, 0.108)","(2.301275439155749, 2.301833278656006)",10,32,0.002,100,False,super,100,0.1,0.25,-55,2,140,500,-30,"['Downsample(time_factor=0.001,spatial_factor=1)', 'ToFrame(sensor_size=(34,34,2),time_window=1,event_count=None,n_time_bins=None,n_event_bins=None,overlap=0,include_incomplete=False)']"
26,10 2 2022 01:06:59,nmnist_izhi_rec.py,cpu,13523.722688436508,"(0.5123, 0.493)","(1.6198504062506338, 1.6508689527511597)",10,32,0.002,100,False,super,100,0.1,0.25,-75,2,140,500,-40,"['Downsample(time_factor=0.001,spatial_factor=1)', 'ToFrame(sensor_size=(34,34,2),time_window=1,event_count=None,n_time_bins=None,n_event_bins=None,overlap=0,include_incomplete=False)']"
27,10 2 2022 04:41:11,nmnist_izhi_1l.py,cpu,12843.944367647171,"(0.6393, 0.616)","(1.4364281127247185, 1.4377531213760375)",10,32,0.002,100,False,super,100,0.1,0.25,-75,2,140,500,-45,"['Downsample(time_factor=0.001,spatial_factor=1)', 'ToFrame(sensor_size=(34,34,2),time_window=1,event_count=None,n_time_bins=None,n_event_bins=None,overlap=0,include_incomplete=False)']"
28,10 2 2022 09:54:05,nmnist_izhi_2l.py,cpu,18767.040738105774,"(0.2571, 0.258)","(2.204500329380218, 2.1824848518371582)",10,32,0.002,"(100, 100)",False,super,100,0.1,0.25,-75,2,140,500,-45,"['Downsample(time_factor=0.001,spatial_factor=1)', 'ToFrame(sensor_size=(34,34,2),time_window=1,event_count=None,n_time_bins=None,n_event_bins=None,overlap=0,include_incomplete=False)']"
29,10 2 2022 16:51:27,nmnist_izhi_3l.py,cpu,25032.997740268707,"(0.1039, 0.1)","(2.3093049891840534, 2.3053528137207033)",10,32,0.002,"(100, 100, 100)",False,super,100,0.1,0.25,-75,2,140,500,-50,"['Downsample(time_factor=0.001,spatial_factor=1)', 'ToFrame(sensor_size=(34,34,2),time_window=1,event_count=None,n_time_bins=None,n_event_bins=None,overlap=0,include_incomplete=False)']"
30,10 2 2022 23:17:47,nmnist_izhi_rec.py,cpu,14229.115757226944,"(0.1869, 0.259)","(2.767065899821516, 1.9174093055725097)",10,32,0.002,100,False,super,100,0.1,0.25,-80,2,140,500,-50,"['Downsample(time_factor=0.001,spatial_factor=1)', 'ToFrame(sensor_size=(34,34,2),time_window=1,event_count=None,n_time_bins=None,n_event_bins=None,overlap=0,include_incomplete=False)']"
31,11 2 2022 02:59:50,nmnist_izhi_1l.py,cpu,13315.831539154053,"(0.696, 0.672)","(1.3389176480686322, 1.3325296745300292)",10,32,0.002,100,False,super,100,0.1,0.25,-75,2,140,500,-50,"['Downsample(time_factor=0.001,spatial_factor=1)', 'ToFrame(sensor_size=(34,34,2),time_window=1,event_count=None,n_time_bins=None,n_event_bins=None,overlap=0,include_incomplete=False)']"
32,11 2 2022 08:19:16,nmnist_izhi_2l.py,cpu,19157.43700861931,"(0.1114, 0.121)","(2.3101689472746925, 2.30730917930603)",10,32,0.002,"(100, 100)",False,super,100,0.1,0.25,-80,2,140,500,-50,"['Downsample(time_factor=0.001,spatial_factor=1)', 'ToFrame(sensor_size=(34,34,2),time_window=1,event_count=None,n_time_bins=None,n_event_bins=None,overlap=0,include_incomplete=False)']"
33,11 2 2022 15:16:17,nmnist_izhi_3l.py,cpu,25011.81931567192,"(0.0966, 0.094)","(2.390984264044716, 2.788163932800293)",10,32,0.002,"(100, 100, 100)",False,super,100,0.1,0.25,-85,2,140,500,-50,"['Downsample(time_factor=0.001,spatial_factor=1)', 'ToFrame(sensor_size=(34,34,2),time_window=1,event_count=None,n_time_bins=None,n_event_bins=None,overlap=0,include_incomplete=False)']"
34,13 2 2022 01:55:32,nmnist_izhi_rec.py,cpu,13654.183867931366,"(0.7041, 0.593)","(1.1035210848235475, 1.3030942192077637)",10,32,0.002,100,False,super,100,0.1,0.25,-70,2,140,500,-50,"['Downsample(time_factor=0.001,spatial_factor=1)', 'ToFrame(sensor_size=(34,34,2),time_window=1,event_count=None,n_time_bins=None,n_event_bins=None,overlap=0,include_incomplete=False)']"
35,13 2 2022 05:31:20,nmnist_izhi_1l.py,cpu,12939.619210720062,"(0.6662, 0.7)","(1.1926202126585257, 1.2503509936332702)",10,32,0.002,100,False,super,100,0.1,0.25,-70,2,140,500,-50,"['Downsample(time_factor=0.001,spatial_factor=1)', 'ToFrame(sensor_size=(34,34,2),time_window=1,event_count=None,n_time_bins=None,n_event_bins=None,overlap=0,include_incomplete=False)']"
36,13 2 2022 10:46:04,nmnist_izhi_2l.py,cpu,18874.685429811478,"(0.4919, 0.485)","(1.6728390173409313, 1.649060525894165)",10,32,0.002,"(100, 100)",False,super,100,0.1,0.25,-75,2,140,500,-45,"['Downsample(time_factor=0.001,spatial_factor=1)', 'ToFrame(sensor_size=(34,34,2),time_window=1,event_count=None,n_time_bins=None,n_event_bins=None,overlap=0,include_incomplete=False)']"
37,13 2 2022 17:42:08,nmnist_izhi_3l.py,cpu,24955.70451784134,"(0.1007, 0.105)","(2.31233975681634, 2.302526319503784)",10,32,0.002,"(100, 100, 100)",False,super,100,0.1,0.25,-75,2,140,500,-45,"['Downsample(time_factor=0.001,spatial_factor=1)', 'ToFrame(sensor_size=(34,34,2),time_window=1,event_count=None,n_time_bins=None,n_event_bins=None,overlap=0,include_incomplete=False)']"
38,14 2 2022 14:16:25,nmnist_izhi_rec.py,cpu,13866.111300468445,"(0.8129, 0.811)","(0.7702632984414268, 0.7852753934860229)",10,32,0.002,100,False,super,100,0.1,0.25,-65,2,140,500,-35,"['Downsample(time_factor=0.001,spatial_factor=1)', 'ToFrame(sensor_size=(34,34,2),time_window=1,event_count=None,n_time_bins=None,n_event_bins=None,overlap=0,include_incomplete=False)']"
39,14 2 2022 17:54:11,nmnist_izhi_1l.py,cpu,13055.335803508759,"(0.821, 0.85)","(0.7613189085223042, 0.6998859686851502)",10,32,0.002,100,False,super,100,0.1,0.25,-65,2,140,500,-40,"['Downsample(time_factor=0.001,spatial_factor=1)', 'ToFrame(sensor_size=(34,34,2),time_window=1,event_count=None,n_time_bins=None,n_event_bins=None,overlap=0,include_incomplete=False)']"
40,14 2 2022 23:05:26,nmnist_izhi_2l.py,cpu,18666.68656039238,"(0.3801, 0.394)","(2.053399328225718, 2.0519038581848146)",10,32,0.002,"(100, 100)",False,super,100,0.1,0.25,-70,2,140,500,-45,"['Downsample(time_factor=0.001,spatial_factor=1)', 'ToFrame(sensor_size=(34,34,2),time_window=1,event_count=None,n_time_bins=None,n_event_bins=None,overlap=0,include_incomplete=False)']"
41,15 2 2022 05:57:27,nmnist_izhi_3l.py,cpu,24712.576739549637,"(0.1066, 0.108)","(2.3067797220553072, 2.3095325832366944)",10,32,0.002,"(100, 100, 100)",False,super,100,0.1,0.25,-80,2,140,500,-45,"['Downsample(time_factor=0.001,spatial_factor=1)', 'ToFrame(sensor_size=(34,34,2),time_window=1,event_count=None,n_time_bins=None,n_event_bins=None,overlap=0,include_incomplete=False)']"
42,15 2 2022 13:47:42,nmnist_izhi_rec.py,cpu,13874.488308429718,"(0.72, 0.741)","(1.0970909747833641, 0.9753001322746276)",10,32,0.002,100,False,super,100,0.1,0.25,-65,2,140,500,-30,"['Downsample(time_factor=0.001,spatial_factor=1)', 'ToFrame(sensor_size=(34,34,2),time_window=1,event_count=None,n_time_bins=None,n_event_bins=None,overlap=0,include_incomplete=False)']"
43,15 2 2022 17:33:40,nmnist_izhi_1l.py,cpu,13549.15178155899,"(0.8099, 0.828)","(0.7563314379785008, 0.7361159853935242)",10,32,0.002,100,False,super,100,0.1,0.25,-65,2,140,500,-35,"['Downsample(time_factor=0.001,spatial_factor=1)', 'ToFrame(sensor_size=(34,34,2),time_window=1,event_count=None,n_time_bins=None,n_event_bins=None,overlap=0,include_incomplete=False)']"
44,15 2 2022 23:00:01,nmnist_izhi_2l.py,cpu,19572.232812166214,"(0.1129, 0.122)","(2.3088459161142953, 2.30151824760437)",10,32,0.002,"(100, 100)",False,super,100,0.1,0.25,-75,2,140,500,-35,"['Downsample(time_factor=0.001,spatial_factor=1)', 'ToFrame(sensor_size=(34,34,2),time_window=1,event_count=None,n_time_bins=None,n_event_bins=None,overlap=0,include_incomplete=False)']"
45,16 2 2022 05:55:50,nmnist_izhi_3l.py,cpu,24939.91037106514,"(0.1152, 0.098)","(2.301133250276121, 2.303032081604004)",10,32,0.002,"(100, 100, 100)",False,super,100,0.1,0.25,-70,2,140,500,-40,"['Downsample(time_factor=0.001,spatial_factor=1)', 'ToFrame(sensor_size=(34,34,2),time_window=1,event_count=None,n_time_bins=None,n_event_bins=None,overlap=0,include_incomplete=False)']"
46,16 2 2022 12:48:55,nmnist_izhi_cnn.py,cpu,24776.47634077072,"(0.1113, 0.108)","(2.302974897451675, 2.3055574531555174)",5,32,0.002,34x34x2-8c3-2p-12c3-2p-16c3-1024-10,False,super,100,0.1,0.25,-70,2,140,500,-30,"['Downsample(time_factor=0.001,spatial_factor=1)', 'ToFrame(sensor_size=(34,34,2),time_window=1,event_count=None,n_time_bins=None,n_event_bins=None,overlap=0,include_incomplete=False)']"
47,17 2 2022 00:07:33,nmnist_izhi_rec.py,cpu,13425.888542175293,"(0.8055, 0.807)","(0.7977412893368413, 0.9170909106731415)",10,32,0.002,100,False,super,100,0.1,0.25,-65,8,140,500,-30,"['Downsample(time_factor=0.001,spatial_factor=1)', 'ToFrame(sensor_size=(34,34,2),time_window=1,event_count=None,n_time_bins=None,n_event_bins=None,overlap=0,include_incomplete=False)']"
48,17 2 2022 03:41:48,nmnist_izhi_1l.py,cpu,12845.81948184967,"(0.7967, 0.815)","(0.7932805112375619, 0.8017809481620789)",10,32,0.002,100,False,super,100,0.1,0.25,-65,8,140,500,-35,"['Downsample(time_factor=0.001,spatial_factor=1)', 'ToFrame(sensor_size=(34,34,2),time_window=1,event_count=None,n_time_bins=None,n_event_bins=None,overlap=0,include_incomplete=False)']"
49,17 2 2022 08:53:53,nmnist_izhi_2l.py,cpu,18717.669122457504,"(0.1159, 0.125)","(2.301664639585696, 2.298706014633179)",10,32,0.002,"(100, 100)",False,super,100,0.1,0.25,-65,8,140,500,-35,"['Downsample(time_factor=0.001,spatial_factor=1)', 'ToFrame(sensor_size=(34,34,2),time_window=1,event_count=None,n_time_bins=None,n_event_bins=None,overlap=0,include_incomplete=False)']"
50,17 2 2022 15:53:15,nmnist_izhi_3l.py,cpu,25152.614075899124,"(0.1107, 0.119)","(2.3021431030175936, 2.302993158340454)",10,32,0.002,"(100, 100, 100)",False,super,100,0.1,0.25,-65,8,140,500,-45,"['Downsample(time_factor=0.001,spatial_factor=1)', 'ToFrame(sensor_size=(34,34,2),time_window=1,event_count=None,n_time_bins=None,n_event_bins=None,overlap=0,include_incomplete=False)']"
51,17 2 2022 22:42:13,nmnist_izhi_cnn.py,cpu,24526.494026184082,"(0.1072, 0.089)","(2.305626021406521, 2.3020618190765383)",5,32,0.002,34x34x2-8c3-2p-12c3-2p-16c3-1024-10,False,super,100,0.1,0.25,-65,8,140,500,-45,"['Downsample(time_factor=0.001,spatial_factor=1)', 'ToFrame(sensor_size=(34,34,2),time_window=1,event_count=None,n_time_bins=None,n_event_bins=None,overlap=0,include_incomplete=False)']"
52,19 2 2022 18:10:43,nmnist_izhi_rec.py,cpu,13942.76290345192,"(0.8224, 0.835)","(0.6702487429681296, 0.7412834599018097)",10,32,0.002,100,False,super,100,0.1,0.25,-65,8,140,500,-40,"['Downsample(time_factor=0.001,spatial_factor=1)', 'ToFrame(sensor_size=(34,34,2),time_window=1,event_count=None,n_time_bins=None,n_event_bins=None,overlap=0,include_incomplete=False)']"
53,19 2 2022 21:44:25,nmnist_izhi_1l.py,cpu,12813.828064203262,"(0.8271, 0.837)","(0.6381305469491612, 0.5993209934234619)",10,32,0.002,100,False,super,100,0.1,0.25,-65,8,140,500,-45,"['Downsample(time_factor=0.001,spatial_factor=1)', 'ToFrame(sensor_size=(34,34,2),time_window=1,event_count=None,n_time_bins=None,n_event_bins=None,overlap=0,include_incomplete=False)']"
54,20 2 2022 02:54:13,nmnist_izhi_2l.py,cpu,18580.556285381317,"(0.1066, 0.114)","(2.30300675337307, 2.302290761947632)",10,32,0.002,"(100, 100)",False,super,100,0.1,0.25,-65,8,140,500,-50,"['Downsample(time_factor=0.001,spatial_factor=1)', 'ToFrame(sensor_size=(34,34,2),time_window=1,event_count=None,n_time_bins=None,n_event_bins=None,overlap=0,include_incomplete=False)']"
55,20 2 2022 09:45:39,nmnist_izhi_3l.py,cpu,24677.6060860157,"(0.1063, 0.08)","(2.3183467898505947, 2.304123352050781)",10,32,0.002,"(100, 100, 100)",False,super,100,0.1,0.28,-65,8,140,500,-45,"['Downsample(time_factor=0.001,spatial_factor=1)', 'ToFrame(sensor_size=(34,34,2),time_window=1,event_count=None,n_time_bins=None,n_event_bins=None,overlap=0,include_incomplete=False)']"
56,20 2 2022 18:46:19,nmnist_izhi_rec.py,cpu,13701.950397968292,"(0.8153, 0.805)","(0.7093207372453647, 0.7238144416809082)",10,32,0.002,100,False,super,100,0.1,0.25,-68,8,140,500,-40,"['Downsample(time_factor=0.001,spatial_factor=1)', 'ToFrame(sensor_size=(34,34,2),time_window=1,event_count=None,n_time_bins=None,n_event_bins=None,overlap=0,include_incomplete=False)']"
57,20 2 2022 22:18:55,nmnist_izhi_1l.py,cpu,12748.471633672714,"(0.8446, 0.83)","(0.6057349599588412, 0.6422604417800903)",10,32,0.002,100,False,super,100,0.1,0.25,-68,8,140,500,-45,"['Downsample(time_factor=0.001,spatial_factor=1)', 'ToFrame(sensor_size=(34,34,2),time_window=1,event_count=None,n_time_bins=None,n_event_bins=None,overlap=0,include_incomplete=False)']"
58,21 2 2022 03:31:25,nmnist_izhi_2l.py,cpu,18742.03878593445,"(0.5101, 0.514)","(1.7244244844387895, 1.6979830713272095)",10,32,0.002,"(100, 100)",False,super,100,0.1,0.25,-72,8,140,500,-45,"['Downsample(time_factor=0.001,spatial_factor=1)', 'ToFrame(sensor_size=(34,34,2),time_window=1,event_count=None,n_time_bins=None,n_event_bins=None,overlap=0,include_incomplete=False)']"
59,21 2 2022 07:37:41,nmnist_izhi_3l.py,cpu,14768.501212358475,"(0.1064, 0.103)","(2.3061643606557634, 2.318146318435669)",5,32,0.002,"(100, 100, 100)",False,super,100,0.1,0.25,-85,8,140,500,-50,"['Downsample(time_factor=0.001,spatial_factor=1)', 'ToFrame(sensor_size=(34,34,2),time_window=1,event_count=None,n_time_bins=None,n_event_bins=None,overlap=0,include_incomplete=False)']"
60,21 2 2022 22:29:02,nmnist_izhi_rec.py,cpu,13592.36292052269,"(0.8448, 0.862)","(0.5822833636983896, 0.5715054454803467)",10,32,0.002,100,False,super,100,0.1,0.25,-65,8,140,500,-45,"['Downsample(time_factor=0.001,spatial_factor=1)', 'ToFrame(sensor_size=(34,34,2),time_window=1,event_count=None,n_time_bins=None,n_event_bins=None,overlap=0,include_incomplete=False)']"
61,22 2 2022 02:02:37,nmnist_izhi_1l.py,cpu,12807.160986185074,"(0.8778, 0.859)","(0.4610364298089244, 0.5439194867610931)",10,32,0.002,100,False,super,100,0.1,0.25,-65,8,140,500,-50,"['Downsample(time_factor=0.001,spatial_factor=1)', 'ToFrame(sensor_size=(34,34,2),time_window=1,event_count=None,n_time_bins=None,n_event_bins=None,overlap=0,include_incomplete=False)']"
62,22 2 2022 07:15:48,nmnist_izhi_2l.py,cpu,18783.450712680817,"(0.3678, 0.397)","(1.8077045861905374, 1.8205870475769044)",10,32,0.002,"(100, 100)",False,super,100,0.1,0.25,-75,8,140,500,-50,"['Downsample(time_factor=0.001,spatial_factor=1)', 'ToFrame(sensor_size=(34,34,2),time_window=1,event_count=None,n_time_bins=None,n_event_bins=None,overlap=0,include_incomplete=False)']"
63,22 2 2022 11:31:28,nmnist_izhi_3l.py,cpu,15330.762751340866,"(0.1079, 0.11)","(2.3067122640701148, 2.310046377182007)",5,32,0.002,"(100, 100, 100)",False,super,100,0.1,0.25,-75,8,140,500,-55,"['Downsample(time_factor=0.001,spatial_factor=1)', 'ToFrame(sensor_size=(34,34,2),time_window=1,event_count=None,n_time_bins=None,n_event_bins=None,overlap=0,include_incomplete=False)']"
64,22 2 2022 15:58:01,nmnist_izhi_rec.py,cpu,15538.967877864838,"(0.821, 0.826)","(0.6783946487850274, 0.6678474960327149)",10,32,0.002,100,False,super,100,0.1,0.25,-65,2,140,500,-45,"['Downsample(time_factor=0.001,spatial_factor=1)', 'ToFrame(sensor_size=(34,34,2),time_window=1,event_count=None,n_time_bins=None,n_event_bins=None,overlap=0,include_incomplete=False)']"
65,22 2 2022 20:05:53,nmnist_izhi_1l.py,cpu,14863.10127210617,"(0.8413, 0.836)","(0.5899566660483424, 0.6336735737323761)",10,32,0.002,100,False,super,100,0.1,0.25,-65,2,140,500,-50,"['Downsample(time_factor=0.001,spatial_factor=1)', 'ToFrame(sensor_size=(34,34,2),time_window=1,event_count=None,n_time_bins=None,n_event_bins=None,overlap=0,include_incomplete=False)']"
66,23 2 2022 01:39:06,nmnist_izhi_2l.py,cpu,19985.33061981201,"(0.1071, 0.119)","(2.3022835361310086, 2.3019707355499266)",10,32,0.002,"(100, 100)",False,super,100,0.1,0.25,-68,2,140,500,-50,"['Downsample(time_factor=0.001,spatial_factor=1)', 'ToFrame(sensor_size=(34,34,2),time_window=1,event_count=None,n_time_bins=None,n_event_bins=None,overlap=0,include_incomplete=False)']"
67,23 2 2022 08:30:56,nmnist_izhi_3l.py,cpu,24702.085503816605,"(0.1451, 0.181)","(2.291597950572785, 2.2479639663696287)",10,32,0.002,"(100, 100, 100)",False,super,100,0.1,0.25,-75,2,140,500,-55,"['Downsample(time_factor=0.001,spatial_factor=1)', 'ToFrame(sensor_size=(34,34,2),time_window=1,event_count=None,n_time_bins=None,n_event_bins=None,overlap=0,include_incomplete=False)']"
68,23 2 2022 17:36:42,nmnist_izhi_cnn.py,cpu,32737.472487211227,"(0.111, 0.105)","(2.3024428713435943, 2.3018108158111574)",5,32,0.002,34x34x2-8c3-2p-12c3-2p-16c3-1024-10,False,super,100,0.1,0.25,-75,2,140,500,-55,"['Downsample(time_factor=0.001,spatial_factor=1)', 'ToFrame(sensor_size=(34,34,2),time_window=1,event_count=None,n_time_bins=None,n_event_bins=None,overlap=0,include_incomplete=False)']"
69,24 2 2022 16:04:39,nmnist_izhi_rec.py,cpu,18517.204573631287,"(0.8495, 0.855)","(0.5738907305006021, 0.543705176115036)",10,32,0.002,100,False,super,100,0.1,0.25,-65,8,140,500,-45,"['Downsample(time_factor=0.001,spatial_factor=1)', 'ToFrame(sensor_size=(34,34,2),time_window=1,event_count=None,n_time_bins=None,n_event_bins=None,overlap=0,include_incomplete=False)']"
70,24 2 2022 21:16:59,nmnist_izhi_1l.py,cpu,18724.3536529541,"(0.8766, 0.865)","(0.4713843003058205, 0.5095443923473358)",10,32,0.002,100,False,super,100,0.1,0.25,-65,8,140,500,-50,"['Downsample(time_factor=0.001,spatial_factor=1)', 'ToFrame(sensor_size=(34,34,2),time_window=1,event_count=None,n_time_bins=None,n_event_bins=None,overlap=0,include_incomplete=False)']"
71,25 2 2022 03:23:44,nmnist_izhi_2l.py,cpu,21992.256314516068,"(0.2406, 0.265)","(2.2250879382173094, 2.21292635345459)",10,32,0.002,"(100, 100)",False,super,100,0.1,0.25,-75,8,140,500,-40,"['Downsample(time_factor=0.001,spatial_factor=1)', 'ToFrame(sensor_size=(34,34,2),time_window=1,event_count=None,n_time_bins=None,n_event_bins=None,overlap=0,include_incomplete=False)']"
72,25 2 2022 10:31:27,nmnist_izhi_3l.py,cpu,25654.28259897232,"(0.1086, 0.119)","(2.301396801829719, 2.2982772731781007)",10,32,0.002,"(100, 100, 100)",False,super,100,0.1,0.25,-85,8,140,500,-55,"['Downsample(time_factor=0.001,spatial_factor=1)', 'ToFrame(sensor_size=(34,34,2),time_window=1,event_count=None,n_time_bins=None,n_event_bins=None,overlap=0,include_incomplete=False)']"
73,25 2 2022 17:12:30,nmnist_izhi_rec.py,cpu,16610.38511824608,"(0.8932, 0.878)","(0.38674022707219324, 0.45637606000900266)",10,32,0.002,100,False,super,100,0.1,0.25,-65,8,140,500,-55,"['Downsample(time_factor=0.001,spatial_factor=1)', 'ToFrame(sensor_size=(34,34,2),time_window=1,event_count=None,n_time_bins=None,n_event_bins=None,overlap=0,include_incomplete=False)']"
74,25 2 2022 18:03:38,nmnist_izhi_1l.py,cpu,3058.719432592392,"(0.881, 0.891)","(0.4319657226578115, 0.39066018092632293)",10,32,0.002,100,False,super,100,0.1,0.25,-65,8,140,500,-55,"['Downsample(time_factor=0.001,spatial_factor=1)', 'ToFrame(sensor_size=(34,34,2),time_window=None,event_count=None,n_time_bins=50,n_event_bins=None,overlap=0,include_incomplete=False)']"
75,25 2 2022 19:16:16,nmnist_izhi_2l.py,cpu,4339.493614196777,"(0.4018, 0.438)","(1.7730309711858487, 1.7678762254714966)",10,32,0.002,"(100, 100)",False,super,100,0.1,0.25,-70,8,140,500,-45,"['Downsample(time_factor=0.001,spatial_factor=1)', 'ToFrame(sensor_size=(34,34,2),time_window=None,event_count=None,n_time_bins=50,n_event_bins=None,overlap=0,include_incomplete=False)']"
76,25 2 2022 20:33:35,nmnist_izhi_3l.py,cpu,4629.818023681641,"(0.5293, 0.584)","(1.5610688366829015, 1.4765588312149047)",10,32,0.002,"(100, 100, 100)",False,super,100,0.1,0.25,-80,8,140,500,-55,"['Downsample(time_factor=0.001,spatial_factor=1)', 'ToFrame(sensor_size=(34,34,2),time_window=None,event_count=None,n_time_bins=50,n_event_bins=None,overlap=0,include_incomplete=False)']"
77,25 2 2022 22:13:45,nmnist_izhi_cnn.py,cpu,6002.2200355529785,"(0.3212, 0.339)","(1.8655416318022024, 1.8409827785491943)",5,32,0.002,34x34x2-8c3-2p-12c3-2p-16c3-1024-10,False,super,100,0.1,0.25,-80,8,140,500,-55,"['Downsample(time_factor=0.001,spatial_factor=1)', 'ToFrame(sensor_size=(34,34,2),time_window=None,event_count=None,n_time_bins=50,n_event_bins=None,overlap=0,include_incomplete=False)']"
78,2 3 2022 11:00:27,nmnist_izhi_rec.py,cpu,3179.1677980422974,"(0.8831, 0.852)","(0.4356516721054388, 0.5304925718307495)",10,32,0.002,100,False,super,100,0.1,0.25,-65,8,140,500,-55,"['Downsample(time_factor=0.001,spatial_factor=1)', 'ToFrame(sensor_size=(34,34,2),time_window=None,event_count=None,n_time_bins=50,n_event_bins=None,overlap=0,include_incomplete=False)']"
79,2 3 2022 11:54:34,nmnist_izhi_1l.py,cpu,3239.023835659027,"(0.8946, 0.914)","(0.39076915902261156, 0.34772710037231447)",10,32,0.002,100,False,super,100,0.1,0.25,-65,8,140,500,-55,"['Downsample(time_factor=0.001,spatial_factor=1)', 'ToFrame(sensor_size=(34,34,2),time_window=None,event_count=None,n_time_bins=None,n_event_bins=50,overlap=0,include_incomplete=False)']"
80,2 3 2022 13:02:08,nmnist_izhi_2l.py,cpu,4046.646315574646,"(0.3516, 0.372)","(1.8297087601579416, 1.7937352542877196)",10,32,0.002,"(100, 100)",False,super,100,0.1,0.25,-75,8,140,500,-50,"['Downsample(time_factor=0.001,spatial_factor=1)', 'ToFrame(sensor_size=(34,34,2),time_window=None,event_count=None,n_time_bins=50,n_event_bins=None,overlap=0,include_incomplete=False)']"
81,2 3 2022 14:24:41,nmnist_izhi_3l.py,cpu,4945.450088500977,"(0.1073, 0.129)","(2.3023016864118486, 2.2999949703216553)",10,32,0.002,"(100, 100, 100)",False,super,100,0.1,0.25,-85,8,140,500,-55,"['Downsample(time_factor=0.001,spatial_factor=1)', 'ToFrame(sensor_size=(34,34,2),time_window=None,event_count=None,n_time_bins=50,n_event_bins=None,overlap=0,include_incomplete=False)']"
82,2 3 2022 15:50:52,nmnist_izhi_cnn.py,cpu,5163.176677465439,"(0.2243, 0.263)","(2.2196241853336174, 2.1821894855499266)",5,32,0.002,34x34x2-8c3-2p-12c3-2p-16c3-1024-10,False,super,100,0.1,0.25,-85,8,140,500,-55,"['Downsample(time_factor=0.001,spatial_factor=1)', 'ToFrame(sensor_size=(34,34,2),time_window=None,event_count=None,n_time_bins=50,n_event_bins=None,overlap=0,include_incomplete=False)']"
83,7 3 2022 20:06:15,nmnist_izhi_rec.py,cpu,9219.271620988846,"(0.912, 0.874)","(0.31233414441061474, 0.4152221367359161)",10,32,0.002,100,False,super,50,0.1,0.25,-65,8,140,500,-55,"['Downsample(time_factor=0.001,spatial_factor=1)', 'ToFrame(sensor_size=(34,34,2),time_window=None,event_count=None,n_time_bins=None,n_event_bins=200,overlap=0,include_incomplete=False)']"
84,7 3 2022 22:34:32,nmnist_izhi_1l.py,cpu,8884.231381177902,"(0.9161, 0.9)","(0.29668160363698537, 0.3613704235255718)",10,32,0.002,100,False,super,50,0.1,0.25,-65,8,140,500,-55,"['Downsample(time_factor=0.001,spatial_factor=1)', 'ToFrame(sensor_size=(34,34,2),time_window=None,event_count=None,n_time_bins=None,n_event_bins=200,overlap=0,include_incomplete=False)']"
85,8 3 2022 02:04:58,nmnist_izhi_2l.py,cpu,12618.570762634277,"(0.8274, 0.845)","(0.6713766404234183, 0.6137958023548126)",10,32,0.002,"(100, 100)",False,super,50,0.1,0.25,-80,8,140,500,-45,"['Downsample(time_factor=0.001,spatial_factor=1)', 'ToFrame(sensor_size=(34,34,2),time_window=None,event_count=None,n_time_bins=None,n_event_bins=200,overlap=0,include_incomplete=False)']"
86,8 3 2022 06:38:18,nmnist_izhi_3l.py,cpu,16392.780129909515,"(0.8123, 0.732)","(0.751609058140185, 0.8994261145591735)",10,32,0.002,"(100, 100, 100)",False,super,50,0.1,0.25,-85,8,140,500,-60,"['Downsample(time_factor=0.001,spatial_factor=1)', 'ToFrame(sensor_size=(34,34,2),time_window=None,event_count=None,n_time_bins=None,n_event_bins=200,overlap=0,include_incomplete=False)']"
87,8 3 2022 17:41:06,nmnist_izhi_cnn.py,cpu,39759.74646091461,"(0.2679, 0.251)","(2.075991166666293, 2.073026819229126)",10,32,0.002,34x34x2-8c3-2p-12c3-2p-16c3-1024-10,False,super,50,0.1,0.25,-85,8,140,500,-60,"['Downsample(time_factor=0.001,spatial_factor=1)', 'ToFrame(sensor_size=(34,34,2),time_window=None,event_count=None,n_time_bins=None,n_event_bins=200,overlap=0,include_incomplete=False)']"
88,8 3 2022 22:20:54,nmnist_izhi_rec.py,cpu,11572.82212972641,"(0.9197, 0.905)","(0.2832123417847644, 0.3576696937084198)",10,32,0.002,100,False,super,50,0.1,0.25,-65,8,140,500,-55,"['Downsample(time_factor=0.001,spatial_factor=1)', 'ToFrame(sensor_size=(34,34,2),time_window=None,event_count=None,n_time_bins=None,n_event_bins=250,overlap=0,include_incomplete=False)']"
89,9 3 2022 01:25:39,nmnist_izhi_1l.py,cpu,11069.443538427353,"(0.9058, 0.896)","(0.33875256579238383, 0.36560676670074466)",10,32,0.002,100,False,super,50,0.1,0.25,-65,8,140,500,-55,"['Downsample(time_factor=0.001,spatial_factor=1)', 'ToFrame(sensor_size=(34,34,2),time_window=None,event_count=None,n_time_bins=None,n_event_bins=250,overlap=0,include_incomplete=False)']"
90,9 3 2022 04:57:15,nmnist_izhi_2l.py,cpu,12688.68413233757,"(0.8858, 0.863)","(0.5890349228732502, 0.6615636982917785)",10,32,0.002,"(100, 100)",False,super,50,0.1,0.25,-80,8,140,500,-50,"['Downsample(time_factor=0.001,spatial_factor=1)', 'ToFrame(sensor_size=(34,34,2),time_window=None,event_count=None,n_time_bins=None,n_event_bins=200,overlap=0,include_incomplete=False)']"
91,9 3 2022 09:33:37,nmnist_izhi_3l.py,cpu,16569.590658426285,"(0.1018, 0.101)","(2.302278506489227, 2.3008117122650145)",10,32,0.002,"(100, 100, 100)",False,super,50,0.1,0.25,-85,8,140,500,-65,"['Downsample(time_factor=0.001,spatial_factor=1)', 'ToFrame(sensor_size=(34,34,2),time_window=None,event_count=None,n_time_bins=None,n_event_bins=200,overlap=0,include_incomplete=False)']"
92,9 3 2022 11:11:09,nmnist_izhi_cnn.py,cpu,5844.365386962891,"(0.1005, 0.117)","(2.30357476469046, 2.304061243057251)",10,32,0.002,34x34x2-8c3-2p-12c3-2p-16c3-1024-10,False,super,50,0.1,0.25,-85,8,140,500,-50,"['Downsample(time_factor=0.001,spatial_factor=1)', 'ToFrame(sensor_size=(34,34,2),time_window=None,event_count=250,n_time_bins=None,n_event_bins=None,overlap=0,include_incomplete=False)']"
93,13 3 2022 17:12:38,nmnist_izhi_rec.py,cpu,4794.037360906601,"(0.7845, 0.775)","(0.7550866789520739, 0.7943871221542358)",10,32,0.002,100,False,super,25,0.1,0.25,-60,8,140,500,-55,"['Downsample(time_factor=0.001,spatial_factor=1)', 'ToFrame(sensor_size=(34,34,2),time_window=None,event_count=None,n_time_bins=None,n_event_bins=50,overlap=0,include_incomplete=False)']"
94,13 3 2022 18:25:38,nmnist_izhi_1l.py,cpu,4372.282880306244,"(0.8271, 0.834)","(0.7634349862417094, 0.7717405576705932)",10,32,0.002,100,False,super,25,0.1,0.25,-60,8,140,500,-55,"['Downsample(time_factor=0.001,spatial_factor=1)', 'ToFrame(sensor_size=(34,34,2),time_window=None,event_count=None,n_time_bins=None,n_event_bins=50,overlap=0,include_incomplete=False)']"
95,13 3 2022 20:10:58,nmnist_izhi_2l.py,cpu,6312.348979949951,"(0.9945, 0.861)","(0.02809148706709996, 0.5282465176582336)",10,32,0.002,"(100, 100)",False,super,25,0.1,0.25,-60,8,140,500,-55,"['Downsample(time_factor=0.001,spatial_factor=1)', 'ToFrame(sensor_size=(34,34,2),time_window=None,event_count=None,n_time_bins=None,n_event_bins=50,overlap=0,include_incomplete=False)']"
96,13 3 2022 22:26:35,nmnist_izhi_3l.py,cpu,8129.230218410492,"(0.9801, 0.869)","(0.07408509894419973, 0.5337988510131836)",10,32,0.002,"(100, 100, 100)",False,super,25,0.1,0.25,-60,8,140,500,-55,"['Downsample(time_factor=0.001,spatial_factor=1)', 'ToFrame(sensor_size=(34,34,2),time_window=None,event_count=None,n_time_bins=None,n_event_bins=50,overlap=0,include_incomplete=False)']"
97,14 3 2022 03:27:11,nmnist_izhi_cnn.py,cpu,18028.203048229218,"(0.9353, 0.901)","(0.21265131586228317, 0.33706878662109374)",10,32,0.002,34x34x2-8c3-2p-12c3-2p-16c3-1024-10,False,super,25,0.1,0.25,-60,8,140,500,-55,"['Downsample(time_factor=0.001,spatial_factor=1)', 'ToFrame(sensor_size=(34,34,2),time_window=None,event_count=None,n_time_bins=None,n_event_bins=50,overlap=0,include_incomplete=False)']"
98,14 3 2022 12:58:09,nmnist_izhi_rec.py,cpu,5359.675611972809,"(0.839, 0.792)","(0.6040701358653486, 0.7426647000312805)",10,32,0.002,100,False,super,25,0.1,0.25,-60,8,140,500,-55,"['Downsample(time_factor=0.001,spatial_factor=1)', 'ToFrame(sensor_size=(34,34,2),time_window=None,event_count=None,n_time_bins=None,n_event_bins=50,overlap=0,include_incomplete=False)']"
99,14 3 2022 14:24:43,nmnist_izhi_1l.py,cpu,5167.883356809616,"(0.8216, 0.824)","(0.6632099520093717, 0.673278244972229)",10,32,0.002,100,False,super,25,0.1,0.25,-60,8,140,500,-55,"['Downsample(time_factor=0.001,spatial_factor=1)', 'ToFrame(sensor_size=(34,34,2),time_window=None,event_count=None,n_time_bins=None,n_event_bins=50,overlap=0,include_incomplete=False)']"
100,14 3 2022 16:20:54,nmnist_izhi_2l.py,cpu,6963.229538202286,"(0.7965, 0.694)","(0.39174397684895573, 0.9185846481323242)",10,32,0.002,"(100, 100)",False,super,25,0.1,0.25,-65,8,140,500,-55,"['Downsample(time_factor=0.001,spatial_factor=1)', 'ToFrame(sensor_size=(34,34,2),time_window=None,event_count=None,n_time_bins=None,n_event_bins=50,overlap=0,include_incomplete=False)']"
101,14 3 2022 18:46:31,nmnist_izhi_3l.py,cpu,8728.287068128586,"(0.6718, 0.601)","(0.696483443529842, 1.1107382698059083)",10,32,0.002,"(100, 100, 100)",False,super,25,0.1,0.25,-65,8,140,500,-55,"['Downsample(time_factor=0.001,spatial_factor=1)', 'ToFrame(sensor_size=(34,34,2),time_window=None,event_count=None,n_time_bins=None,n_event_bins=50,overlap=0,include_incomplete=False)']"
102,15 3 2022 00:06:39,nmnist_izhi_cnn.py,cpu,19189.230241298676,"(0.1095, 0.097)","(2.306796338230657, 2.3060202522277833)",10,32,0.002,34x34x2-8c3-2p-12c3-2p-16c3-1024-10,False,super,25,0.1,0.25,-65,8,140,500,-55,"['Downsample(time_factor=0.001,spatial_factor=1)', 'ToFrame(sensor_size=(34,34,2),time_window=None,event_count=None,n_time_bins=None,n_event_bins=50,overlap=0,include_incomplete=False)']"
103,16 3 2022 16:13:01,nmnist_izhi_rec.py,cpu,5535.787205696106,"(0.8915, 0.885)","(0.39190525771044316, 0.4000337070822716)",10,32,0.003,100,False,super,100,0.1,0.25,-65,8,140,500,-55,"['Downsample(time_factor=0.001,spatial_factor=1)', 'ToFrame(sensor_size=(34,34,2),time_window=None,event_count=None,n_time_bins=None,n_event_bins=50,overlap=0,include_incomplete=False)']"
104,16 3 2022 17:33:28,nmnist_izhi_1l.py,cpu,4819.510776996613,"(0.8832, 0.873)","(0.4537440656949156, 0.49123300766944883)",10,32,0.003,100,False,super,100,0.1,0.25,-65,8,140,500,-50,"['Downsample(time_factor=0.001,spatial_factor=1)', 'ToFrame(sensor_size=(34,34,2),time_window=None,event_count=None,n_time_bins=None,n_event_bins=50,overlap=0,include_incomplete=False)']"
105,16 3 2022 19:25:17,nmnist_izhi_2l.py,cpu,6700.729134321213,"(0.7895, 0.77)","(0.6770035032742321, 0.8364107282161712)",10,32,0.003,"(100, 100)",False,super,100,0.1,0.25,-65,8,140,500,-55,"['Downsample(time_factor=0.001,spatial_factor=1)', 'ToFrame(sensor_size=(34,34,2),time_window=None,event_count=None,n_time_bins=None,n_event_bins=50,overlap=0,include_incomplete=False)']"
106,16 3 2022 21:47:53,nmnist_izhi_3l.py,cpu,8548.379301786423,"(0.7965, 0.742)","(0.6419434765942942, 0.814569078207016)",10,32,0.003,"(100, 100, 100)",False,super,100,0.1,0.25,-60,8,140,500,-55,"['Downsample(time_factor=0.001,spatial_factor=1)', 'ToFrame(sensor_size=(34,34,2),time_window=None,event_count=None,n_time_bins=None,n_event_bins=50,overlap=0,include_incomplete=False)']"
107,17 3 2022 03:04:51,nmnist_izhi_cnn.py,cpu,19009.805584192276,"(0.8951, 0.865)","(0.3361893371580698, 0.42008682203292846)",10,32,0.003,34x34x2-8c3-2p-12c3-2p-16c3-1024-10,False,super,100,0.1,0.25,-60,8,140,500,-55,"['Downsample(time_factor=0.001,spatial_factor=1)', 'ToFrame(sensor_size=(34,34,2),time_window=None,event_count=None,n_time_bins=None,n_event_bins=50,overlap=0,include_incomplete=False)']"
108,17 3 2022 19:56:35,nmnist_izhi_rec.py,cpu,26741.238530397415,"(0.9628, 0.864)","(0.16426435523446958, 0.46605327224731447)",10,64,0.002,100,False,super,25,0.1,0.25,-55,8,140,500,-55,"['Downsample(time_factor=0.001,spatial_factor=1)', 'ToFrame(sensor_size=(34,34,2),time_window=None,event_count=None,n_time_bins=None,n_event_bins=5,overlap=0,include_incomplete=False)']"
109,18 3 2022 03:10:44,nmnist_izhi_1l.py,cpu,26041.501003980637,"(0.9771, 0.862)","(0.11947120633569493, 0.47967525482177736)",10,64,0.002,100,False,super,25,0.1,0.25,-55,8,140,500,-55,"['Downsample(time_factor=0.001,spatial_factor=1)', 'ToFrame(sensor_size=(34,34,2),time_window=None,event_count=None,n_time_bins=None,n_event_bins=5,overlap=0,include_incomplete=False)']"
110,18 3 2022 14:37:22,nmnist_izhi_2l.py,cpu,41186.946633815765,"(0.9521, 0.806)","(0.16074533013116782, 0.7358434801101684)",10,64,0.002,"(100, 100)",False,super,25,0.1,0.25,-55,8,140,500,-55,"['Downsample(time_factor=0.001,spatial_factor=1)', 'ToFrame(sensor_size=(34,34,2),time_window=None,event_count=None,n_time_bins=None,n_event_bins=5,overlap=0,include_incomplete=False)']"
111,19 3 2022 05:38:25,nmnist_izhi_3l.py,cpu,54045.52994155884,"(0.9152, 0.819)","(0.2900096731865482, 0.7313179550170898)",10,64,0.002,"(100, 100, 100)",False,super,25,0.1,0.25,-55,8,140,500,-55,"['Downsample(time_factor=0.001,spatial_factor=1)', 'ToFrame(sensor_size=(34,34,2),time_window=None,event_count=None,n_time_bins=None,n_event_bins=5,overlap=0,include_incomplete=False)']"
