/work/home/joschroeder/senv/lib/python3.7/site-packages/torch/utils/data/dataloader.py:481: UserWarning: This DataLoader will create 4 worker processes in total. Our suggested max number of worker in current system is 2, which is smaller than what this DataLoader is going to create. Please be aware that excessive worker creation might get DataLoader running slow or even freeze, lower the worker number to avoid potential slowness/freeze if necessary.
  cpuset_checked))
Multi-processing is handled by Slurm.
GPU available: True, used: True
TPU available: False, using: 0 TPU cores
IPU available: False, using: 0 IPUs
initializing distributed: GLOBAL_RANK: 0, MEMBER: 1/1
----------------------------------------------------------------------------------------------------
distributed_backend=nccl
All distributed processes registered. Starting with 1 processes
----------------------------------------------------------------------------------------------------

LOCAL_RANK: 0 - CUDA_VISIBLE_DEVICES: [0]
Set SLURM handle signals.

  | Name   | Type        | Params
---------------------------------------
0 | error  | spikeLoss   | 0     
1 | slayer | spikeLayer  | 0     
2 | conv1  | _convLayer  | 144   
3 | conv2  | _convLayer  | 864   
4 | conv3  | _convLayer  | 1.7 K 
5 | pool1  | _poolLayer  | 4     
6 | pool2  | _poolLayer  | 4     
7 | fc1    | _denseLayer | 180 K 
---------------------------------------
182 K     Trainable params
8         Non-trainable params
182 K     Total params
0.732     Total estimated model params size (MB)
[W reducer.cpp:1303] Warning: find_unused_parameters=True was specified in DDP constructor, but did not find any unused parameters in the forward pass. This flag results in an extra traversal of the autograd graph every iteration,  which can adversely affect performance. If your model indeed never has any unused parameters in the forward pass, consider turning this flag off. Note that this warning may be a false positive if your model has flow control causing later iterations to have unused parameters. (function operator())
/work/home/joschroeder/senv/lib/python3.7/site-packages/torch/utils/data/dataloader.py:481: UserWarning: This DataLoader will create 4 worker processes in total. Our suggested max number of worker in current system is 2, which is smaller than what this DataLoader is going to create. Please be aware that excessive worker creation might get DataLoader running slow or even freeze, lower the worker number to avoid potential slowness/freeze if necessary.
  cpuset_checked))
Multi-processing is handled by Slurm.
GPU available: True, used: True
TPU available: False, using: 0 TPU cores
IPU available: False, using: 0 IPUs
initializing distributed: GLOBAL_RANK: 0, MEMBER: 1/1
----------------------------------------------------------------------------------------------------
distributed_backend=nccl
All distributed processes registered. Starting with 1 processes
----------------------------------------------------------------------------------------------------

LOCAL_RANK: 0 - CUDA_VISIBLE_DEVICES: [0]
Set SLURM handle signals.

  | Name   | Type        | Params
---------------------------------------
0 | error  | spikeLoss   | 0     
1 | slayer | spikeLayer  | 0     
2 | conv1  | _convLayer  | 144   
3 | conv2  | _convLayer  | 864   
4 | conv3  | _convLayer  | 1.7 K 
5 | pool1  | _poolLayer  | 4     
6 | pool2  | _poolLayer  | 4     
7 | fc1    | _denseLayer | 180 K 
---------------------------------------
182 K     Trainable params
8         Non-trainable params
182 K     Total params
0.732     Total estimated model params size (MB)
/work/home/joschroeder/senv/lib/python3.7/site-packages/pytorch_lightning/callbacks/model_checkpoint.py:631: UserWarning: Checkpoint directory /work/home/joschroeder/dvsgesture/slayer/lightning_logs/version_232087/checkpoints exists and is not empty.
  rank_zero_warn(f"Checkpoint directory {dirpath} exists and is not empty.")
[W reducer.cpp:1303] Warning: find_unused_parameters=True was specified in DDP constructor, but did not find any unused parameters in the forward pass. This flag results in an extra traversal of the autograd graph every iteration,  which can adversely affect performance. If your model indeed never has any unused parameters in the forward pass, consider turning this flag off. Note that this warning may be a false positive if your model has flow control causing later iterations to have unused parameters. (function operator())
