+----+--------------------+-------------------+------------------------+--------------------+------------------------+------------------------------------------+--------+------------+-----------------------------------------------------------------------------------+----------------------------------------+---------+----------+-------+-------+--------+----------+--------+----------+-----------------------------+------------------------+----------------------------------------------------------------------------------------------------------------------------------------------------------------------------------------------+
| n  |        date        |      filename     |         device         |      runtime       | accuracy (train, test) |            loss (train, test)            | epochs | batch_size |                                        opt                                        |                 layers                 | tSample |   type   | theta | tauSr | tauRef | scaleRef | tauRho | scaleRho |        tgtSpikeRegion       |     tgtSpikeCount      |                                                                                          transform                                                                                           |
+----+--------------------+-------------------+------------------------+--------------------+------------------------+------------------------------------------+--------+------------+-----------------------------------------------------------------------------------+----------------------------------------+---------+----------+-------+-------+--------+----------+--------+----------+-----------------------------+------------------------+----------------------------------------------------------------------------------------------------------------------------------------------------------------------------------------------+
| 0  | 31 1 2022 10:36:47 |  dvsgesture_1l.py | <class 'torch.device'> |  9.87514328956604  |     (0.6875, 0.5)      | (1.3013673052191734, 2.187386631965637)  |   2    |     2      | ['amsgrad:False', 'betas:(0.9,0.999)', 'eps:1e-08', 'lr:0.002', 'weight_decay:0'] |                  100                   |  10000  | SRMALPHA |   1   |  1.0  |  5.0   |    2     |   1    |    1     | {'start': 0, 'stop': 10000} | {True: 800, False: 50} | ['Downsample(time_factor=0.001,spatial_factor=1)', 'ToFrame(sensor_size=(128,128,2),time_window=10,event_count=None,n_time_bins=None,n_event_bins=None,overlap=0,include_incomplete=False)'] |
| 1  | 31 1 2022 10:39:54 |  dvsgesture_1l.py | <class 'torch.device'> | 10.816287517547607 |     (0.75, 0.125)      |  (1.359727755188942, 2.469723165035248)  |   2    |     2      | ['amsgrad:False', 'betas:(0.9,0.999)', 'eps:1e-08', 'lr:0.002', 'weight_decay:0'] |                  100                   |  10000  | SRMALPHA |   1   |  1.0  |  5.0   |    2     |   1    |    1     | {'start': 0, 'stop': 10000} | {True: 800, False: 50} | ['Downsample(time_factor=0.001,spatial_factor=1)', 'ToFrame(sensor_size=(128,128,2),time_window=10,event_count=None,n_time_bins=None,n_event_bins=None,overlap=0,include_incomplete=False)'] |
| 2  | 31 1 2022 10:59:32 | dvsgesture_cnn.py | <class 'torch.device'> | 88.54900121688843  |      (None, None)      |        (None, 1.9760867953300476)        |   25   |     1      | ['amsgrad:False', 'betas:(0.9,0.999)', 'eps:1e-08', 'lr:0.002', 'weight_decay:0'] | 128x128x2-8c3-2p-12c3-2p-16c3-16384-11 |  10000  | SRMALPHA |   1   |  1.0  |  5.0   |    2     |   1    |    1     | {'start': 0, 'stop': 10000} | {True: 800, False: 50} | ['Downsample(time_factor=0.001,spatial_factor=1)', 'ToFrame(sensor_size=(128,128,2),time_window=10,event_count=None,n_time_bins=None,n_event_bins=None,overlap=0,include_incomplete=False)'] |
| 3  | 31 1 2022 11:01:59 | dvsgesture_cnn.py | <class 'torch.device'> | 127.69015717506409 |    (0.0625, 0.0625)    |  (2.083320200443268, 2.200110837817192)  |   5    |     1      | ['amsgrad:False', 'betas:(0.9,0.999)', 'eps:1e-08', 'lr:0.002', 'weight_decay:0'] | 128x128x2-8c3-2p-12c3-2p-16c3-16384-11 |  10000  | SRMALPHA |   1   |  1.0  |  5.0   |    2     |   1    |    1     | {'start': 0, 'stop': 10000} | {True: 800, False: 50} | ['Downsample(time_factor=0.001,spatial_factor=1)', 'ToFrame(sensor_size=(128,128,2),time_window=10,event_count=None,n_time_bins=None,n_event_bins=None,overlap=0,include_incomplete=False)'] |
| 4  | 31 1 2022 11:05:19 | dvsgesture_cnn.py | <class 'torch.device'> | 148.7606077194214  |    (0.09375, 0.125)    |  (5.325143767520785, 6.581265479326248)  |   5    |     1      | ['amsgrad:False', 'betas:(0.9,0.999)', 'eps:1e-08', 'lr:0.002', 'weight_decay:0'] | 128x128x2-8c3-2p-16c3-2p-32c3-32768-11 |  10000  | SRMALPHA |   1   |  1.0  |  5.0   |    2     |   1    |    1     | {'start': 0, 'stop': 10000} | {True: 800, False: 50} | ['Downsample(time_factor=0.001,spatial_factor=1)', 'ToFrame(sensor_size=(128,128,2),time_window=10,event_count=None,n_time_bins=None,n_event_bins=None,overlap=0,include_incomplete=False)'] |
| 5  | 31 1 2022 11:09:06 |  dvsgesture_1l.py |         cuda:0         | 9.530448198318481  |     (0.625, 0.25)      | (1.3739403150975704, 1.8526590764522552) |   2    |     1      | ['amsgrad:False', 'betas:(0.9,0.999)', 'eps:1e-08', 'lr:0.002', 'weight_decay:0'] |                  100                   |  10000  | SRMALPHA |   1   |  1.0  |  5.0   |    2     |   1    |    1     | {'start': 0, 'stop': 10000} | {True: 800, False: 50} | ['Downsample(time_factor=0.001,spatial_factor=1)', 'ToFrame(sensor_size=(128,128,2),time_window=10,event_count=None,n_time_bins=None,n_event_bins=None,overlap=0,include_incomplete=False)'] |
| 6  | 31 1 2022 12:04:12 | dvsgesture_rec.py | <class 'torch.device'> | 10.89955997467041  |    (0.4375, 0.125)     | (1.6530843041837215, 2.0470221042633057) |   2    |     1      | ['amsgrad:False', 'betas:(0.9,0.999)', 'eps:1e-08', 'lr:0.002', 'weight_decay:0'] |                  100                   |  10000  | SRMALPHA |   1   |  1.0  |  5.0   |    2     |   1    |    1     | {'start': 0, 'stop': 10000} | {True: 800, False: 50} | ['Downsample(time_factor=0.001,spatial_factor=1)', 'ToFrame(sensor_size=(128,128,2),time_window=10,event_count=None,n_time_bins=None,n_event_bins=None,overlap=0,include_incomplete=False)'] |
| 7  | 31 1 2022 12:04:42 | dvsgesture_rec.py | <class 'torch.device'> | 17.08204412460327  |   (0.390625, 0.3125)   | (1.741226696409285, 1.8253964185714722)  |   2    |     1      | ['amsgrad:False', 'betas:(0.9,0.999)', 'eps:1e-08', 'lr:0.002', 'weight_decay:0'] |                  100                   |  10000  | SRMALPHA |   1   |  1.0  |  5.0   |    2     |   1    |    1     | {'start': 0, 'stop': 10000} | {True: 800, False: 50} | ['Downsample(time_factor=0.001,spatial_factor=1)', 'ToFrame(sensor_size=(128,128,2),time_window=10,event_count=None,n_time_bins=None,n_event_bins=None,overlap=0,include_incomplete=False)'] |
| 8  | 31 1 2022 12:06:09 | dvsgesture_rec.py | <class 'torch.device'> | 41.75805902481079  |   (0.359375, 0.3125)   |  (2.011253137141466, 2.222427010536194)  |   5    |     2      | ['amsgrad:False', 'betas:(0.9,0.999)', 'eps:1e-08', 'lr:0.002', 'weight_decay:0'] |                  100                   |  10000  | SRMALPHA |   1   |  1.0  |  5.0   |    2     |   1    |    1     | {'start': 0, 'stop': 10000} | {True: 800, False: 50} | ['Downsample(time_factor=0.001,spatial_factor=1)', 'ToFrame(sensor_size=(128,128,2),time_window=10,event_count=None,n_time_bins=None,n_event_bins=None,overlap=0,include_incomplete=False)'] |
| 9  | 31 1 2022 12:07:06 | dvsgesture_rec.py | <class 'torch.device'> | 40.06415128707886  |   (0.59375, 0.1875)    | (1.6165323071181774, 1.9562226235866547) |   5    |     2      | ['amsgrad:False', 'betas:(0.9,0.999)', 'eps:1e-08', 'lr:0.002', 'weight_decay:0'] |                  100                   |  10000  | SRMALPHA |   1   |  1.0  |  5.0   |    2     |   1    |    1     | {'start': 0, 'stop': 10000} | {True: 800, False: 50} | ['Downsample(time_factor=0.001,spatial_factor=1)', 'ToFrame(sensor_size=(128,128,2),time_window=10,event_count=None,n_time_bins=None,n_event_bins=None,overlap=0,include_incomplete=False)'] |
| 10 | 31 1 2022 12:11:32 | dvsgesture_rec.py | <class 'torch.device'> | 45.97524929046631  |   (0.890625, 0.3125)   | (1.2276861649006605, 1.9192397892475128) |   5    |     2      | ['amsgrad:False', 'betas:(0.9,0.999)', 'eps:1e-08', 'lr:0.002', 'weight_decay:0'] |                  100                   |  10000  | SRMALPHA |   1   |  1.0  |  5.0   |    2     |   1    |    1     | {'start': 0, 'stop': 10000} | {True: 800, False: 50} | ['Downsample(time_factor=0.001,spatial_factor=1)', 'ToFrame(sensor_size=(128,128,2),time_window=10,event_count=None,n_time_bins=None,n_event_bins=None,overlap=0,include_incomplete=False)'] |
+----+--------------------+-------------------+------------------------+--------------------+------------------------+------------------------------------------+--------+------------+-----------------------------------------------------------------------------------+----------------------------------------+---------+----------+-------+-------+--------+----------+--------+----------+-----------------------------+------------------------+----------------------------------------------------------------------------------------------------------------------------------------------------------------------------------------------+