
go

This is the Fraunhofer IMS AIRISC! :)
Build: May 16 2024 09:19:31

ISA:      rv32i + C F M U 
VENDORID: 0x00000000
ARCHID:   0x0000001f
IMPID:    0x00008000
HARTID:   0x00000000


Initializing CPU counters...
Starting TRNG... ok
TRNG data demo:
0xaa 0xaa 0xaa 0xaa 0xaa 0xaa 0xaa 0xaa 0xaa 0xaa 0xaa 0xaa 0xaa 0xaa 0xaa 0xaa 
0xaa 0xaa 0xaa 0xaa 0xaa 0xaa 0xaa 0xaa 0xaa 0xaa 0xaa 0xaa 0xaa 0xaa 0xaa 0xaa 
0xaa 0xaa 0xaa 0xaa 0xaa 0xaa 0xaa 0xaa 0xaa 0xaa 0xaa 0xaa 0xaa 0xaa 0xaa 0xaa 
0xaa 0xaa 0xaa 0xaa 0xaa 0xaa 0xaa 0xaa 0xaa 0xaa 0xaa 0xaa 0xaa 0xaa 0xaa 0xaa 
0xaa 0xaa 0xaa 0xaa 0xaa 0xaa 0xaa 0xaa 0xaa 0xaa 0xaa 0xaa 0xaa 0xaa 0xaa 0xaa 
0xaa 0xaa 0xaa 0xaa 0xaa 0xaa 0xaa 0xaa 0xaa 0xaa 0xaa 0xaa 0xaa 0xaa 0xaa 0xaa 
0xaa 0xaa 0xaa 0xaa 0xaa 0xaa 0xaa 0xaa 0xaa 0xaa 0xaa 0xaa 0xaa 0xaa 0xaa 0xaa 
0xaa 0xaa 0xaa 0xaa 0xaa 0xaa 0xaa 0xaa 0xaa 0xaa 0xaa 0xaa 0xaa 0xaa 0xaa 0xaa 
Configuring system tick timer...
Checking available external interrupt lines... 16
Configuring interrupts...
Enabling IRQs...

[HIL] CONFIG START
TMU_INT_READOUT_START='T%'
TMU_INT_READOUT_END='%T'
TMU_INT_READOUT_END_NEWLINE=TRUE
TMU_MODE_ON=87
TMU_MODE_OFF=82
TMU_BASE_ADDR=c0000a20
TMU_INT_DEBUG=1
TMU_INT_POST_FLUSH=0
TMU_REENTRANT_CHECK=0
TMU_POST_DATA=0
setup_done=80004674
data_gen_start=80004670
data_gen_done=8000466c
func_start=80004668
func_done=80004664
experiment_info=',int_array_reverse_sorted,radix_sortint_array_unsorted,radix_sortint_array_sorted,radix_sort[HIL] CONFIG END
[HIL] START
Cause 2147483665
T%11,1881202
%T
OCause 2147483665
T%11,1930476
%T
OCause 2147483665
T%11,1979757
%T
OCause 2147483665
T%11,2029037
%T
OCause 2147483665
T%11,2078327
%T
OCause 2147483665
T%11,2127597
%T
OCause 2147483665
T%11,2176885
%T
OCause 2147483665
T%11,2226162
%T
OCause 2147483665
T%11,2275432
%T
OCause 2147483665
T%11,2324718
%T
OCause 2147483665
T%11,2373983
%T
OCause 2147483665
T%11,2423275
%T
OCause 2147483665
T%11,2472547
%T
OCause 2147483665
T%11,2521820
%T
OCause 2147483665
T%11,2571114
%T
OCause 2147483665
T%11,2620396
%T
OCause 2147483665
T%11,2669671
%T
OCause 2147483665
T%11,2718945
%T
OCause 2147483665
T%11,2768229
%T
OCause 2147483665
T%11,2817494
%T
OCause 2147483665
T%11,2866785
%T
OCause 2147483665
T%11,2916064
%T
OCause 2147483665
T%11,2965338
%T
OCause 2147483665
T%11,3014624
%T
OCause 2147483665
T%11,3063904
%T
OCause 2147483665
T%11,3113172
%T
OCause 2147483665
T%11,3162452
%T
OCause 2147483665
T%11,3211731
%T
OCause 2147483665
T%11,3261013
%T
OCause 2147483665
T%11,3310291
%T
OCause 2147483665
T%11,3359570
%T
OCause 2147483665
T%11,3408842
%T
OCause 2147483665
T%11,3458138
%T
OCause 2147483665
T%11,3507417
%T
OCause 2147483665
T%11,3556683
%T
OCause 2147483665
T%11,3605965
%T
OCause 2147483665
T%11,3655252
%T
OCause 2147483665
T%11,3704522
%T
OCause 2147483665
T%11,3753806
%T
OCause 2147483665
T%11,3803083
%T
OCause 2147483665
T%11,3852358
%T
OCause 2147483665
T%11,3901635
%T
OCause 2147483665
T%11,3950924
%T
OCause 2147483665
T%11,4000208
%T
OCause 2147483665
T%11,4049479
%T
OCause 2147483665
T%11,4098754
%T
OCause 2147483665
T%11,4148036
%T
OCause 2147483665
T%11,4197319
%T
OCause 2147483665
T%11,4246595
%T
OCause 2147483665
T%11,4295879
%T
OCause 2147483665
T%11,4345143
%T
OCause 2147483665
T%11,4394428
%T
OCause 2147483665
T%11,4443710
%T
OCause 2147483665
T%11,4492984
%T
OCause 2147483665
T%11,4542260
%T
OCause 2147483665
T%11,4591552
%T
OCause 2147483665
T%11,4640833
%T
OCause 2147483665
T%11,4690095
%T
OCause 2147483665
T%11,4739391
%T
OCause 2147483665
T%11,4788662
%T
OCause 2147483665
T%11,4837944
%T
OCause 2147483665
T%11,4887214
%T
OCause 2147483665
T%11,4936493
%T
OCause 2147483665
T%11,4985777
%T
OCause 2147483665
T%11,5035063
%T
OCause 2147483665
T%11,5084332
%T
OCause 2147483665
T%11,5133612
%T
OCause 2147483665
T%11,5182896
%T
OCause 2147483665
T%11,5232177
%T
OCause 2147483665
T%11,5281460
%T
OCause 2147483665
T%11,5330725
%T
OCause 2147483665
T%11,5380007
%T
OCause 2147483665
T%11,5429297
%T
OCause 2147483665
T%11,5478571
%T
OCause 2147483665
T%11,5527849
%T
OCause 2147483665
T%11,5577129
%T
OCause 2147483665
T%11,5626412
%T
OCause 2147483665
T%11,5675692
%T
OCause 2147483665
T%11,5724968
%T
OCause 2147483665
T%11,5774251
%T
OCause 2147483665
T%11,5823519
%T
OCause 2147483665
T%11,5872801
%T
OCause 2147483665
T%11,5922078
%T
OCause 2147483665
T%11,5971364
%T
OCause 2147483665
T%11,6020644
%T
OCause 2147483665
T%11,6069919
%T
OCause 2147483665
T%11,6119189
%T
OCause 2147483665
T%11,6168473
%T
OCause 2147483665
T%11,6217750
%T
OCause 2147483665
T%11,6267033
%T
OCause 2147483665
T%11,6316320
%T
OCause 2147483665
T%11,6365586
%T
OCause 2147483665
T%11,6414872
%T
OCause 2147483665
T%11,6464148
%T
OCause 2147483665
T%11,6513428
%T
OCause 2147483665
T%11,6562702
%T
OCause 2147483665
T%11,6611977
%T
OCause 2147483665
T%11,6661273
%T
OCause 2147483665
T%11,6710537
%T
OCause 2147483665
T%11,6759830
%T
OCause 2147483665
T%11,6809110
%T
OCause 2147483665
T%11,6858388
%T
OCause 2147483665
T%11,6907659
%T
OCause 2147483665
T%11,6956945
%T
OCause 2147483665
T%11,7006209
%T
OCause 2147483665
T%11,7055500
%T
OCause 2147483665
T%11,7104766
%T
OCause 2147483665
T%11,7154062
%T
OCause 2147483665
T%11,7203331
%T
OCause 2147483665
T%11,7252610
%T
OCause 2147483665
T%11,7301887
%T
OCause 2147483665
T%11,7351178
%T
OCause 2147483665
T%11,7400440
%T
OCause 2147483665
T%11,7449728
%T
OCause 2147483665
T%11,7499011
%T
OCause 2147483665
T%11,7548283
%T
OCause 2147483665
T%11,7597561
%T
OCause 2147483665
T%11,7646851
%T
OCause 2147483665
T%11,7696119
%T
OCause 2147483665
T%11,7745400
%T
OCause 2147483665
T%11,7794678
%T
OCause 2147483665
T%11,7843952
%T
OCause 2147483665
T%11,7893239
%T
OCause 2147483665
T%11,7942515
%T
OCause 2147483665
T%11,7991793
%T
OCause 2147483665
T%11,8041070
%T
OCause 2147483665
T%11,8090348
%T
OCause 2147483665
T%11,8139642
%T
OCause 2147483665
T%11,8188909
%T
OCause 2147483665
T%11,8238195
%T
OCause 2147483665
T%11,8287463
%T
OCause 2147483665
T%11,8336760
%T
OCause 2147483665
T%11,8386023
%T
OCause 2147483665
T%11,8435310
%T
OCause 2147483665
T%11,8484590
%T
OCause 2147483665
T%11,8533876
%T
OCause 2147483665
T%11,8583154
%T
OCause 2147483665
T%11,8632424
%T
OCause 2147483665
T%11,8681704
%T
OCause 2147483665
T%11,8730983
%T
OCause 2147483665
T%11,8780267
%T
OCause 2147483665
T%11,8829543
%T
OCause 2147483665
T%11,8878818
%T
OCause 2147483665
T%11,8928094
%T
OCause 2147483665
T%11,8977380
%T
OCause 2147483665
T%11,9026649
%T
OCause 2147483665
T%11,9075927
%T
OCause 2147483665
T%11,9125211
%T
OCause 2147483665
T%11,9174486
%T
OCause 2147483665
T%11,9223768
%T
OCause 2147483665
T%11,9273054
%T
OCause 2147483665
T%11,9322339
%T
OCause 2147483665
T%11,9371614
%T
OCause 2147483665
T%11,9420895
%T
O[HIL] END
