0firingMaster,0adr,0we,0sel,0ack,0err
0,0,0,15,1,0
0,1,0,15,1,0
0,2,0,15,1,0
0,3,0,15,1,0
0,4,0,15,1,0
0,5,0,15,1,0
0,6,0,15,1,0
0,7,0,15,1,0
0,40,0,15,1,0
0,41,0,15,1,0
0,42,0,15,1,0
0,43,0,15,1,0
0,44,0,15,1,0
0,45,0,15,1,0
0,46,0,15,1,0
0,47,0,15,1,0
0,48,0,15,1,0
0,49,0,15,1,0
0,50,0,15,1,0
0,51,0,15,1,0
0,52,0,15,1,0
0,53,0,15,1,0
0,54,0,15,1,0
0,55,0,15,1,0
0,56,0,15,1,0
0,57,0,15,1,0
0,58,0,15,1,0
0,59,0,15,1,0
0,60,0,15,1,0
0,61,0,15,1,0
0,62,0,15,1,0
0,63,0,15,1,0
1,9080,0,15,1,0
1,9081,0,15,1,0
1,9082,0,15,1,0
1,9083,0,15,1,0
1,9084,0,15,1,0
1,9085,0,15,1,0
1,9086,0,15,1,0
1,9087,0,15,1,0
1,67108864,1,15,1,0
1,9088,0,15,1,0
1,9089,0,15,1,0
1,9090,0,15,1,0
1,9091,0,15,1,0
1,9092,0,15,1,0
1,9093,0,15,1,0
1,9094,0,15,1,0
1,9095,0,15,1,0
1,67108865,1,15,1,0
1,67108866,1,15,1,0
1,67108867,1,15,1,0
1,67108868,1,15,1,0
1,67108869,1,15,1,0
1,67108870,1,15,1,0
1,67108871,1,15,1,0
1,67108872,1,15,1,0
1,9096,0,15,1,0
1,9097,0,15,1,0
1,9098,0,15,1,0
1,9099,0,15,1,0
1,9100,0,15,1,0
1,9101,0,15,1,0
1,9102,0,15,1,0
1,9103,0,15,1,0
1,67108873,1,15,1,0
1,67108874,1,15,1,0
1,67108875,1,15,1,0
1,67108876,1,15,1,0
1,67108877,1,15,1,0
1,67108878,1,15,1,0
1,67108879,1,15,1,0
1,67108880,1,15,1,0
1,9104,0,15,1,0
1,9105,0,15,1,0
1,9106,0,15,1,0
1,9107,0,15,1,0
1,9108,0,15,1,0
1,9109,0,15,1,0
1,9110,0,15,1,0
1,9111,0,15,1,0
1,67108881,1,15,1,0
1,67108882,1,15,1,0
1,67108883,1,15,1,0
1,67108884,1,15,1,0
1,67108885,1,15,1,0
1,67108886,1,15,1,0
1,67108887,1,15,1,0
1,67108888,1,15,1,0
1,9112,0,15,1,0
1,9113,0,15,1,0
1,9114,0,15,1,0
1,9115,0,15,1,0
1,9116,0,15,1,0
1,9117,0,15,1,0
1,9118,0,15,1,0
1,9119,0,15,1,0
1,67108889,1,15,1,0
1,67108890,1,15,1,0
1,67108891,1,15,1,0
1,67108892,1,15,1,0
1,67108893,1,15,1,0
1,67108894,1,15,1,0
1,67108895,1,15,1,0
1,67108896,1,15,1,0
1,9120,0,15,1,0
1,9121,0,15,1,0
1,9122,0,15,1,0
1,9123,0,15,1,0
1,9124,0,15,1,0
1,9125,0,15,1,0
1,9126,0,15,1,0
1,9127,0,15,1,0
1,67108897,1,15,1,0
1,67108898,1,15,1,0
1,67108899,1,15,1,0
1,67108900,1,15,1,0
1,67108901,1,15,1,0
1,67108902,1,15,1,0
1,67108903,1,15,1,0
1,67108904,1,15,1,0
1,9128,0,15,1,0
1,9129,0,15,1,0
1,9130,0,15,1,0
1,9131,0,15,1,0
1,9132,0,15,1,0
1,9133,0,15,1,0
1,9134,0,15,1,0
1,9135,0,15,1,0
1,67108905,1,15,1,0
1,67108906,1,15,1,0
1,67108907,1,15,1,0
1,67108908,1,15,1,0
1,67108909,1,15,1,0
1,67108910,1,15,1,0
1,67108911,1,15,1,0
1,67108912,1,15,1,0
1,9136,0,15,1,0
1,9137,0,15,1,0
1,9138,0,15,1,0
1,9139,0,15,1,0
1,9140,0,15,1,0
1,9141,0,15,1,0
1,9142,0,15,1,0
1,9143,0,15,1,0
1,67108913,1,15,1,0
1,67108914,1,15,1,0
1,67108915,1,15,1,0
1,67108916,1,15,1,0
1,67108917,1,15,1,0
1,67108918,1,15,1,0
1,67108919,1,15,1,0
1,67108920,1,15,1,0
1,9144,0,15,1,0
1,9145,0,15,1,0
1,9146,0,15,1,0
1,9147,0,15,1,0
1,9148,0,15,1,0
1,9149,0,15,1,0
1,9150,0,15,1,0
1,9151,0,15,1,0
1,67108921,1,15,1,0
1,67108922,1,15,1,0
1,67108923,1,15,1,0
1,67108924,1,15,1,0
1,67108925,1,15,1,0
1,67108926,1,15,1,0
1,67108927,1,15,1,0
1,67108928,1,15,1,0
1,9152,0,15,1,0
1,9153,0,15,1,0
1,9154,0,15,1,0
1,9155,0,15,1,0
1,9156,0,15,1,0
1,9157,0,15,1,0
1,9158,0,15,1,0
1,9159,0,15,1,0
1,67108929,1,15,1,0
1,67108930,1,15,1,0
1,67108931,1,15,1,0
1,67108932,1,15,1,0
1,67108933,1,15,1,0
1,67108934,1,15,1,0
1,67108935,1,15,1,0
1,67108936,1,15,1,0
1,9160,0,15,1,0
1,9161,0,15,1,0
1,9162,0,15,1,0
1,9163,0,15,1,0
1,9164,0,15,1,0
1,9165,0,15,1,0
1,9166,0,15,1,0
1,9167,0,15,1,0
1,67108937,1,15,1,0
1,67108938,1,15,1,0
1,67108939,1,15,1,0
1,67108940,1,15,1,0
1,67108941,1,15,1,0
1,67108942,1,15,1,0
1,67108943,1,15,1,0
1,67108944,1,15,1,0
1,9168,0,15,1,0
1,9169,0,15,1,0
1,9170,0,15,1,0
1,9171,0,15,1,0
1,9172,0,15,1,0
1,9173,0,15,1,0
1,9174,0,15,1,0
1,9175,0,15,1,0
1,67108945,1,15,1,0
1,67108946,1,15,1,0
1,67108947,1,15,1,0
1,67108948,1,15,1,0
1,67108949,1,15,1,0
1,67108950,1,15,1,0
1,67108951,1,15,1,0
1,67108952,1,15,1,0
1,9176,0,15,1,0
1,9177,0,15,1,0
1,9178,0,15,1,0
1,9179,0,15,1,0
1,9180,0,15,1,0
1,9181,0,15,1,0
1,9182,0,15,1,0
1,9183,0,15,1,0
1,67108953,1,15,1,0
1,67108954,1,15,1,0
1,67108955,1,15,1,0
1,67108956,1,15,1,0
1,67108957,1,15,1,0
1,67108958,1,15,1,0
1,67108959,1,15,1,0
1,67108960,1,15,1,0
1,9184,0,15,1,0
1,9185,0,15,1,0
1,9186,0,15,1,0
1,9187,0,15,1,0
1,9188,0,15,1,0
1,9189,0,15,1,0
1,9190,0,15,1,0
1,9191,0,15,1,0
1,67108961,1,15,1,0
1,67108962,1,15,1,0
1,67108963,1,15,1,0
1,67108964,1,15,1,0
1,67108965,1,15,1,0
1,67108966,1,15,1,0
1,67108967,1,15,1,0
1,67108968,1,15,1,0
1,9192,0,15,1,0
1,9193,0,15,1,0
1,9194,0,15,1,0
1,9195,0,15,1,0
1,9196,0,15,1,0
1,9197,0,15,1,0
1,9198,0,15,1,0
1,9199,0,15,1,0
1,67108969,1,15,1,0
1,67108970,1,15,1,0
1,67108971,1,15,1,0
1,67108972,1,15,1,0
1,67108973,1,15,1,0
1,67108974,1,15,1,0
1,67108975,1,15,1,0
1,67108976,1,15,1,0
1,9200,0,15,1,0
1,9201,0,15,1,0
1,9202,0,15,1,0
1,9203,0,15,1,0
1,9204,0,15,1,0
1,9205,0,15,1,0
1,9206,0,15,1,0
1,9207,0,15,1,0
1,67108977,1,15,1,0
1,67108978,1,15,1,0
1,67108979,1,15,1,0
1,67108980,1,15,1,0
1,67108981,1,15,1,0
1,67108982,1,15,1,0
1,67108983,1,15,1,0
1,67108984,1,15,1,0
1,9208,0,15,1,0
1,9209,0,15,1,0
1,9210,0,15,1,0
1,9211,0,15,1,0
1,9212,0,15,1,0
1,9213,0,15,1,0
1,9214,0,15,1,0
1,9215,0,15,1,0
1,67108985,1,15,1,0
1,67108986,1,15,1,0
1,67108987,1,15,1,0
1,67108988,1,15,1,0
1,67108989,1,15,1,0
1,67108990,1,15,1,0
1,67108991,1,15,1,0
1,67108992,1,15,1,0
1,9216,0,15,1,0
1,9217,0,15,1,0
1,9218,0,15,1,0
1,9219,0,15,1,0
1,9220,0,15,1,0
1,9221,0,15,1,0
1,9222,0,15,1,0
1,9223,0,15,1,0
1,67108993,1,15,1,0
1,67108994,1,15,1,0
1,67108995,1,15,1,0
1,67108996,1,15,1,0
1,67108997,1,15,1,0
1,67108998,1,15,1,0
1,67108999,1,15,1,0
1,67109000,1,15,1,0
1,9224,0,15,1,0
1,9225,0,15,1,0
1,9226,0,15,1,0
1,9227,0,15,1,0
1,9228,0,15,1,0
1,9229,0,15,1,0
1,9230,0,15,1,0
1,9231,0,15,1,0
1,67109001,1,15,1,0
1,67109002,1,15,1,0
1,67109003,1,15,1,0
1,67109004,1,15,1,0
1,67109005,1,15,1,0
1,67109006,1,15,1,0
1,67109007,1,15,1,0
1,67109008,1,15,1,0
1,9232,0,15,1,0
1,9233,0,15,1,0
1,9234,0,15,1,0
1,9235,0,15,1,0
1,9236,0,15,1,0
1,9237,0,15,1,0
1,9238,0,15,1,0
1,9239,0,15,1,0
1,67109009,1,15,1,0
1,67109010,1,15,1,0
1,67109011,1,15,1,0
1,67109012,1,15,1,0
1,67109013,1,15,1,0
1,67109014,1,15,1,0
1,67109015,1,15,1,0
1,67109016,1,15,1,0
1,9240,0,15,1,0
1,9241,0,15,1,0
1,9242,0,15,1,0
1,9243,0,15,1,0
1,9244,0,15,1,0
1,9245,0,15,1,0
1,9246,0,15,1,0
1,9247,0,15,1,0
1,67109017,1,15,1,0
1,67109018,1,15,1,0
1,67109019,1,15,1,0
1,67109020,1,15,1,0
1,67109021,1,15,1,0
1,67109022,1,15,1,0
1,67109023,1,15,1,0
0,64,0,15,1,0
0,65,0,15,1,0
0,66,0,15,1,0
0,67,0,15,1,0
0,68,0,15,1,0
0,69,0,15,1,0
0,70,0,15,1,0
0,71,0,15,1,0
1,67109024,1,15,1,0
1,67109025,1,15,1,0
1,67109026,1,15,1,0
1,67109027,1,15,1,0
1,67109028,1,15,1,0
1,67109029,1,15,1,0
1,67109030,1,15,1,0
1,67109031,1,15,1,0
1,67109032,1,15,1,0
1,67109033,1,15,1,0
1,67109034,1,15,1,0
1,67109035,1,15,1,0
1,67109036,1,15,1,0
1,67109037,1,15,1,0
1,67109038,1,15,1,0
1,67109039,1,15,1,0
1,67109040,1,15,1,0
1,67109041,1,15,1,0
1,67109042,1,15,1,0
1,67109043,1,15,1,0
1,67109044,1,15,1,0
1,67109045,1,15,1,0
1,67109046,1,15,1,0
1,67109047,1,15,1,0
1,67109048,1,15,1,0
1,67109049,1,15,1,0
1,67109050,1,15,1,0
1,67109051,1,15,1,0
1,67109052,1,15,1,0
1,67109053,1,15,1,0
1,67109054,1,15,1,0
1,67109055,1,15,1,0
1,67109056,1,15,1,0
1,67109057,1,15,1,0
1,67109058,1,15,1,0
1,67109059,1,15,1,0
1,67109060,1,15,1,0
1,67109061,1,15,1,0
1,67109062,1,15,1,0
1,67109063,1,15,1,0
1,67109064,1,15,1,0
1,67109065,1,15,1,0
1,67109066,1,15,1,0
1,67109067,1,15,1,0
1,67109068,1,15,1,0
1,67109069,1,15,1,0
1,67109070,1,15,1,0
1,67109071,1,15,1,0
1,67109072,1,15,1,0
1,67109073,1,15,1,0
1,67109074,1,15,1,0
1,67109075,1,15,1,0
1,67109076,1,15,1,0
1,67109077,1,15,1,0
1,67109078,1,15,1,0
1,67109079,1,15,1,0
1,67109080,1,15,1,0
1,67109081,1,15,1,0
1,67109082,1,15,1,0
1,67109083,1,15,1,0
1,67109084,1,15,1,0
1,67109085,1,15,1,0
1,67109086,1,15,1,0
1,67109087,1,15,1,0
1,67109088,1,15,1,0
1,67109089,1,15,1,0
1,67109090,1,15,1,0
1,67109091,1,15,1,0
1,67109092,1,15,1,0
1,67109093,1,15,1,0
1,67109094,1,15,1,0
1,67109095,1,15,1,0
1,67109096,1,15,1,0
1,67109097,1,15,1,0
1,67109098,1,15,1,0
1,67109099,1,15,1,0
1,67109100,1,15,1,0
1,67109101,1,15,1,0
1,67109102,1,15,1,0
1,67109103,1,15,1,0
1,67109104,1,15,1,0
1,67109105,1,15,1,0
1,67109106,1,15,1,0
1,67109107,1,15,1,0
1,67109108,1,15,1,0
1,67109109,1,15,1,0
1,67109110,1,15,1,0
1,67109111,1,15,1,0
1,67109112,1,15,1,0
1,67109113,1,15,1,0
1,67109114,1,15,1,0
1,67109115,1,15,1,0
1,67109116,1,15,1,0
1,67109117,1,15,1,0
1,67109118,1,15,1,0
1,67109119,1,15,1,0
1,67109120,1,15,1,0
1,67109121,1,15,1,0
1,67109122,1,15,1,0
1,67109123,1,15,1,0
1,67109124,1,15,1,0
1,67109125,1,15,1,0
1,67109126,1,15,1,0
1,67109127,1,15,1,0
1,67109128,1,15,1,0
1,67109129,1,15,1,0
1,67109130,1,15,1,0
1,67109131,1,15,1,0
1,67109132,1,15,1,0
1,67109133,1,15,1,0
1,67109134,1,15,1,0
1,67109135,1,15,1,0
1,67109136,1,15,1,0
1,67109137,1,15,1,0
1,67109138,1,15,1,0
1,67109139,1,15,1,0
1,67109140,1,15,1,0
1,67109141,1,15,1,0
1,67109142,1,15,1,0
1,67109143,1,15,1,0
1,67109144,1,15,1,0
1,67109145,1,15,1,0
1,67109146,1,15,1,0
1,67109147,1,15,1,0
1,67109148,1,15,1,0
1,67109149,1,15,1,0
1,67109150,1,15,1,0
1,67109151,1,15,1,0
1,67109152,1,15,1,0
1,67109153,1,15,1,0
1,67109154,1,15,1,0
1,67109155,1,15,1,0
1,67109156,1,15,1,0
1,67109157,1,15,1,0
1,67109158,1,15,1,0
1,67109159,1,15,1,0
1,67109160,1,15,1,0
1,67109161,1,15,1,0
1,67109162,1,15,1,0
1,67109163,1,15,1,0
1,67109164,1,15,1,0
1,67109165,1,15,1,0
1,67109166,1,15,1,0
1,67109167,1,15,1,0
1,67109168,1,15,1,0
1,67109169,1,15,1,0
1,67109170,1,15,1,0
1,67109171,1,15,1,0
1,67109172,1,15,1,0
1,67109173,1,15,1,0
1,67109174,1,15,1,0
1,67109175,1,15,1,0
1,67109176,1,15,1,0
1,67109177,1,15,1,0
1,67109178,1,15,1,0
1,67109179,1,15,1,0
1,67109180,1,15,1,0
1,67109181,1,15,1,0
1,67109182,1,15,1,0
1,67109183,1,15,1,0
1,67109184,1,15,1,0
1,67109185,1,15,1,0
1,67109186,1,15,1,0
1,67109187,1,15,1,0
1,67109188,1,15,1,0
1,67109189,1,15,1,0
1,67109190,1,15,1,0
1,67109191,1,15,1,0
1,67109192,1,15,1,0
1,67109193,1,15,1,0
1,67109194,1,15,1,0
1,67109195,1,15,1,0
1,67109196,1,15,1,0
1,67109197,1,15,1,0
1,67109198,1,15,1,0
1,67109199,1,15,1,0
1,67109200,1,15,1,0
1,67109201,1,15,1,0
1,67109202,1,15,1,0
1,67109203,1,15,1,0
1,67109204,1,15,1,0
1,67109205,1,15,1,0
1,67109206,1,15,1,0
1,67109207,1,15,1,0
1,67109208,1,15,1,0
1,67109209,1,15,1,0
1,67109210,1,15,1,0
1,67109211,1,15,1,0
1,67109212,1,15,1,0
1,67109213,1,15,1,0
1,67109214,1,15,1,0
1,67109215,1,15,1,0
1,67109216,1,15,1,0
1,67109217,1,15,1,0
1,67109218,1,15,1,0
1,67109219,1,15,1,0
1,67109220,1,15,1,0
1,67109221,1,15,1,0
1,67109222,1,15,1,0
1,67109223,1,15,1,0
1,67109224,1,15,1,0
1,67109225,1,15,1,0
1,67109226,1,15,1,0
1,67109227,1,15,1,0
1,67109228,1,15,1,0
1,67109229,1,15,1,0
1,67109230,1,15,1,0
1,67109231,1,15,1,0
1,67109232,1,15,1,0
1,67109233,1,15,1,0
1,67109234,1,15,1,0
1,67109235,1,15,1,0
1,67109236,1,15,1,0
1,67109237,1,15,1,0
1,67109238,1,15,1,0
1,67109239,1,15,1,0
1,67109240,1,15,1,0
1,67109241,1,15,1,0
1,67109242,1,15,1,0
1,67109243,1,15,1,0
1,67109244,1,15,1,0
1,67109245,1,15,1,0
1,67109246,1,15,1,0
1,67109247,1,15,1,0
1,67109248,1,15,1,0
1,67109249,1,15,1,0
1,67109250,1,15,1,0
1,67109251,1,15,1,0
1,67109252,1,15,1,0
1,67109253,1,15,1,0
1,67109254,1,15,1,0
1,67109255,1,15,1,0
1,67109256,1,15,1,0
1,67109257,1,15,1,0
1,67109258,1,15,1,0
1,67109259,1,15,1,0
1,67109260,1,15,1,0
1,67109261,1,15,1,0
1,67109262,1,15,1,0
1,67109263,1,15,1,0
1,67109264,1,15,1,0
1,67109265,1,15,1,0
1,67109266,1,15,1,0
1,67109267,1,15,1,0
1,67109268,1,15,1,0
1,67109269,1,15,1,0
1,67109270,1,15,1,0
1,67109271,1,15,1,0
1,67109272,1,15,1,0
1,67109273,1,15,1,0
1,67109274,1,15,1,0
1,67109275,1,15,1,0
1,67109276,1,15,1,0
1,67109277,1,15,1,0
1,67109278,1,15,1,0
1,67109279,1,15,1,0
1,67109280,1,15,1,0
1,67109281,1,15,1,0
1,67109282,1,15,1,0
1,67109283,1,15,1,0
1,67109284,1,15,1,0
1,67109285,1,15,1,0
1,67109286,1,15,1,0
1,67109287,1,15,1,0
1,67109288,1,15,1,0
1,67109289,1,15,1,0
1,67109290,1,15,1,0
1,67109291,1,15,1,0
1,67109292,1,15,1,0
1,67109293,1,15,1,0
1,67109294,1,15,1,0
1,67109295,1,15,1,0
1,67109296,1,15,1,0
1,67109297,1,15,1,0
1,67109298,1,15,1,0
1,67109299,1,15,1,0
1,67109300,1,15,1,0
1,67109301,1,15,1,0
1,67109302,1,15,1,0
1,67109303,1,15,1,0
1,67109304,1,15,1,0
1,67109305,1,15,1,0
1,67109306,1,15,1,0
1,67109307,1,15,1,0
1,67109308,1,15,1,0
1,67109309,1,15,1,0
1,67109310,1,15,1,0
1,67109311,1,15,1,0
1,67109312,1,15,1,0
1,67109313,1,15,1,0
1,67109314,1,15,1,0
1,67109315,1,15,1,0
1,67109316,1,15,1,0
1,67109317,1,15,1,0
1,67109318,1,15,1,0
1,67109319,1,15,1,0
1,67109320,1,15,1,0
1,67109321,1,15,1,0
1,67109322,1,15,1,0
1,67109323,1,15,1,0
1,67109324,1,15,1,0
1,67109325,1,15,1,0
1,67109326,1,15,1,0
1,67109327,1,15,1,0
1,67109328,1,15,1,0
1,67109329,1,15,1,0
1,67109330,1,15,1,0
1,67109331,1,15,1,0
1,67109332,1,15,1,0
1,67109333,1,15,1,0
1,67109334,1,15,1,0
1,67109335,1,15,1,0
1,67109336,1,15,1,0
1,67109337,1,15,1,0
1,67109338,1,15,1,0
1,67109339,1,15,1,0
1,67109340,1,15,1,0
1,67109341,1,15,1,0
1,67109342,1,15,1,0
1,67109343,1,15,1,0
1,67109344,1,15,1,0
1,67109345,1,15,1,0
1,67109346,1,15,1,0
1,67109347,1,15,1,0
1,67109348,1,15,1,0
1,67109349,1,15,1,0
1,67109350,1,15,1,0
1,67109351,1,15,1,0
1,67109352,1,15,1,0
1,67109353,1,15,1,0
1,67109354,1,15,1,0
1,67109355,1,15,1,0
1,67109356,1,15,1,0
1,67109357,1,15,1,0
1,67109358,1,15,1,0
1,67109359,1,15,1,0
1,67109360,1,15,1,0
1,67109361,1,15,1,0
1,67109362,1,15,1,0
1,67109363,1,15,1,0
1,67109364,1,15,1,0
1,67109365,1,15,1,0
1,67109366,1,15,1,0
1,67109367,1,15,1,0
1,67109368,1,15,1,0
1,67109369,1,15,1,0
1,67109370,1,15,1,0
1,67109371,1,15,1,0
1,67109372,1,15,1,0
1,67109373,1,15,1,0
1,67109374,1,15,1,0
1,67109375,1,15,1,0
1,67109376,1,15,1,0
1,67109377,1,15,1,0
1,67109378,1,15,1,0
1,67109379,1,15,1,0
1,67109380,1,15,1,0
1,67109381,1,15,1,0
1,67109382,1,15,1,0
1,67109383,1,15,1,0
1,67109384,1,15,1,0
1,67109385,1,15,1,0
0firingMaster,0adr,0we,0sel,0ack,0err
0,9764817,0,0,0,0
0,9760721,0,0,0,0
0,9756625,0,0,0,0
0,9752529,0,0,0,0
0,9748433,0,0,0,0
0,9740241,0,0,0,0
0,9736145,0,0,0,0
0,9732049,0,0,0,0
0,9727953,0,0,0,0
0,9723840,0,0,0,0
0,12814272,0,0,0,0
0,12818368,0,0,0,0
0,12822464,0,0,0,0
0,12826560,0,0,0,0
0,12830656,0,0,0,0
0,12834752,0,0,0,0
0,12838848,0,0,0,0
0,12842961,0,0,0,0
0,9719761,0,0,0,0
0,9715665,0,0,0,0
0,2001,0,0,0,0
0,6097,0,0,0,0
0,10193,0,0,0,0
0,14289,0,0,0,0
0,18385,0,0,0,0
0,22481,0,0,0,0
0,26577,0,0,0,0
0,30656,0,0,0,0
0,12847040,0,0,0,0
0,12851136,0,0,0,0
0,12855232,0,0,0,0
0,12859328,0,0,0,0
0,12863424,0,0,0,0
0,12867520,0,0,0,0
0,12871616,0,0,0,0
0,12875729,0,0,0,0
0,9666512,0,0,0,0
0,26150864,0,0,0,0
0,26154960,0,0,0,0
0,26159056,0,0,0,0
0,26163152,0,0,0,0
0,26167248,0,0,0,0
0,26171344,0,0,0,0
0,26175440,0,0,0,0
0,26179520,0,0,0,0
0,12879808,0,0,0,0
0,12883904,0,0,0,0
0,12888000,0,0,0,0
0,12892096,0,0,0,0
0,12896192,0,0,0,0
0,12900288,0,0,0,0
0,12904384,0,0,0,0
0,12908480,0,0,0,0
0,12912576,0,0,0,0
0,12916672,0,0,0,0
0,12920768,0,0,0,0
0,12924864,0,0,0,0
0,12928960,0,0,0,0
0,12933056,0,0,0,0
0,12937152,0,0,0,0
0,12941248,0,0,0,0
0,11896768,0,0,0,0
0,11900864,0,0,0,0
0,11904960,0,0,0,0
0,11909056,0,0,0,0
0,11913152,0,0,0,0
0,11917248,0,0,0,0
0,11921344,0,0,0,0
0,11925440,0,0,0,0
0,11929536,0,0,0,0
0,11933632,0,0,0,0
0,11937728,0,0,0,0
0,11941824,0,0,0,0
0,11945920,0,0,0,0
0,11950016,0,0,0,0
0,11954112,0,0,0,0
0,11958225,0,0,0,0
0,9650129,0,0,0,0
0,9646016,0,0,0,0
0,788416,0,0,0,0
0,792512,0,0,0,0
0,796608,0,0,0,0
0,800704,0,0,0,0
0,804800,0,0,0,0
0,808896,0,0,0,0
0,812992,0,0,0,0
0,817088,0,0,0,0
0,821184,0,0,0,0
0,825280,0,0,0,0
0,829376,0,0,0,0
0,833472,0,0,0,0
0,837568,0,0,0,0
0,841664,0,0,0,0
0,845760,0,0,0,0
0,849873,0,0,0,0
0,9629649,0,0,0,0
0,9633728,0,0,0,0
0,296896,0,0,0,0
0,300992,0,0,0,0
0,305088,0,0,0,0
0,309184,0,0,0,0
0,313280,0,0,0,0
0,317376,0,0,0,0
0,321472,0,0,0,0
0,325599,0,0,0,0
0,8394688,0,0,0,0
0,329664,0,0,0,0
0,333760,0,0,0,0
0,337856,0,0,0,0
0,341952,0,0,0,0
0,346048,0,0,0,0
0,350144,0,0,0,0
0,354240,0,0,0,0
0,358367,0,0,0,0
0,8392671,0,0,0,0
0,8409024,0,0,0,0
0,853952,0,0,0,0
0,858048,0,0,0,0
0,862144,0,0,0,0
0,866240,0,0,0,0
0,870336,0,0,0,0
0,874432,0,0,0,0
0,878528,0,0,0,0
0,882641,0,0,0,0
0,9603025,0,0,0,0
0,9607121,0,0,0,0
0,9611217,0,0,0,0
0,9615313,0,0,0,0
0,9619409,0,0,0,0
0,9623505,0,0,0,0
0,9627601,0,0,0,0
0,9631680,0,0,0,0
0,11962304,0,0,0,0
0,11966400,0,0,0,0
0,11970496,0,0,0,0
0,11974592,0,0,0,0
0,11978688,0,0,0,0
0,11982784,0,0,0,0
0,11986880,0,0,0,0
0,11990993,0,0,0,0
0,9635793,0,0,0,0
0,9639889,0,0,0,0
0,9643985,0,0,0,0
0,9648081,0,0,0,0
0,9652177,0,0,0,0
0,9656273,0,0,0,0
0,9660369,0,0,0,0
0,9664448,0,0,0,0
0,12912576,0,0,0,0
0,12916672,0,0,0,0
0,12920768,0,0,0,0
0,12924864,0,0,0,0
0,12928960,0,0,0,0
0,12933056,0,0,0,0
0,12937152,0,0,0,0
0,12941248,0,0,0,0
0,13535168,0,0,0,0
0,13539264,0,0,0,0
0,13543360,0,0,0,0
0,13547456,0,0,0,0
0,13551552,0,0,0,0
0,13555648,0,0,0,0
0,13559744,0,0,0,0
0,13563840,0,0,0,0
0,13567936,0,0,0,0
0,13572032,0,0,0,0
0,13576128,0,0,0,0
0,13580224,0,0,0,0
0,13584320,0,0,0,0
0,13588416,0,0,0,0
0,13592512,0,0,0,0
0,13596608,0,0,0,0
0,12879808,0,0,0,0
0,12883904,0,0,0,0
0,12888000,0,0,0,0
0,12892096,0,0,0,0
0,12896192,0,0,0,0
0,12900288,0,0,0,0
0,12904384,0,0,0,0
0,12908497,0,0,0,0
0,9650129,0,0,0,0
0,9646033,0,0,0,0
0,9629649,0,0,0,0
0,9633728,0,0,0,0
0,296896,0,0,0,0
0,300992,0,0,0,0
0,305088,0,0,0,0
0,309184,0,0,0,0
0,313280,0,0,0,0
0,317376,0,0,0,0
0,321472,0,0,0,0
0,325599,0,0,0,0
0,8394688,0,0,0,0
0,329664,0,0,0,0
0,333760,0,0,0,0
0,337856,0,0,0,0
0,341952,0,0,0,0
0,346048,0,0,0,0
0,350144,0,0,0,0
0,354240,0,0,0,0
0,358367,0,0,0,0
0,8392671,0,0,0,0
0,8409024,0,0,0,0
0,12912576,0,0,0,0
0,12916672,0,0,0,0
0,12920768,0,0,0,0
0,12924864,0,0,0,0
0,12928960,0,0,0,0
0,12933056,0,0,0,0
0,12937152,0,0,0,0
0,12941248,0,0,0,0
0,12879808,0,0,0,0
0,12883904,0,0,0,0
0,12888000,0,0,0,0
0,12892096,0,0,0,0
0,12896192,0,0,0,0
0,12900288,0,0,0,0
0,12904384,0,0,0,0
0,12908497,0,0,0,0
0,9650129,0,0,0,0
0,9646033,0,0,0,0
0,9629649,0,0,0,0
0,9633728,0,0,0,0
0,296896,0,0,0,0
0,300992,0,0,0,0
0,305088,0,0,0,0
0,309184,0,0,0,0
0,313280,0,0,0,0
0,317376,0,0,0,0
0,321472,0,0,0,0
0,325599,0,0,0,0
0,8394688,0,0,0,0
0,329664,0,0,0,0
0,333760,0,0,0,0
0,337856,0,0,0,0
0,341952,0,0,0,0
0,346048,0,0,0,0
0,350144,0,0,0,0
0,354240,0,0,0,0
0,358367,0,0,0,0
0,8392671,0,0,0,0
0,8409024,0,0,0,0
0,12912576,0,0,0,0
0,12916672,0,0,0,0
0,12920768,0,0,0,0
0,12924864,0,0,0,0
0,12928960,0,0,0,0
0,12933056,0,0,0,0
0,12937152,0,0,0,0
0,12941248,0,0,0,0
0,12879808,0,0,0,0
0,12883904,0,0,0,0
0,12888000,0,0,0,0
0,12892096,0,0,0,0
0,12896192,0,0,0,0
0,12900288,0,0,0,0
0,12904384,0,0,0,0
0,12908497,0,0,0,0
0,9650129,0,0,0,0
0,9646033,0,0,0,0
0,9629649,0,0,0,0
0,9633728,0,0,0,0
0,296896,0,0,0,0
0,300992,0,0,0,0
0,305088,0,0,0,0
0,309184,0,0,0,0
0,313280,0,0,0,0
0,317376,0,0,0,0
0,321472,0,0,0,0
0,325599,0,0,0,0
0,8394688,0,0,0,0
0,329664,0,0,0,0
0,333760,0,0,0,0
0,337856,0,0,0,0
0,341952,0,0,0,0
0,346048,0,0,0,0
0,350144,0,0,0,0
0,354240,0,0,0,0
0,358367,0,0,0,0
0,8392671,0,0,0,0
0,8409024,0,0,0,0
0,12912576,0,0,0,0
0,12916672,0,0,0,0
0,12920768,0,0,0,0
0,12924864,0,0,0,0
0,12928960,0,0,0,0
0,12933056,0,0,0,0
0,12937152,0,0,0,0
0,12941248,0,0,0,0
0,12879808,0,0,0,0
0,12883904,0,0,0,0
0,12888000,0,0,0,0
0,12892096,0,0,0,0
0,12896192,0,0,0,0
0,12900288,0,0,0,0
0,12904384,0,0,0,0
0,12908497,0,0,0,0
0,9650129,0,0,0,0
0,9646033,0,0,0,0
0,9629649,0,0,0,0
0,9633728,0,0,0,0
0,296896,0,0,0,0
0,300992,0,0,0,0
0,305088,0,0,0,0
0,309184,0,0,0,0
0,313280,0,0,0,0
0,317376,0,0,0,0
0,321472,0,0,0,0
0,325599,0,0,0,0
0,8394688,0,0,0,0
0,329664,0,0,0,0
0,333760,0,0,0,0
0,337856,0,0,0,0
0,341952,0,0,0,0
0,346048,0,0,0,0
0,350144,0,0,0,0
0,354240,0,0,0,0
0,358367,0,0,0,0
0,8392671,0,0,0,0
0,8409024,0,0,0,0
0,12912576,0,0,0,0
0,12916672,0,0,0,0
0,12920768,0,0,0,0
0,12924864,0,0,0,0
0,12928960,0,0,0,0
0,12933056,0,0,0,0
0,12937152,0,0,0,0
0,12941248,0,0,0,0
0,12879808,0,0,0,0
0,12883904,0,0,0,0
0,12888000,0,0,0,0
0,12892096,0,0,0,0
0,12896192,0,0,0,0
0,12900288,0,0,0,0
0,12904384,0,0,0,0
0,12908497,0,0,0,0
0,9650129,0,0,0,0
0,9646033,0,0,0,0
0,9629649,0,0,0,0
0,9633728,0,0,0,0
0,296896,0,0,0,0
0,300992,0,0,0,0
0,305088,0,0,0,0
0,309184,0,0,0,0
0,313280,0,0,0,0
0,317376,0,0,0,0
0,321472,0,0,0,0
0,325599,0,0,0,0
0,8394688,0,0,0,0
0,329664,0,0,0,0
0,333760,0,0,0,0
0,337856,0,0,0,0
0,341952,0,0,0,0
0,346048,0,0,0,0
0,350144,0,0,0,0
0,354240,0,0,0,0
0,358367,0,0,0,0
0,8392671,0,0,0,0
0,8409024,0,0,0,0
0,12912576,0,0,0,0
0,12916672,0,0,0,0
0,12920768,0,0,0,0
0,12924864,0,0,0,0
0,12928960,0,0,0,0
0,12933056,0,0,0,0
0,12937152,0,0,0,0
0,12941248,0,0,0,0
0,12879808,0,0,0,0
0,12883904,0,0,0,0
0,12888000,0,0,0,0
0,12892096,0,0,0,0
0,12896192,0,0,0,0
0,12900288,0,0,0,0
0,12904384,0,0,0,0
0,12908497,0,0,0,0
0,9650129,0,0,0,0
0,9646033,0,0,0,0
0,9629649,0,0,0,0
0,9633728,0,0,0,0
0,296896,0,0,0,0
0,300992,0,0,0,0
0,305088,0,0,0,0
0,309184,0,0,0,0
0,313280,0,0,0,0
0,317376,0,0,0,0
0,321472,0,0,0,0
0,325599,0,0,0,0
0,8394688,0,0,0,0
0,329664,0,0,0,0
0,333760,0,0,0,0
0,337856,0,0,0,0
0,341952,0,0,0,0
0,346048,0,0,0,0
0,350144,0,0,0,0
0,354240,0,0,0,0
0,358367,0,0,0,0
0,8392671,0,0,0,0
0,8409024,0,0,0,0
0,12912576,0,0,0,0
0,12916672,0,0,0,0
0,12920768,0,0,0,0
0,12924864,0,0,0,0
0,12928960,0,0,0,0
0,12933056,0,0,0,0
0,12937152,0,0,0,0
0,12941248,0,0,0,0
0,12879808,0,0,0,0
0,12883904,0,0,0,0
0,12888000,0,0,0,0
0,12892096,0,0,0,0
0,12896192,0,0,0,0
0,12900288,0,0,0,0
0,12904384,0,0,0,0
0,12908497,0,0,0,0
0,9650129,0,0,0,0
0,9646033,0,0,0,0
0,9629649,0,0,0,0
0,9633728,0,0,0,0
0,296896,0,0,0,0
0,300992,0,0,0,0
0,305088,0,0,0,0
0,309184,0,0,0,0
0,313280,0,0,0,0
0,317376,0,0,0,0
0,321472,0,0,0,0
0,325599,0,0,0,0
0,8394688,0,0,0,0
0,329664,0,0,0,0
0,333760,0,0,0,0
0,337856,0,0,0,0
0,341952,0,0,0,0
0,346048,0,0,0,0
0,350144,0,0,0,0
0,354240,0,0,0,0
0,358367,0,0,0,0
0,8392671,0,0,0,0
0,8409024,0,0,0,0
0,12912576,0,0,0,0
0,12916672,0,0,0,0
0,12920768,0,0,0,0
0,12924864,0,0,0,0
0,12928960,0,0,0,0
0,12933056,0,0,0,0
0,12937152,0,0,0,0
0,12941248,0,0,0,0
0,12879808,0,0,0,0
0,12883904,0,0,0,0
0,12888000,0,0,0,0
0,12892096,0,0,0,0
0,12896192,0,0,0,0
0,12900288,0,0,0,0
0,12904384,0,0,0,0
0,12908497,0,0,0,0
0,9650129,0,0,0,0
0,9646033,0,0,0,0
0,9629649,0,0,0,0
0,9633728,0,0,0,0
0,296896,0,0,0,0
0,300992,0,0,0,0
0,305088,0,0,0,0
0,309184,0,0,0,0
0,313280,0,0,0,0
0,317376,0,0,0,0
0,321472,0,0,0,0
0,325599,0,0,0,0
0,8394688,0,0,0,0
0,329664,0,0,0,0
0,333760,0,0,0,0
0,337856,0,0,0,0
0,341952,0,0,0,0
0,346048,0,0,0,0
0,350144,0,0,0,0
0,354240,0,0,0,0
0,358367,0,0,0,0
0,8392671,0,0,0,0
0,8409024,0,0,0,0
0,12912576,0,0,0,0
0,12916672,0,0,0,0
0,12920768,0,0,0,0
0,12924864,0,0,0,0
0,12928960,0,0,0,0
0,12933056,0,0,0,0
0,12937152,0,0,0,0
0,12941248,0,0,0,0
0,12879808,0,0,0,0
0,12883904,0,0,0,0
0,12888000,0,0,0,0
0,12892096,0,0,0,0
0,12896192,0,0,0,0
0,12900288,0,0,0,0
0,12904384,0,0,0,0
0,12908497,0,0,0,0
0,9650129,0,0,0,0
0,9646033,0,0,0,0
0,9629649,0,0,0,0
0,9633728,0,0,0,0
0,296896,0,0,0,0
0,300992,0,0,0,0
0,305088,0,0,0,0
0,309184,0,0,0,0
0,313280,0,0,0,0
0,317376,0,0,0,0
0,321472,0,0,0,0
0,325599,0,0,0,0
0,8394688,0,0,0,0
0,329664,0,0,0,0
0,333760,0,0,0,0
0,337856,0,0,0,0
0,341952,0,0,0,0
0,346048,0,0,0,0
0,350144,0,0,0,0
0,354240,0,0,0,0
0,358367,0,0,0,0
0,8392671,0,0,0,0
0,8409041,0,0,0,0
0,9613265,0,0,0,0
0,9617375,0,0,0,0
0,8394719,0,0,0,0
0,8392671,0,0,0,0
0,8409024,0,0,0,0
0,12912576,0,0,0,0
0,12916672,0,0,0,0
0,12920768,0,0,0,0
0,12924864,0,0,0,0
0,12928960,0,0,0,0
0,12933056,0,0,0,0
0,12937152,0,0,0,0
0,12941248,0,0,0,0
0,12879808,0,0,0,0
0,12883904,0,0,0,0
0,12888000,0,0,0,0
0,12892096,0,0,0,0
0,12896192,0,0,0,0
0,12900288,0,0,0,0
0,12904384,0,0,0,0
0,12908480,0,0,0,0
0,14518208,0,0,0,0
0,14522304,0,0,0,0
0,14526400,0,0,0,0
0,14530496,0,0,0,0
0,14534592,0,0,0,0
0,14538688,0,0,0,0
0,14542784,0,0,0,0
0,14546880,0,0,0,0
0,14550976,0,0,0,0
0,14555072,0,0,0,0
0,14559168,0,0,0,0
0,14563264,0,0,0,0
0,14567360,0,0,0,0
0,14571456,0,0,0,0
0,14575552,0,0,0,0
0,14579665,0,0,0,0
0,9734097,0,0,0,0
0,9738193,0,0,0,0
0,9742289,0,0,0,0
0,9746385,0,0,0,0
0,9750481,0,0,0,0
0,9754577,0,0,0,0
0,9758673,0,0,0,0
0,9762769,0,0,0,0
0,9701329,0,0,0,0
0,9705425,0,0,0,0
0,9709521,0,0,0,0
0,9713617,0,0,0,0
0,9717713,0,0,0,0
0,9721809,0,0,0,0
0,9725905,0,0,0,0
0,9729984,0,0,0,0
0,14583744,0,0,0,0
0,14587840,0,0,0,0
0,14591936,0,0,0,0
0,14596032,0,0,0,0
0,14600128,0,0,0,0
0,14604224,0,0,0,0
0,14608320,0,0,0,0
0,14612416,0,0,0,0
0,12158912,0,0,0,0
0,12163008,0,0,0,0
0,12167104,0,0,0,0
0,12171200,0,0,0,0
0,12175296,0,0,0,0
0,12179392,0,0,0,0
0,12183488,0,0,0,0
0,12187601,0,0,0,0
0,9766865,0,0,0,0
0,9770961,0,0,0,0
0,9775057,0,0,0,0
0,9779153,0,0,0,0
0,9783249,0,0,0,0
0,9787345,0,0,0,0
0,9791441,0,0,0,0
0,9795525,1,15,0,1
0,134219717,1,15,0,1
0,134223813,1,15,0,1
0,134227909,1,15,0,1
0,134232005,1,15,0,1
0,134236101,1,15,0,1
0,134240197,1,15,0,1
0,134244293,1,15,0,1
0,134248401,0,0,0,0
0,9830353,0,0,0,0
0,9826257,0,0,0,0
0,9822161,0,0,0,0
0,9818065,0,0,0,0
0,9813969,0,0,0,0
0,9809873,0,0,0,0
0,9805777,0,0,0,0
0,9801681,0,0,0,0
0,9797585,0,0,0,0
0,9793489,0,0,0,0
0,9789393,0,0,0,0
0,9785297,0,0,0,0
0,9781201,0,0,0,0
0,9777105,0,0,0,0
0,9773009,0,0,0,0
0,9768913,0,0,0,0
0,9760721,0,0,0,0
0,9764817,0,0,0,0
0,9756625,0,0,0,0
0,9752529,0,0,0,0
0,9748433,0,0,0,0
0,9744337,0,0,0,0
0,9740241,0,0,0,0
0,9736145,0,0,0,0
0,9732049,0,0,0,0
0,9727953,0,0,0,0
0,9723857,0,0,0,0
0,9719761,0,0,0,0
0,9715665,0,0,0,0
0,9641937,0,0,0,0
0,9625553,0,0,0,0
0,9629649,0,0,0,0
0,9617361,0,0,0,0
0,9633745,0,0,0,0
0,9637841,0,0,0,0
0,9646033,0,0,0,0
0,9650129,0,0,0,0
0,9600977,0,0,0,0
0,9564113,0,0,0,0
0,9584593,0,0,0,0
0,9580497,0,0,0,0
0,9576401,0,0,0,0
0,9572305,0,0,0,0
0,9568209,0,0,0,0
0,9560017,0,0,0,0
0,9555921,0,0,0,0
0,9551825,0,0,0,0
0,9547729,0,0,0,0
0,9543633,0,0,0,0
0,9539537,0,0,0,0
0,9535441,0,0,0,0
0,9486289,0,0,0,0
0,9469905,0,0,0,0
0,9465809,0,0,0,0
0,9449425,0,0,0,0
0,9453504,0,0,0,0
0,296896,0,0,0,0
0,300992,0,0,0,0
0,305088,0,0,0,0
0,309184,0,0,0,0
0,313280,0,0,0,0
0,317376,0,0,0,0
0,321472,0,0,0,0
0,325599,0,0,0,0
0,8394688,0,0,0,0
0,329664,0,0,0,0
0,333760,0,0,0,0
0,337856,0,0,0,0
0,341952,0,0,0,0
0,346048,0,0,0,0
0,350144,0,0,0,0
0,354240,0,0,0,0
0,358367,0,0,0,0
0,8392671,0,0,0,0
0,8409041,0,0,0,0
0,9439185,0,0,0,0
0,9443281,0,0,0,0
0,9447377,0,0,0,0
0,9451473,0,0,0,0
0,9455569,0,0,0,0
0,9459665,0,0,0,0
0,9463761,0,0,0,0
0,9467840,0,0,0,0
0,12912576,0,0,0,0
0,12916672,0,0,0,0
0,12920768,0,0,0,0
0,12924864,0,0,0,0
0,12928960,0,0,0,0
0,12933056,0,0,0,0
0,12937152,0,0,0,0
0,12941248,0,0,0,0
0,12879808,0,0,0,0
0,12883904,0,0,0,0
0,12888000,0,0,0,0
0,12892096,0,0,0,0
0,12896192,0,0,0,0
0,12900288,0,0,0,0
0,12904384,0,0,0,0
0,12908497,0,0,0,0
0,9469905,0,0,0,0
0,9465809,0,0,0,0
0,9449425,0,0,0,0
0,9453504,0,0,0,0
0,296896,0,0,0,0
0,300992,0,0,0,0
0,305088,0,0,0,0
0,309184,0,0,0,0
0,313280,0,0,0,0
0,317376,0,0,0,0
0,321472,0,0,0,0
0,325599,0,0,0,0
0,8394688,0,0,0,0
0,329664,0,0,0,0
0,333760,0,0,0,0
0,337856,0,0,0,0
0,341952,0,0,0,0
0,346048,0,0,0,0
0,350144,0,0,0,0
0,354240,0,0,0,0
0,358367,0,0,0,0
0,8392671,0,0,0,0
0,8409024,0,0,0,0
0,12912576,0,0,0,0
0,12916672,0,0,0,0
0,12920768,0,0,0,0
0,12924864,0,0,0,0
0,12928960,0,0,0,0
0,12933056,0,0,0,0
0,12937152,0,0,0,0
0,12941248,0,0,0,0
