<?xml version="1.0" encoding="utf-8"?>
<?xml-model href="mfn_manuskripte_schema.rng" type="application/xml" schematypens="http://relaxng.org/ns/structure/1.0"?><?xml-model href="mfn_manuskripte_odd.xml" type="application/tei+xml" schematypens="http://www.tei-c.org/ns/1.0"?><TEI xmlns="http://www.tei-c.org/ns/1.0">
<teiHeader>
<fileDesc>
<titleStmt resp="#LK">
<title level="u" xml:id="de_title" xml:lang="de">Exkursionsberichte von Friedrich Sellow (digitale Transkripte)  – Bericht Nr. 09</title>
<title corresp="#de_title" xml:lang="en">Field trip reports written by Friedrich Sellow (digital transcriptions) – Report No. 09</title>
<author xml:id="FS">Friedrich Sellow</author>
<respStmt xml:id="CE_UM">
<name>Carsten Eckert</name>
<name>Ulrich Moritz</name>
<resp>Transkription und Edition</resp>
</respStmt>
<respStmt xml:id="LK">
<name>Laura E. Kaiser</name>
<resp>Konvertierung in TEI-konformes Markup</resp>
</respStmt>
</titleStmt>
<publicationStmt resp="#LK">
<authority>Museum für Naturkunde, Leibniz-Institut für Evolutions- und Biodiversitätsforschung</authority>
<date>2020</date>
<availability status="restricted">
<licence target="https://creativecommons.org/licenses/by-sa/3.0/de/"> 
                    Dieses Werk ist lizenziert unter einer Creative Commons Namensnennung - Weitergabe unter gleichen Bedingungen 3.0 Deutschland Lizenz.
                </licence>
</availability>
</publicationStmt>
<sourceDesc>
<bibl>Exkursionsberichte der Reisen durch Brasilien und Uruguay von Friedrich Sellow, 1822-1831</bibl>
</sourceDesc>
</fileDesc>
<encodingDesc resp="#LK">
<projectDesc>
<p>Die Texte wurden von Carsten Eckert und Ulrich Moritz für die wissenschaftliche Nutzung durch die Historische Arbeitsstelle des Museum für Naturkunde, Leibniz Institut für Evolutions- und Biodiversitätsforschung transkribiert.</p>
<p>Im Rahmen einer Masterarbeit wurden die Transkripte aus dem .doc-Format (MS Word) in ein TEI-konformes XML-Dokument überführt, dem das im verknüpften XML Schema spezifizierte Datenmodell zugrunde liegt.</p>
</projectDesc>
<editorialDecl>
<p>Sämtliche editorische Eingriffe wurden in den ursprünglichen Transkripten kenntlich gemacht. Alle dieser Markierungen wurden mit - soweit wie möglich - differenzierenden Tags kenntlich gemacht (siehe die beschriebenen Besonderheiten in &lt;tagsDecl&gt;.</p>
<p>Silbentrennung, Zeilenumbrüche und Interpunktion wurden aus dem Original übernommen.</p>
</editorialDecl>
<tagsDecl partial="true">
<rendition scheme="css" xml:id="et">margin-left:4em;</rendition>
<rendition scheme="css" xml:id="red">color:red</rendition>
<rendition scheme="css" xml:id="r">text-align:right;</rendition>
<rendition scheme="css" xml:id="c">text-align:center;</rendition>
<rendition scheme="css" xml:id="s">text-decoration:line-through</rendition>
<rendition scheme="css" xml:id="sup">vertical-align:super; font-size:.7em</rendition>
<rendition scheme="css" xml:id="u">text-decoration:underline</rendition>
<rendition scheme="css" xml:id="v">float:left; transform:rotate(270deg);</rendition>
<rendition scheme="css" selector="body">text-align:justify;</rendition>
<namespace name="https://tei-c.org/ns/1.0/">
<tagUsage gi="reg" resp="#LK">
                    &lt;reg&gt;-Elemente enthalten vom Original abweichende Schreibweisen. Diese umfassen einerseits, wie entsprechend der TEI Richtlinien für dieses Element vorgesehen, die Normalisierung untypischer Schreibweisen, darüber hinaus jedoch mitunter auch die Korrektur falscher Schreibweisen.
                    Diese Ungenauigkeit ist der ursprünglichen Transkription geschuldet, die keine Kodierung entsprechend der TEI-Richtlinien vorsah und entsprechend keine Differenzierung der editorischen Eingriffe vorgenommen hat. Da die Konvertierung nicht von den Transkribierern selbst, sondern von anderer Hand und weitgehend automatisiert vorgenommen wurde, wurden derartige Korrekturen vereinfachend ebenfalls mittels &lt;reg&gt; annotiert, was gegenüber einer (aufgrund mangelnder Expertise bezüglich historischer Schreibweisen) möglicherweise irrtümlichen Auszeichnung als korrigierte Form (&lt;corr&gt;) als geeignetere Strategie erscheint, die Konformität der Kodierung gegenüber dem TEI Abstract Model zu gewährleisten.
                    Eventuelle spätere Versionen dieser kodierten Texte sollten diesen Mangel beheben, indem Korrekturen innerhalb von &lt;corr&gt;-Elementen stehen und die originale Form entsprechend mit &lt;sic&gt; (anstatt derzeit &lt;orig&gt;) annotiert wird.
                </tagUsage>
<tagUsage gi="supplied" resp="#LK">
                    &lt;supplied&gt;-Elemente kennzeichnen editorische Ergänzungen. Da in den ursprünglichen Transkripten absichtlich abgekürzte Schreibweisen nicht eindeutig von (aufgrund vergessener Zeichen/Wörter) falschen Schreibweisen unterscheidbar waren, wurden jegliche editorischen Einfügungen durch ein &lt;supplied&gt;-Element gekennzeichnet, unabhängig davon, ob sie dem Zweck der Auflösung von Abkürzungen oder der Korrektur von Fehlern durch ausgelassenen Text bzw. Zeichen folgen.
                    In einer künftigen Version sollte diese Ungenauigkeit behoben werden, indem lediglich offensichtlich beabsichtigte Auslassungen mittels des &lt;supplied&gt;-Elements ausgezeichnet werden. Falsche Schreibweisen sollten korrigiert werden, indem die korrekte Schreibweise innerhalb eines &lt;corr&gt;-Elements neben der Original-Variante innerhalb eines &lt;sic&gt;-Elements steht, die wiederum beide von einem &lt;choice&gt;-Element umgeben sind. Abkürzungsauflösungen sollten dann anhand des &lt;expan&gt;-Tags ausgezeichnet werden, der neben dem abgekürzten originalen Textteil als &lt;abbr&gt;-Element innerhalb eines &lt;choice&gt;-Elements steht.
                </tagUsage>
<tagUsage gi="seg" resp="#LK">
                    &lt;seg&gt;-Elemente wurden für die Codierung thematisch kategorisierter Textpassagen verwendet. Darin enthaltene Namen sind aufgrund der automatischen Textcodierung noch nicht als solche codiert worden, weil einerseits nicht zwischen Textpassagen und Namen dieser thematischen Abschnitte vorgenommen wurde und andererseits auch keine automatisierte Zuordnung zum übergeordneten type-Attribut der &lt;name&gt;-Elemente möglich gewesen wäre. Bezüglich der &lt;seg&gt;-Elemente wäre es daher wünschenswert, in einer eventuellen künftigen Version Namen darin separat mit einer entsprechenden type- und subtype-Kategorisierung auszuzeichnen.
                    Darüber hinaus wurden &lt;seg&gt;-Elemente behelfsweise für die Auszeichnung von Messdaten verwendet, weil die fachliche Expertise zur feineren Codierung mittels &lt;measure&gt;- bzw. &lt;measureGrp&gt;-Elementen mit den zugehörigen Attributen fehlte. In künftigen Überarbeitungen sollte auch diese Unschärfe möglichst behoben werden.
                </tagUsage>
<tagUsage gi="foreign">
                    Das &lt;foreign&gt;-Element wird in der derzeitigen Codierung ohne die Angabe der Sprache im xml:lang-Attribut verwendet, weil die Unterscheidung zwischen portugiesisch und spanisch in den Transkripten nicht vorhanden war. In künftigen Überarbeitungen sollte diese Information für &lt;foreign&gt;-Elemente ergänzt werden.
                </tagUsage>
</namespace>
</tagsDecl>
<refsDecl>
<p>Jeder Exkursionsbericht ist über das @n-Attribut eines &lt;text&gt;- wie auch body-Elements eindeutig identifizier- und adressierbar.</p>
<p>Ebenso sind Seitenbeginne innerhalb des @n-Attributs jedes &lt;pb&gt;-Elements nummeriert und identifizierbar.</p>
<p>Darüber hinaus ist jede Seite innerhalb eines &lt;ab&gt;-Element über dessen @xml:id-Attribut eindeutig identifizierbar. Die jeweilige ID folgt dem Muster des regulären Ausdrucks'ZM_S_I_Sellow_Exk_[0-9]{2}_[0-9]{2}a?(_(r|v))?' und stellt die hausinterne Signatur innerhalb des Museums für Naturkunde dar.</p>
</refsDecl>
</encodingDesc>
<profileDesc>
<handNotes>
<handNote corresp="#FS">
<p>Handschrift Friedrich Sellows</p>
</handNote>
<handNote xml:id="CAT">
<p>Handschrift Carl August Tennes</p>
</handNote>
<handNote xml:id="unknown">
<p>Handschrift einer unbekannten Person (bzw. Identifizierung der Handschrift nicht angegeben)</p>
</handNote>
</handNotes>
</profileDesc>
<revisionDesc>
<change when="2020-06-29" who="#LK">
<p>Diese Änderung beinhaltet die Konvertierung der Transkripte aus dem doc-Format in TEI P5 konforme XML-Daten, wobei auch die editorischen Eingriffe der Transkribierer soweit möglich spezifiziert wurden.</p>
</change>
</revisionDesc>
</teiHeader>
<text>
<body>
<pb facs="http://gbif.naturkundemuseum-berlin.de/CDV2018/Sellow/ZM_S_I_Sellow_Exk_09_1_r__2525.tif" n="01_r" xml:id="ZM_S_I_Sellow_Exk_09_01_r"/>
<div><head>Seite 01, recto (Bericht 09)</head><ab corresp="#ZM_S_I_Sellow_Exk_09_01_r">
<lb/> <note resp="#CE_UM" type="editorial">29. April 1828: Parana, von Vila da Lapa nach Curitiba</note> <add hand="#unknown">Prov<supplied reason="omitted-in-original" resp="#CE_UM">inz</supplied> <name type="geographic">Parana</name> <hi rendition="#et"><name type="geographic">V<hi rendition="#sup"><supplied reason="omitted-in-original" resp="#CE_UM">il</supplied>a</hi> da Lapa</name></hi> <hi rendition="#et"><name type="geographic">Curitiba am Iguassi</name></hi></add>
<lb/> <name type="geographic"><choice><orig>S<hi rendition="#sup">t</hi> Ant<hi rendition="#sup"><supplied reason="omitted-in-original" resp="#CE_UM">oni</supplied>o</hi> da Lapa</orig> <reg resp="#CE_UM">Santo Antonio da Lapa</reg></choice> oder V<hi rendition="#sup"><supplied reason="omitted-in-original" resp="#CE_UM">il</supplied>a</hi> Nova do Principe</name> liegt auf dem süd- 
<lb/> lichen Abhange eines flachen Hügels, welchen auf allen Seiten 
<lb/> Bäche umgeben, und der theils aus rothem reinem <name type="rock_mineral">Schieferth</name>on, 
<lb/> theils aus <name type="rock_mineral">grauem sandigen mit Geröllen gemengten Thon</name>
<lb/> besteht. Gen Ost gränzt dieser Hügel an einen <gap quantity="1" reason="illegible" resp="#CE_UM" unit="words"/> <name type="rock_mineral">Sandsteins</name><supplied reason="omitted-in-original" resp="#CE_UM">,</supplied>
<lb/> welcher nach W zu steil abgegestürzt ist<supplied reason="omitted-in-original" resp="#CE_UM">,</supplied> so daß er hier als eine 
<lb/> h. 11 4 streichende 30 – 50´ und darüber hohe Wand voll Löcher 
<lb/> und Höhlen ansteht; dieser <name type="rock_mineral">Sandst</name><supplied reason="omitted-in-original" resp="#CE_UM">ein</supplied> ist röthlich und sehr mürbe 
<lb/> und ist jünger als jener mit <name type="rock_mineral">Geröllen gemengter Thon</name>, indem 
<lb/> dieser sein <name type="rock_mineral">Liegendes</name> ausmacht. Von dieser löchrigen Wand 
<lb/> hat der Ort den Namen „da Lapa“. Er besteht gegenwärtig in 
<lb/> 3 bis 4 S.N. laufenden Längenstraßen, wovon die Längste 
<lb/> bis 540 Schritte hält, durch Querstraßen durchschnitten, welche 
<lb/> mit ihnen rechte Winkel bilden, worin aber erst wenige 
<lb/> Häuser stehen. Ein geringer Theil der V<hi rendition="#sup"><supplied reason="omitted-in-original" resp="#CE_UM">il</supplied>a</hi> ist gepflastert, 
<lb/> aber sehr schlecht mit <name type="rock_mineral">Grünsteinbrocken</name>. Es scheint<supplied reason="omitted-in-original" resp="#CE_UM">,</supplied> daß man 
<lb/> kein besseres Baugestein in der Nähe findet, denn auch 
<lb/> bei der Kirche lagen abgerundete mit Oker überzogene 
<lb/> <name type="rock_mineral">Grünsteinstücke</name>, womit man eine Vergößerung derselben 
<lb/> aufführen wollte. Die Kirche liegt in einem länglichen 
<lb/> Viereck am niedrigsten und nördlichsten Theil der V<hi rendition="#sup"><supplied reason="omitted-in-original" resp="#CE_UM">il</supplied>a</hi>, nach 
<lb/> W schauend. Die besseren Häuser <choice><orig>Teipa</orig><reg resp="#CE_UM"> Taipa</reg></choice>-Wände <note resp="#CE_UM" type="editorial">port. Trennwand</note>. 
<lb/> Alle sind mit Ziegel gedeckt, und haben stark hervorspringende 
<lb/> Dächer. Zweistöckige Häuser giebt es hier noch nicht, so wenig 
<lb/> als Glasfenster. An strenge Regelmäßigkeit hat man sich 
<lb/> bei der Anlage auch nicht gebunden; die vornehmste Längen- 
<lb/> straße bildet ein Knie. Die besten Häuser bewohnt der Major 
<lb/> <name type="person">Silva</name> und der S<supplied reason="omitted-in-original" resp="#CE_UM">enh</supplied><hi rendition="#sup">or</hi> <name type="person">Man<supplied reason="omitted-in-original" resp="#CE_UM">ue</supplied><hi rendition="#sup">l</hi> Ant<supplied reason="omitted-in-original" resp="#CE_UM">oni</supplied><hi rendition="#sup">o</hi></name>. Beide haben hinter ihren Häusern 
<lb/> einen ziemlich großen Garten; überhaupt findet man bei den 
<lb/> meisten Häusern einen Garten, worin ich unter Anderem auch 
<lb/> <seg type="agriculture_crafts">Zuckerrohr, Baumwolle, Mandioca Bataten</seg> sah. Soge- 
<lb/> nannte <seg type="agriculture_crafts">englische Kartoffeln</seg> kommen hier sehr gut fort. Besonders 
<lb/> gut gedeihen <seg type="agriculture_crafts">Aepfel<supplied reason="omitted-in-original" resp="#CE_UM">,</supplied> Birnen Pflaumen</seg>. Ich wendete 
<lb/> mich bei meiner Ankunft an den Major <name type="person">Juão da 
<lb/> Sylva Maxado</name>, der mir mit zuvorkommender Artigkeit 
<lb/> Quartier bei sich einräumte, welches ich annahm. 
<lb/> Dem S<supplied reason="omitted-in-original" resp="#CE_UM">enh</supplied><hi rendition="#sup">nr</hi> <name type="person">Man<supplied reason="omitted-in-original" resp="#CE_UM">ue</supplied><hi rendition="#sup">l</hi> Ant<supplied reason="omitted-in-original" resp="#CE_UM">oni</supplied><hi rendition="#sup">o</hi> de Aranjo</name> überreichte ich ein Empfehlungsbrief von einem Freunde aus P<supplied reason="omitted-in-original" resp="#CE_UM">or</supplied>t<hi rendition="#sup">o</hi> Al<supplied reason="omitted-in-original" resp="#CE_UM">egr</supplied><hi rendition="#sup">e</hi><supplied reason="omitted-in-original" resp="#CE_UM">,</supplied>
</ab></div>
<pb facs="http://gbif.naturkundemuseum-berlin.de/CDV2018/Sellow/ZM_S_I_Sellow_Exk_09_1_v__2526.tif" n="01_v" xml:id="ZM_S_I_Sellow_Exk_09_01_v"/>
<div><head>Seite 01, verso (Bericht 09)</head><ab corresp="#ZM_S_I_Sellow_Exk_09_01_v">
<lb/> worauf derselbe mir ebenfalls die verbindlichsten Anerbie- 
<lb/> tungen machte. Bald nacher bekam ich Besuche vom <name type="ethnicity_group">Vigario</name>, 
<lb/> vom <name type="ethnicity_group">Escrivão da Camara</name> und von einem Padre <name type="person">Lino</name>, 
<lb/> und später vom <name type="ethnicity_group">Capitao Mor</name>, welcher abwesend gewesen war; 
<lb/> zumal war eine der angenehmsten Bekanntschaften<supplied reason="omitted-in-original" resp="#CE_UM">,</supplied> welche ich hier 
<lb/> machte<supplied reason="omitted-in-original" resp="#CE_UM">,</supplied> die des Capitaens <name type="person">Oliveira</name> <space dim="horizontal"/> aus <name type="geographic">S<hi rendition="#sup">t</hi>
<lb/> Paolo</name>, eines sehr gebildeten und wohl unterrichteten <name type="ethnicity_group">Ingenieur- 
<lb/> Officers</name>. Im Umgange mit diesen Leuten schien es mir<supplied reason="omitted-in-original" resp="#CE_UM">,</supplied>
<lb/> als befände ich mich noch in der Provinz S. Pedro. In Silva's 
<lb/> Hause her<supplied reason="omitted-in-original" resp="#CE_UM">r</supplied>schte die dort übliche Gastfreiheit, und dieselbe Libe- 
<lb/> ralität, welche man dort so häufig bewundern muß, war 
<lb/> in seinem Benehmen. Nur kam seine Frau und Tochter 
<lb/> nie zum Vorschein, und selbst während der Messe, welche er 
<lb/> jeden Sonntag in seiner Hauskapelle lesen ließ, blieben sie 
<lb/> hinter einer mit engem Gitterwerk verschlossenen Thüre. 
<lb/> <name type="person">Silva, Oliv<supplied reason="omitted-in-original" resp="#CE_UM">eir</supplied><hi rendition="#sup">a</hi> M<supplied reason="omitted-in-original" resp="#CE_UM">anue</supplied><hi rendition="#sup">l</hi> Ant<supplied reason="omitted-in-original" resp="#CE_UM">oni</supplied><hi rendition="#sup">o</hi></name> hatten im Süden gelebt, nicht so der 
<lb/> Padre <name type="person">Lino</name>, allein auch er machte mir die verbindlichsten 
<lb/> Anerbietungen, wovon ich zuversichtlich hätte Gebrauch machen 
<lb/> können. Die <seg type="agriculture_crafts">Haupterwerbzweig</seg> hier ist <seg type="agriculture_crafts">der Handel mit Maul- 
<lb/> thieren und Pferden</seg>, welche aus den südlichen Provinzen hier 
<lb/> durchgebracht werden. Silva und M<supplied reason="omitted-in-original" resp="#CE_UM">anue</supplied><hi rendition="#sup">l</hi> Ant<supplied reason="omitted-in-original" resp="#CE_UM">oni</supplied><hi rendition="#sup">o</hi> verdanken 
<lb/> ihm ihren Wohlstand. Seit 6 oder 8 Jahren hat man hier in 
<lb/> der Nähe auch <name type="plant">Yerva <note resp="#CE_UM" type="editorial">Mate</note> oder <choice><orig/><reg resp="#CE_UM">Citronella congonha</reg></choice></name> bereitet, und nach <name type="geographic">Para- 
<lb/> nagua</name> ausgeführt; und die hier bereitete steht in gutem Ruf. 
<lb/> Die Gegend ist sehr reich daran, wie der Certão zwischen hier 
<lb/> und <name type="geographic">Lages</name>. Ersteigt man den Rücken gen Ost von der 
<lb/> V<hi rendition="#sup"><supplied reason="omitted-in-original" resp="#CE_UM">il</supplied>a</hi>, welcher kaum 8 Minuten entfernt liegt, (L=60') und wohl 
<lb/> auch über 150' höher als der Hügel der V<hi rendition="#sup"><supplied reason="omitted-in-original" resp="#CE_UM">il</supplied>a</hi> <supplied reason="omitted-in-original" resp="#CE_UM">ist</supplied>, so genießt man 
<lb/> von dort eine weite Aussicht. In Ost zeigen sich 4 und 6 
<lb/> L<supplied reason="omitted-in-original" resp="#CE_UM">egoa</supplied> entfernt zackige Berge des Küstengebirges, worunter 
<lb/> man mir den <name type="geographic">Moro do Viri Viri</name> nannte. In S erkennt man 
<lb/> in großer Form die Höhen von <name type="geographic">Passo quatro</name> im <name type="object">Certão</name>, 
<lb/> und man versicherte, daß bei hellem Wetter der <name type="geographic">Espigão</name>
<lb/> gesehen worden sei; in N zeigen sich die Höhen am 
<lb/> rechten Ufer des <name type="geographic"><choice><orig>Yguacu </orig><reg resp="#CE_UM">Iguaçu</reg></choice></name> in einer Entfernung von 3 – 4 Legoas. 
<lb/> Etwas beschränkter ist die Aussicht gen W. Waldige Höhen 
<lb/> begränzen dort das Campo, welches übrigens auch hin wie- 
<lb/> der Capãos hat. Das Klima scheint sehr veränderlich 
<lb/> hier zu sein; wenigstens war während meiner Anwesenheit 
</ab></div>
<pb facs="http://gbif.naturkundemuseum-berlin.de/CDV2018/Sellow/ZM_S_I_Sellow_Exk_09_2_r__2527.tif" n="02_r" xml:id="ZM_S_I_Sellow_Exk_09_02_r"/>
<div><head>Seite 02, recto (Bericht 09)</head><ab corresp="#ZM_S_I_Sellow_Exk_09_02_r">
<lb/> kein vollkommen schöner Tag und nie sah ich dort 12 Stunden 
<lb/> lang dieselbe Witterung. Während meiner Anwesenheit 
<lb/> befiel auch die Einwohner, wenige ausgenommen, ein wahr- 
<lb/> haft <seg type="medicine">epidemischer Catarrh</seg>, der bei manchen über eine Woche 
<lb/> anhielt, und vielen sehr beschwerlich war. 
<lb/> Am 29 Ap<hi rendition="#sup"><supplied reason="omitted-in-original" resp="#CE_UM">ri</supplied>l</hi> verließ ich <name type="geographic">V<hi rendition="#sup"><supplied reason="omitted-in-original" resp="#CE_UM">il</supplied>a</hi> da Lapa</name>, und ging diesen Tag 
<lb/> bis zum <name type="object">Registo de Curitiba</name>, am <name type="geographic">Rio Gr<hi rendition="#sup"><supplied reason="omitted-in-original" resp="#CE_UM">an</supplied>de</hi> de Curitiba</name>
<lb/> oder <name type="geographic">Yguaçú</name>. Der Weg wendet sich von der V<hi rendition="#sup"><supplied reason="omitted-in-original" resp="#CE_UM">il</supplied>a</hi> aus zunächst 
<lb/> gen NO und führt auf erwähnten <name type="rock_mineral">Sandstein</name> u. Rücken, 
<lb/> dann läuft er eine beträchtliche Strecke auf diesem ent- 
<lb/> lang<supplied reason="omitted-in-original" resp="#CE_UM">,</supplied> von welchem man interessante Aussicht 
<lb/> auf das Küstengebirge hat, welches mehrerer auffallende 
<lb/> Zacken aufzuweisen hat. Die Gegend bis zum Fuß 
<lb/> jenes Gebirges scheint nicht sehr bergig und reich an 
<lb/> Waldung. Das <name type="object">Campo</name> hier ist nicht übel, obschon der 
<lb/> Boden etwas sandig ist, es ist ziemlich rein von Gesträuch. 
<lb/> An vielen Stellen liegt schwarze <name type="rock_mineral">Dammerde</name> oben 
<lb/> auf. Ich kam an mehreren <name type="object">Chacaras</name> vorüber mit 
<lb/> recht guten Häusern, mit Ziegel gedeckt und geweißt<supplied reason="omitted-in-original" resp="#CE_UM">.</supplied>
<lb/> Am <name type="geographic">Yguaçú</name> steht derselbe <name type="rock_mineral">Sandstein</name> an, als <supplied reason="omitted-in-original" resp="#CE_UM">er</supplied> sich auf 
<lb/> dem Wege her nicht selten zeigt; hier, besonders 
<lb/> die unteren Lagen, sind stark mit <name type="rock_mineral">Geröllen</name>, vornehm- 
<lb/> lich von <name type="rock_mineral">Quarz</name>, gemengt; die oberste Schicht ist hier <name type="rock_mineral">eisen- 
<lb/> schüssig</name>, allein von sehr unbedeutender Mächtigkeit. 
<lb/> Das Administrations-Gebäude liegt am rechten Ufer 
<lb/> circa 50' über dem Fluß auf einer <name type="rock_mineral">Sandstein Bank</name>
<lb/> und beherbergt einen <name type="ethnicity_group">Tenente</name> <note resp="#CE_UM" type="editorial">Oberleutnant</note> und einen <name type="ethnicity_group">Escrivão</name> <note resp="#CE_UM" type="editorial">Protokollführer</note>. Es ist nicht unansehlich und mit Ziegel gedeckt, aber bau- 
<lb/> fällig, und man läßt es so, weil gegenwärtig im Vorschlag 
<lb/> ist, dieses <name type="object">Registo</name> nach dem <name type="geographic">Rio Negro</name> zu verlegen, 
<lb/> während andere erwarten, daß man die Binnenzölle 
<lb/> bald gänzlich aufheben werde. Dieses <name type="object">Registo</name> ist 
<lb/> eine der Hauptfinanzquellen der Provinz, indem es 
<lb/> per Trimestre schon an 70 <unit>Contos</unit> eingetragen<supplied reason="omitted-in-original" resp="#CE_UM">.</supplied>
<lb/> Von jedem hier durchkommenden Maulthiere muß 2500 reis<supplied reason="omitted-in-original" resp="#CE_UM">,</supplied>
<lb/> von jedem Pferde 2000, Stute 960 entrichtet werden<supplied reason="omitted-in-original" resp="#CE_UM">,</supplied>
<lb/> für Übersetzung zahlt man für jedes Lastthier 50, der Reiter 
<lb/> 50, Thiere an der Leine übergeschwemmt 80, der Fußgänger 
<lb/> 40 reis. Es ist aber dieses <name type="object">Registo</name> besonders für die 
<lb/> Bewohner der Gegend eine Plage. Sie müssen ihre Thiere 
</ab></div>
<pb facs="http://gbif.naturkundemuseum-berlin.de/CDV2018/Sellow/ZM_S_I_Sellow_Exk_09_2_v__2528.tif" n="02_v" xml:id="ZM_S_I_Sellow_Exk_09_02_v"/>
<div><head>Seite 02, verso (Bericht 09)</head><ab corresp="#ZM_S_I_Sellow_Exk_09_02_v">
<lb/> einschreiben lassen, wobei Farben, Zeichen, und Marke 
<lb/> angegeben wird. Das jedesmalige Nachlesen in den 
<lb/> Büchern, wenn sie herüber oder hinüber wollen, hält 
<lb/> immer sehr auf; auch dürfen sie an keiner anderen 
<lb/> Stelle über den Fluß, obschon ein viel kürzerer Weg 
<lb/> von <name type="geographic">Lapa</name> nach <name type="geographic">Curitiba</name> genommen werden könnte. 
<lb/> Die <name type="object">Canos</name> zum Übersetzen waren sehr gut, und früher 
<lb/> stand hier sogar schon eine Brücke, welche aber ein - 
<lb/> stürzte, bei welcher Gelegenheit der ehemalige Ad- 
<lb/> ministrator ertrank. Die Breite des Flusses ist un- 
<lb/> gefähr die des <name type="geographic">Rio Negro</name>. Fischreich ist er nicht, 
<lb/> vermuthlich wegen hoher Wasserfälle<supplied reason="omitted-in-original" resp="#CE_UM">,</supplied> über welche 
<lb/> die größeren Fische<supplied reason="omitted-in-original" resp="#CE_UM">,</supplied> wovon der Parana so reich ist, 
<lb/> nicht herauf können. Der <name type="ethnicity_group">Escrivão</name> war ein Freund 
<lb/> vom Angeln, fing aber nur <name type="animal">Lambacis</name> <note resp="#CE_UM" type="editorial">eine Astinax-Art</note>, <name type="animal">Bagres</name> <note resp="#CE_UM" type="editorial">eine Wels-Art</note> wurden 
<lb/> jedoch auch gefangen. Der <name type="ethnicity_group">Commandant</name> hat stets hier 
<lb/> 12 Mann<supplied reason="omitted-in-original" resp="#CE_UM">,</supplied> welche auf verschiedenen Punkten postirt wer- 
<lb/> den<supplied reason="omitted-in-original" resp="#CE_UM">,</supplied> um zu verhüthen<supplied reason="omitted-in-original" resp="#CE_UM">,</supplied> daß Truppen das <name type="object">Registo</name>
<lb/> umgehen. 
<lb/> Ich beschloß<supplied reason="omitted-in-original" resp="#CE_UM">,</supplied> eine Excursion von hier aus nach <name type="geographic">Curitiba</name> und 
<lb/> der <name type="geographic">S<supplied reason="omitted-in-original" resp="#CE_UM">err</supplied><hi rendition="#sup">a</hi> de Paranagua</name> zu machen, schickte deshalb meine 
<lb/> Pferde und Maulthiere auf die beste Weide<supplied reason="omitted-in-original" resp="#CE_UM">,</supplied> welche in 
<lb/> der Nähe zu haben war und gab alles Gepäck<supplied reason="omitted-in-original" resp="#CE_UM">,</supplied> welches ich 
<lb/> auf dieser kleinen Reise nicht brauchte, dem S<supplied reason="omitted-in-original" resp="#CE_UM">enho</supplied><hi rendition="#sup">r</hi> <name type="person">Janu- 
<lb/> ario Ant<supplied reason="omitted-in-original" resp="#CE_UM">oni</supplied><hi rendition="#sup">o</hi> de Araujo</name> in Verwahrung<supplied reason="omitted-in-original" resp="#CE_UM">,</supplied> welcher mich sehr artig be- 
<lb/> wirthete. Durch Regen wurde ich aber um einen Tag 
<lb/> länger hier aufgehalten. Am 3<hi rendition="#sup">ten</hi> May Nachmittags verließ 
<lb/> ich diesen Punkt und ging noch heute bis zur <name type="geographic">Serra dos Car- 
<lb/> los</name>. Hat man das Thalgehänge des <name type="geographic">Rio do Regesto</name> er- 
<lb/> stiegen<supplied reason="omitted-in-original" resp="#CE_UM">,</supplied> so läuft der Weg ziemlich eben hin, durch gutes 
<lb/>Campo<supplied reason="omitted-in-original" resp="#CE_UM">,</supplied> von welchem einerseits sich Abhänge nach genanntem 
<lb/> Fluß hinabsenken<supplied reason="omitted-in-original" resp="#CE_UM">,</supplied> in diesen Schluchten findet sich oft Waldung 
<lb/> wie am Flusse selbst und sonst liegen auch Capãos im Campo. 
<lb/> Das vorkommende Gestein ist <name type="rock_mineral">Sandstein</name> wie er am <name type="object">Regesto</name>
<lb/> ansteht<supplied reason="omitted-in-original" resp="#CE_UM">,</supplied> stets mehr oder weniger mit Geröllen gemengt. 
<lb/> An einigen hohen Punkten ist der <name type="rock_mineral">Sandst<supplied reason="omitted-in-original" resp="#CE_UM">ein</supplied></name> weiß und ziemlich 
<lb/> feinkörnig. Wo ich übernachtete<supplied reason="omitted-in-original" resp="#CE_UM">,</supplied> stand vor Zeiten ein Hof<supplied reason="omitted-in-original" resp="#CE_UM">,</supplied>
<lb/> wie verfallene Mauern noch bezeugen. Vom <name type="object">Regesto</name>
<lb/> hierher steigt man unmerklich an; allein nach Ost zu ist diese 
<lb/> Höhe ziemlich steil abgeschossen und dieser in der 1<hi rendition="#sup">sten</hi> Stunde 
<lb/> streichende Abhang heißt <name type="geographic">Serra dos Carlos</name>. Er ist mit Wald 
<lb/> besetzt<supplied reason="omitted-in-original" resp="#CE_UM">,</supplied> in welchen <name type="plant">Pinheiros</name> häufig vorkommen. 
</ab></div>
<pb facs="http://gbif.naturkundemuseum-berlin.de/CDV2018/Sellow/ZM_S_I_Sellow_Exk_09_3_r__2529.tif" n="03_r" xml:id="ZM_S_I_Sellow_Exk_09_03_r"/>
<div><head>Seite 03, recto (Bericht 09)</head><ab corresp="#ZM_S_I_Sellow_Exk_09_03_r">
<lb/> <hi rendition="#r">in <name type="geographic">Campo Largo</name></hi>
<lb/> Am <space dim="horizontal"/> gelangte ich bis zu <name type="geographic">Freguesia de N<supplied reason="omitted-in-original" resp="#CE_UM">ossa</supplied> S<supplied reason="omitted-in-original" resp="#CE_UM">an</supplied><hi rendition="#sup">t<supplied reason="omitted-in-original" resp="#CE_UM">a</supplied></hi> da Piedade</name>. Der 
<lb/> Weg von der <name type="geographic">S<supplied reason="omitted-in-original" resp="#CE_UM">erra</supplied><hi rendition="#sup">a</hi> dos Carlos</name> hinab ist nicht sonderlich schlimm; nur 
<lb/> daß er eine große Menge Krümmungen macht. Auf dem 
<lb/> waldigen Abhange hier sahe ich die bei <name type="geographic">S<hi rendition="#sup">t</hi> Paolo</name> so häufige 
<lb/> <name type="plant">Rhexia mutabilis</name> in Blüte. Sonst blüte fast nichts. Leider ver- 
<lb/> hinderte Gewölk<supplied reason="omitted-in-original" resp="#CE_UM">,</supplied> die Aussicht zu genießen, welche man bei hellem 
<lb/> Wetter von der Höhe aus auf das Küstengebirge hat; kaum 
<lb/> ließen sich heute daran einzelne Punkte erkennen. Das vor- 
<lb/> liegende Land bis zum Fuße desselben hin zeigt sich reich an 
<lb/> Waldung; diese herscht sogar vor; und wiewohl hüglig, zeichnen 
<lb/> sich darin keine besonderen Erhabenheiten aus. An Stellen 
<lb/> liegen viel <name type="rock_mineral">Quarzbrocken</name> aufgehäuft und <name type="rock_mineral">Geschiebe zumal von 
<lb/> Gneus</name> scheinen sich zu mehren, je mehr man östlich vorrückt. 
<lb/> Bald zeigt sich kein <name type="rock_mineral">Sandstein</name> mehr, sondern ein <name type="rock_mineral">rother 
<lb/> Lehmen mit vornehmlich Quarzgerölle</name>. Mehrere Male lief 
<lb/> der Weg durch ansehliche <name type="object">Restingas</name> oder Waldstriche. Mehrere 
<lb/> Wohnungen zeigten sich an verschiedenen Punkten. Verschiedene 
<lb/> Bäche hatten Brücken, welche zum Theil aber baufällig waren. 
<lb/> Die <name type="geographic">Freg<supplied reason="omitted-in-original" resp="#CE_UM">uesi</supplied><hi rendition="#sup">a</hi> da Piedade</name> blieb in geringer Entfernung z<supplied reason="omitted-in-original" resp="#CE_UM">ur</supplied> R<supplied reason="omitted-in-original" resp="#CE_UM">echten</supplied> von 
<lb/> der Straße in einem ansehlichem Stück Campo, <name type="geographic">C<supplied reason="omitted-in-original" resp="#CE_UM">ampo</supplied> Largo</name> genannt, 
<lb/> die hiesige kleine Kirche, um die gegenwärtig nur erst circa 
<lb/> 10 Häuser liegen, welche zu Pfingsten vorigen Jahres ein- 
<lb/> geweiht. Von hier läuft eine Straße nach <name type="geographic">Castro</name> ab. 
<lb/> Das Rindvieh<supplied reason="omitted-in-original" resp="#CE_UM">,</supplied> welches ich zu sehen bekam<supplied reason="omitted-in-original" resp="#CE_UM">,</supplied> war klein und nicht 
<lb/> sonderlich genährt. Ich begegnete heute mehreren kleinen 
<lb/> Truppen<supplied reason="omitted-in-original" resp="#CE_UM">,</supplied> welche von dem <name type="geographic">Porta dos Meretes</name> herauf kamen. 
<lb/> Die Magerkeit der Thiere bezeichnete die Beschaffenheit des- 
<lb/> wegen in der <name type="geographic">S<supplied reason="omitted-in-original" resp="#CE_UM">err</supplied><hi rendition="#sup">a</hi> de Paranaguá</name>. Ich übernachtete an 
<lb/> einem kleinen Bache auf der öst<supplied reason="omitted-in-original" resp="#CE_UM">lichen</supplied> Gränze des 
<lb/> <name type="geographic">Campo Largo</name>, wo ich zuerst wieder <name type="plant">Pinheiros brabas</name>
<lb/> bemerkte. 
<lb/> Vom Wetter begünstigt<supplied reason="omitted-in-original" resp="#CE_UM">,</supplied> brach ich früh auf. Der Boden hinfort 
<lb/> ein <name type="rock_mineral">rother Lehmen</name><supplied reason="omitted-in-original" resp="#CE_UM">,</supplied> worin viel Gerölle<supplied reason="omitted-in-original" resp="#CE_UM">,</supplied> besonders von <name type="rock_mineral">Quarz</name>
<lb/> ein liegen, dabei finden sich besonders auf gen Ost gerich- 
<lb/> gerichte<supplied reason="omitted-in-original" resp="#CE_UM">te</supplied>n Abhängen <name type="rock_mineral">Gneusgeschiebe</name> nebst <name type="rock_mineral">Geschieben von weißem 
<lb/> Quarz</name>. Waldung mehrt sich<supplied reason="omitted-in-original" resp="#CE_UM">,</supplied> so daß man häufiger durch Wald 
<lb/> als über Campos geht. Am rechten Ufer des <name type="geographic">Rio Verde</name>
<lb/> zeigte sich zuerst <name type="rock_mineral">Urgebirge</name> anstehend, ein stark verwitter- ter St<supplied reason="omitted-in-original" resp="#CE_UM">unde</supplied> 3 streichender <name type="rock_mineral">Gneus</name>; jedoch kaum aus <name type="rock_mineral">rothem Lehmen</name>
</ab></div>
<pb facs="http://gbif.naturkundemuseum-berlin.de/CDV2018/Sellow/ZM_S_I_Sellow_Exk_09_3_v__2530.tif" n="03_v" xml:id="ZM_S_I_Sellow_Exk_09_03_v"/>
<div><head>Seite 03, verso (Bericht 09)</head><ab corresp="#ZM_S_I_Sellow_Exk_09_03_v">
<lb/> heraus blickend. An diesem Bache in der Niederung stehen 
<lb/> viel <name type="plant">Seibo</name>, welche noch nicht alle Blätter verloren hatten. 
<lb/> Weiterhin zeigte sich in völlig aufgelöstem <name type="rock_mineral">granitartigem Gneus</name>
<lb/> ein Lager von <name type="rock_mineral">Talkartigem oder Serpentinartigem Gestein</name>. 
<lb/> Auch ein in St<supplied reason="omitted-in-original" resp="#CE_UM">unde</supplied> 6 streichender mächtiger <name type="rock_mineral">Quarzgang</name> zeigt sich. 
<lb/> Die wenigen Häuser<supplied reason="omitted-in-original" resp="#CE_UM">,</supplied> welche vorkommen<supplied reason="omitted-in-original" resp="#CE_UM">,</supplied> waren schlecht. 
<lb/> Das beste war das Haus des Obersten <space dim="horizontal"/> <name type="person">Sá</name>
<lb/> an der Stelle<supplied reason="omitted-in-original" resp="#CE_UM">,</supplied> welche <name type="geographic">Ferraria</name> <note resp="#CE_UM" type="editorial">Schmiede</note> heißt. Bei demselben lag 
<lb/> ein nicht kleiner Garten, welcher sehr schöne Bäume von 
<lb/> <seg type="agriculture_crafts">Wallnüssen, Äpfel, Birnen und Pflaumen</seg>, und eine hübsche 
<lb/> Anpflanzung von <seg type="agriculture_crafts">Reben</seg>, welche bedeckte Gänge bilde- 
<lb/> ten, enthielt. Man versicherte<supplied reason="omitted-in-original" resp="#CE_UM">,</supplied> daß <name type="person">Sa*</name> schon hier aus 
<lb/> 2 <gap quantity="1" reason="illegible" resp="#CE_UM" unit="words"/> Wein jährlich gemacht habe, der aber nur 
<lb/> schlecht ausgefallen sei. Der Boden als Urgebirge ist 
<lb/> hier ohne Zweifel fruchtbar. Ein kleiner Bach<supplied reason="omitted-in-original" resp="#CE_UM">,</supplied> welcher durch den 
<lb/> Garten fließt<supplied reason="omitted-in-original" resp="#CE_UM">,</supplied> war zum Treiben einer <name type="object">Tafona</name> <note resp="#CE_UM" type="editorial">Mühle für Mandioca</note> und 
<lb/> eines <name type="object">Mongalo</name> <note resp="#CE_UM" type="editorial">Wasserrad</note> benutzt<supplied reason="omitted-in-original" resp="#CE_UM">,</supplied> in deren Nähe ein Zwinger 
<lb/> aus lebendigen <name type="plant">Schashi</name> <note resp="#CE_UM" type="editorial">Chachi bravo</note> Stämmen einem Rudel 
<lb/> Schweine einen schattigen und feuchten Aufenthalt 
<lb/> gab. Die Familie gerade in <name type="geographic">Curitiba</name>. – Dieser Punkt 
<lb/> liegt halbweges zwischen <name type="geographic">Piedade</name> und <name type="geographic">Curitiba</name><supplied reason="omitted-in-original" resp="#CE_UM">,</supplied> welche 6 
<lb/> L<supplied reason="omitted-in-original" resp="#CE_UM">egoa</supplied> auseinander liegen. Unweit der <name type="geographic">Ferraria</name> steht wie- 
<lb/> der <name type="rock_mineral">Gneus</name> zu Tage und weiter hin <name type="rock_mineral">Glimmerschiefer</name><supplied reason="omitted-in-original" resp="#CE_UM">,</supplied>
<lb/> in welchem der Glimmer sich sehr zurück gezogen. 
<lb/> Überall hier ist das <name type="rock_mineral">Urgebirge</name> sehr verwittert und 
<lb/> zeigt sich stets nur sehr kärglich, nie in beträchtlichen 
<lb/> Felsen anstehend. Über <name type="geographic">Ferraria</name> hinaus führt der 
<lb/> Weg nur durch sehr wenig Gebüsch. Nachdem man dann 
<lb/> <name type="geographic">Pisauna</name> zurückgelassen<supplied reason="omitted-in-original" resp="#CE_UM">,</supplied> bekommt man bald von 
<lb/> einer Höhe das <name type="geographic">Gebirge von S. Franc<supplied reason="omitted-in-original" resp="#CE_UM">isc</supplied><hi rendition="#sup">o</hi> und Paranaguá</name>
<lb/> ins Gesicht. Am folgenden Bach fand ich meine 
<lb/> Leute gelagert und übernachtete hier. Früh setzte ich 
<lb/> meinen Marsch fort. Jenseits des <name type="geographic"><choice><orig>Ybariguy </orig><reg resp="#CE_UM">Rio Barigui</reg></choice></name><supplied reason="omitted-in-original" resp="#CE_UM">,</supplied>
<lb/> an welchem <name type="rock_mineral">Grünsteinblöcke</name> mit <name type="rock_mineral">Lehmen</name> gemengt 
<lb/> liegen und welcher einer der beträchtlichsten Bäche 
<lb/> auf dem ganzen Wege vom Regesto her ist<supplied reason="omitted-in-original" resp="#CE_UM">,</supplied>
<lb/> kamen mehr Wohnungen vor. Circa ½ L<supplied reason="omitted-in-original" resp="#CE_UM">egoa</supplied> vor 
<lb/> <name type="geographic">Curitiba</name> hat man eine vollkommen freie Aus- 
<lb/> sicht auf das Küstengebirge und von dieser 
<lb/> Anhöhe sieht man auch die Kirche von <name type="geographic">S. José 
<lb/> dos Pinhais</name> sehr deutlich liegen<supplied reason="omitted-in-original" resp="#CE_UM">.</supplied> Die Gegend 
</ab></div>
<pb facs="http://gbif.naturkundemuseum-berlin.de/CDV2018/Sellow/ZM_S_I_Sellow_Exk_09_4_r__2531.tif" n="04_r" xml:id="ZM_S_I_Sellow_Exk_09_04_r"/>
<div><head>Seite 04, recto (Bericht 09)</head><ab corresp="#ZM_S_I_Sellow_Exk_09_04_r">
<lb/> bis zum Fuß des Gebirges erscheint als ein flaches <name type="object">Campo</name><supplied reason="omitted-in-original" resp="#CE_UM">,</supplied>
<lb/> in welchem jedoch hin und wieder <name type="object">Capãos</name> liegen, 
<lb/> besonders in der Gegend von <name type="geographic">S. José</name>. Das ganze 
<lb/>Gebirge zeigt sich bewaldet; waldreich erscheint auch 
<lb/> die Gegend gen Norden<supplied reason="omitted-in-original" resp="#CE_UM">,</supplied> welche auch ihre ansehlichen 
<lb/> Berge hat. Von dieser Anhöhe senkt sich ein kleiner 
<lb/> Bach nach <name type="geographic">Curitiba</name> hinab. Eine geringe Strecke weiter 
<lb/> kommt diese V<hi rendition="#sup"><supplied reason="omitted-in-original" resp="#CE_UM">il</supplied>a</hi><supplied reason="omitted-in-original" resp="#CE_UM">,</supplied> der Hauptort dieser <name type="object">Comarca</name> <note resp="#CE_UM" type="editorial">span. für lokale Verwaltungseinheit = Curitiba</note><supplied reason="omitted-in-original" resp="#CE_UM">,</supplied> ins Auge. 
<lb/> Ein glänzendes Ansehen hat sie nicht. Sie liegt etwas 
<lb/> vertieft, am Zusammenflusse zweier Bäche, wovon 
<lb/> der eine der eben erwähnte ist, der andere nördlich 
<lb/> von ihm eine Strecke mit ihm parallel läuft gegen 
<lb/> O hin, dann sich nach Süd wendet, ersteren <gap quantity="1" reason="illegible" resp="#CE_UM" unit="words"/> und unweit <name type="geographic">S. 
<lb/> José</name> in den <name type="geographic"><choice><orig>Yguacú </orig><reg resp="#CE_UM">Rio Iguaçu</reg></choice></name> fällt; hier nimmt sie den südöst- 
<lb/> lichen Abhang eines sehr sanft verflachten 
<lb/> Hügels ein, auf dessen Gipfel man angefangen<supplied reason="omitted-in-original" resp="#CE_UM">,</supplied> eine 
<lb/> Capelle zu bauen und wo man gegenwärtig eine 
<lb/>Schulanstalt errichten will. Ein Theil ihrer Häuser 
<lb/> liegt hinter Gärten versteckt und gute und große 
<lb/> Gebäude sind selten. Die Hauptkirche hat auch nichts 
<lb/> vornehmes, weniger noch die beiden anderen Capellen 
<lb/> des Orts. Die Straßen laufen zwar gerade und 
<lb/> sind breit, allein <supplied reason="omitted-in-original" resp="#CE_UM">sie</supplied> laufen unter verschiedenen Win- 
<lb/> keln zu einander, und man findet keinen gleichmä- 
<lb/> ßigen Plan der Anlage. Vor der Kirche 
<lb/> befindet sich ein großer Platz, allein die Häuser<supplied reason="omitted-in-original" resp="#CE_UM">,</supplied>
<lb/> welche ihn umgeben, wenige ausgenommen, sind 
<lb/> nur klein; zweistöckige Häuser giebt es nur 
<lb/> erst zwei im Orte. Steinpflaster findet sich 
<lb/> nur erst in wenigen Straßen an den Häusern 
<lb/> entlang und sehr schlecht. Nur erst 1 Haus hatte Glas- 
<lb/> fenster; Gitterwerk muß das Glas ersetzen. Eine Menge 
<lb/> zumal der kleineren Häuser sind nur durch Thüren durchbrochen. 
<lb/> Im Ganzen hat der Ort ein todtes Ansehen, mehr <gap quantity="1" reason="illegible" resp="#CE_UM" unit="words"/> als 
<lb/> <name type="geographic">Lapa</name><supplied reason="omitted-in-original" resp="#CE_UM">.</supplied> Ein großer Theil der Einwohner kommen nur an 
<lb/> Sonn und Feiertagen herein; fortwährend wohnen dort 
<lb/> nur die Handelsleute<supplied reason="omitted-in-original" resp="#CE_UM">,</supplied> die Magistratspersonen<supplied reason="omitted-in-original" resp="#CE_UM">,</supplied> an deren 
<lb/> Spitze der <name type="object">Ovidor</name><supplied reason="omitted-in-original" resp="#CE_UM">,</supplied> und einige alte Leute<supplied reason="omitted-in-original" resp="#CE_UM">,</supplied> zum Theil alte Mili- 
<lb/> tärpersonen. Ich wurde von S<supplied reason="omitted-in-original" resp="#CE_UM">enho</supplied><hi rendition="#sup">r</hi> <name type="person">Lorenço Pinto de Sa 
<lb/> Ribos</name> sehr gut empfangen<supplied reason="omitted-in-original" resp="#CE_UM">,</supplied> an den ich einen Empfehlungsbrief 
<lb/> von Major <name type="person">Silva</name> zu <name type="geographic">Lapa</name> hatte. Er bot mir sein Haus 
<lb/> zur Wohnung an und als ich dieses meiner Leute wegen nicht annehmen wollte, trat er mir ein kleines benachbartes<supplied reason="omitted-in-original" resp="#CE_UM">,</supplied>
</ab></div>
<pb facs="http://gbif.naturkundemuseum-berlin.de/CDV2018/Sellow/ZM_S_I_Sellow_Exk_09_4_v__2475.tif" n="04_v" xml:id="ZM_S_I_Sellow_Exk_09_04_v"/>
<div><head>Seite 04, verso (Bericht 09)</head><ab corresp="#ZM_S_I_Sellow_Exk_09_04_v">
<lb/> ihm auch zugehörendes Haus ab, wo ich freier arbeiten 
<lb/> konnte und dabei sein Gast blieb. <name type="person">Lorenço Pinto</name> war 
<lb/> der erste <name type="person">Juiz de Paz</name> <note resp="#CE_UM" type="editorial">Friedensrichter</note> zu Curitiba. Er ist einer der 
<lb/> wohlunterrichtetsten Curitibaner und gewährte mir sehr 
<lb/> angenehme Gesellschaft. Seine Frau und Tochter kamen 
<lb/> jedoch nie zum Vorschein und ich lernte sie nicht einmal dem 
<lb/> Ansehen nach kennen, obschon ich mich viele Tage hier aufhielt. 
<lb/> Wenn ich oder andere Gäste zum Frühstück oder Mittagsbrod 
<lb/> gerufen wurden<supplied reason="omitted-in-original" resp="#CE_UM">,</supplied> so zogen sie sich stets zuvor in die hinte- 
<lb/> ren Zimmer des Hauses zurück. Ein gedeckter Tisch wurde 
<lb/> alsdann aus der Küche hereingetragen und von der Familie 
<lb/> erschien allein der Hausherr an demselben. Mehrere Weiber<supplied reason="omitted-in-original" resp="#CE_UM">,</supplied>
<lb/> welche ich von Weitem zu sehen bekam<supplied reason="omitted-in-original" resp="#CE_UM">,</supplied> waren 
<lb/> groß, recht gebildet und von sehr guter Farbe und 
<lb/> besonders hübsche muntere Kinder sah ich im Orte. 
<lb/> Die Männer dieser Gegend sind meistens groß und 
<lb/> von sehr gutem Ansehen und haben viel Ähnlichkeit 
<lb/> mit den <name type="object">Continentisten</name>. Öffentliche Gebäude<supplied reason="omitted-in-original" resp="#CE_UM">,</supplied> welche 
<lb/> Erwähnung verdienen, die <name type="object">Matriz</name> etwa ausge- 
<lb/> nommen, welche groß genug ist, hat <name type="geographic">Curitiba</name> noch 
<lb/> nicht aufzuweisen. Man ist jedoch gegenwärtig 
<lb/> im Begriff<supplied reason="omitted-in-original" resp="#CE_UM">,</supplied> ein <name type="object">Rathhaus Gefängniß</name> zu bauen 
<lb/> und bemüht, auf dem schon erwähnten 
<lb/> Hügel der S<hi rendition="#sup"><supplied reason="omitted-in-original" resp="#CE_UM">an</supplied></hi> Fr<hi rendition="#sup"><supplied reason="omitted-in-original" resp="#CE_UM">ancisc</supplied>co</hi> Capelle ein <name type="object">Seminarium</name> zu er- 
<lb/> richten. Diese Idee ist ohne Zweifel sehr glücklich; die 
<lb/> Lage dieser Capelle ist vorzüglich. In Ost und Südost 
<lb/> breitet sich am Fuße ihres Hügels die V<hi rendition="#sup"><supplied reason="omitted-in-original" resp="#CE_UM">il</supplied>a</hi> aus<supplied reason="omitted-in-original" resp="#CE_UM">,</supplied> über dieselbe 
<lb/> hinaus ein 4 bis 5 L<supplied reason="omitted-in-original" resp="#CE_UM">egoa</supplied> weites fast ebenes <name type="object">Campo</name>, 
<lb/> hin wieder mit einem <name type="object">Capão</name> dieses wird durch 
<lb/> das schöne hohe Küstengebirge begränzt. In SO 
<lb/> sieht man die V<hi rendition="#sup"><supplied reason="omitted-in-original" resp="#CE_UM">il</supplied>a</hi> de <name type="geographic">S. José dos Pinhais</name>, und vor 
<lb/> ihr den Lauf des <name type="geographic"><choice><orig>Yguacú </orig><reg resp="#CE_UM">Rio Iguaçu</reg></choice></name> durch Waldstreifen bezeichnet. 
<lb/> Den östlich vor der V<hi rendition="#sup"><supplied reason="omitted-in-original" resp="#CE_UM">il</supplied>a</hi> vorbeifließenden Bach kann 
<lb/> man bis zu seinem Einfall in den <name type="geographic"><choice><orig>Yguacú </orig><reg resp="#CE_UM">Rio Iguaçu</reg></choice></name> mit den 
<lb/> Augen verfolgen. Gen N beschränkt die Waldung<supplied reason="omitted-in-original" resp="#CE_UM">,</supplied>
<lb/> welche sich von der Wasserscheide zwischen dem <name type="geographic">Açunguy</name>
<lb/> und <name type="geographic"> <choice><orig/><reg resp="#CE_UM">Rio Iguaçu</reg></choice></name> herabzieht<supplied reason="omitted-in-original" resp="#CE_UM">,</supplied> die Aussicht; etwas durch Wald 
<lb/> beschränkt ist sie auch gen W, weniger gen SW; 
</ab></div>
<pb facs="http://gbif.naturkundemuseum-berlin.de/CDV2018/Sellow/ZM_S_I_Sellow_Exk_09_5_r__2486.tif" n="05_r" xml:id="ZM_S_I_Sellow_Exk_09_05_r"/>
<div><head>Seite 05, recto (Bericht 09)</head><ab corresp="#ZM_S_I_Sellow_Exk_09_05_r">
<lb/> Wasser wird durch erwähnte Bäche in die Nähe des Hügels 
<lb/> geführt<supplied reason="omitted-in-original" resp="#CE_UM">.</supplied> Im Bezug auf die Lage dieses Punktes im 
<lb/> Allgemeinen, so könnte schwerlich ein vortheilhafterer in 
<lb/> der <name type="object">Comarca</name> <note resp="#CE_UM" type="editorial">Verwaltungseinheit</note> gefunden werden; Gesundes Klima, Rein- 
<lb/> lichkeit und Wohlfeilheit der Lebensmittel finden sich 
<lb/> hier. Die von <name type="geographic">Iguape</name> und <name type="geographic">Paranaguá</name> hier her gesendete Jugend 
<lb/> würde hier, wo der Körper stets zu Thätigkeit geneigt ist, so 
<lb/> viel für den Körper als für den Geist gewinnen. 
<lb/> Am 9<hi rendition="#sup">ten</hi> May trat ich die Exkursion nach <name type="geographic">Paranaguá</name> an 
<lb/> und kam diesen Tag bis <name type="geographic">Borda do Campo</name> oder an die Gränze 
<lb/> des bewaldeten Küstengebirges. Der Weg, auf dem man 
<lb/> nur an den Bächen Gebüsch findet<supplied reason="omitted-in-original" resp="#CE_UM">,</supplied> ist gut, nur macht 
<lb/> er eine starke unnöthige Biegung nach den Quellen 
<lb/> der ihn kreuzenden Bäche hin, auf deren Sehne man 
<lb/> beinahe ein Legoa abkürzen würde. Der <name type="object">Campo</name> stand 
<lb/> völlig verbleicht und zeigte keine Pflanze in Blüte<supplied reason="omitted-in-original" resp="#CE_UM">.</supplied>
<lb/> Ebenso winterhaft zeigten sich die Ufergebüsche und 
<lb/> <name type="object">Capãos</name>. In diesen sowohl als an den Ufern herrschen 
<lb/> <name type="plant">Pinheiros</name> vor<supplied reason="omitted-in-original" resp="#CE_UM">.</supplied> Das Wetter war leider nebligt und 
<lb/> das Küstengebürge blieb mir daher verdeckt. Ost und 
<lb/> Südwinde, besonders der SO Wind pflegen es meistens zu 
<lb/> verhüllen, wogegen der W und N Wind es von Nebel 
<lb/> und Gewölk reinigt und deutlich zeigt. In der Nähe 
<lb/> der V<hi rendition="#sup"><supplied reason="omitted-in-original" resp="#CE_UM">il</supplied>a</hi> liegen mehrere nicht üble <name type="object">Chacaras</name> in 
<lb/> größerer oder geringerer Entfernung vom Wege; 
<lb/> weiter hin trifft man nur schlechte Häuser an. 
<lb/> Gestein fand ich nur am <name type="geographic"> <choice><orig>Atûba </orig><reg resp="#CE_UM">Atuba</reg></choice></name> anstehend<supplied reason="omitted-in-original" resp="#CE_UM">,</supplied> nämlich in St<supplied reason="omitted-in-original" resp="#CE_UM">unde</supplied> 3 streichenden <name type="rock_mineral">Gneus</name> mit gestürzten 
<lb/> Flasern. In der Nähe der V<hi rendition="#sup"><supplied reason="omitted-in-original" resp="#CE_UM">il</supplied>a</hi> am l<supplied reason="omitted-in-original" resp="#CE_UM">inken</supplied> Ufer zumal des 
<lb/> dortigen Bachs läßt sich der <name type="rock_mineral">Lehmen des Flötztrapps</name>
<lb/> deutlich erkennen. Zur Linken zeigten sich trotz des 
<lb/> Nebels einige kleine Berge<supplied reason="omitted-in-original" resp="#CE_UM">,</supplied> welche zusammen einen 
<lb/> in <supplied reason="omitted-in-original" resp="#CE_UM">Stunde</supplied> 3 – 4 streichenden Zug zu bilden scheinen<supplied reason="omitted-in-original" resp="#CE_UM">,</supplied> von welchen 
<lb/> gen S. Bäche zum <name type="geographic"><choice><orig>Yguacú </orig><reg resp="#CE_UM">Rio Iguaçu</reg></choice></name> herabkommen<supplied reason="omitted-in-original" resp="#CE_UM">,</supplied> gen N andere 
<lb/> zum <name type="geographic">Açunguy</name> und <name type="geographic">Capivary</name> gehen, und dieser Zug ist 
<lb/> bewaldet wie der ganze <name type="object">Certão</name> des <name type="geographic">Açunguy</name>. 
</ab></div>
<pb facs="http://gbif.naturkundemuseum-berlin.de/CDV2018/Sellow/ZM_S_I_Sellow_Exk_09_5_v__2476.tif" n="05_v" xml:id="ZM_S_I_Sellow_Exk_09_05_v"/>
<div><head>Seite 05, verso (Bericht 09)</head><ab corresp="#ZM_S_I_Sellow_Exk_09_05_v">
<lb/> Ich fand bei dem Besitzer der <name type="geographic">Est<hi rendition="#sup"><supplied reason="omitted-in-original" resp="#CE_UM">anci</supplied>a</hi> da Borda do Campo</name>
<lb/> <name type="person">Joaq<hi rendition="#sup"><supplied reason="omitted-in-original" resp="#CE_UM">ui</supplied>m</hi> Alvez de Araujo</name> ein erträgliches Unterkommen und <supplied reason="omitted-in-original" resp="#CE_UM">konnte</supplied>
<lb/> für 2 Tage bleiben<supplied reason="omitted-in-original" resp="#CE_UM">,</supplied> um trocknes und helles Wetter 
<lb/> abzuwarten. Die Waldung am diesseitigen Abhange 
<lb/> des Gebirges ist reich an <name type="plant">Pinheiros</name> und auch ziemlich 
<lb/> reich an <seg type="agriculture_crafts">Herva</seg>. In Blüte sah ich hier die <name type="plant">Rhexia 
<lb/> mutabilis</name>. Die Vögel<supplied reason="omitted-in-original" resp="#CE_UM">,</supplied> welche eingebracht wurden<supplied reason="omitted-in-original" resp="#CE_UM">,</supplied> waren 
<lb/> alle Arten<supplied reason="omitted-in-original" resp="#CE_UM">,</supplied> die ich bei <name type="geographic"><choice><orig>Ypanema </orig><reg resp="#CE_UM">Ipanema</reg></choice></name> gesehen hatte. 
<lb/> Wenn man das Küstengebirge auf seiner westlichen Seite aus 
<lb/> einiger Entfernung betrachtet<supplied reason="omitted-in-original" resp="#CE_UM">,</supplied> so unterscheidet man 
<lb/> 4 Gruppen<supplied reason="omitted-in-original" resp="#CE_UM">,</supplied> welche durch Zwischenräume oder Lücken voneinander 
<lb/> getrennt werden: z<supplied reason="omitted-in-original" resp="#CE_UM">ur</supplied> Rechten die <name type="geographic">S<supplied reason="omitted-in-original" resp="#CE_UM">err</supplied><hi rendition="#sup">a</hi> de S. José</name> oder auch de 
<lb/> <name type="geographic">S<hi rendition="#sup">t</hi> Francisco</name>, weil dort ein Weg nach <name type="geographic">S. Fr<supplied reason="omitted-in-original" resp="#CE_UM">ancis</supplied><hi rendition="#sup">co</hi></name> hinabgeht<supplied reason="omitted-in-original" resp="#CE_UM">,</supplied>
<lb/> in der Mitte der <name type="geographic">Serra do Marumbi</name>, z<supplied reason="omitted-in-original" resp="#CE_UM">ur</supplied> Linken die 
<lb/> <name type="geographic">S<supplied reason="omitted-in-original" resp="#CE_UM">err</supplied><hi rendition="#sup">a</hi> dos Orgãos</name> und weiter hin zur Linken die <name type="geographic">S<supplied reason="omitted-in-original" resp="#CE_UM">err</supplied><hi rendition="#sup">a</hi> Negra</name><supplied reason="omitted-in-original" resp="#CE_UM">.</supplied>
<lb/> Die 2<hi rendition="#sup">te</hi> Gruppe hat wohl die höchste Spitze am Punkte<supplied reason="omitted-in-original" resp="#CE_UM">,</supplied> welcher 
<lb/> speziel <name type="geographic">Moro do Marumbi</name> heißt, allein die auffallendste 
<lb/> Formen hat die <name type="geographic">S<supplied reason="omitted-in-original" resp="#CE_UM">err</supplied><hi rendition="#sup">a</hi> dos Orgãos</name>. Zwischen der <name type="geographic">S<supplied reason="omitted-in-original" resp="#CE_UM">err</supplied><hi rendition="#sup">a</hi> de S<hi rendition="#sup">t</hi> Fr<supplied reason="omitted-in-original" resp="#CE_UM">ansic</supplied><hi rendition="#sup">co</hi></name>
<lb/> und der <name type="geographic">do Marumbi</name> geht ein Weg nach der <name type="geographic">Freguesia 
<lb/> dos Maretos</name> hinab<supplied reason="omitted-in-original" resp="#CE_UM">,</supplied> den die Einwohner von <name type="geographic">S<hi rendition="#sup">t</hi> José</name> bei gutem Wetter zuweilen nehmen. Dieser ist der älteste 
<lb/> der Wege von <name type="geographic">Curitiba</name> nach <name type="geographic">Paranagua</name> und man hat 
<lb/> vor vielen Jahren auf ihm einen großen <name type="plant">Pinheiro</name>
<lb/> zu einem Hauptmaste eines Kriegsschiffes hinabgeschaft. 
<lb/> Zwischen der Gruppe des <name type="geographic">Marumbi</name><supplied reason="omitted-in-original" resp="#CE_UM">,</supplied> welche mit der 
<lb/> der <name type="geographic">Maicatina</name> von hier aus fast als zusammen- 
<lb/> hängend erscheint und der des <name type="geographic">Orgãos</name> steigt ein Weg 
<lb/> nach <name type="geographic">V<hi rendition="#sup"><supplied reason="omitted-in-original" resp="#CE_UM">il</supplied>a</hi> do Antonina</name> hinab, den man zum Hinabtreiben 
<lb/> von Viehherden benutzt. Einen anderen Weg 
<lb/> hinab nach <name type="geographic">Antonina</name> hat man unlängst südlich von 
<lb/> der <name type="geographic">S<supplied reason="omitted-in-original" resp="#CE_UM">err</supplied><hi rendition="#sup">a</hi> Negro</name> vom <name type="geographic">Campo do Puruna</name> circa 9 
<lb/> L<supplied reason="omitted-in-original" resp="#CE_UM">egoa</supplied> von <name type="geographic">Curitiba</name> zu eröffnen angefangen und hat 
<lb/> auf demselben auch schon Vieh hinab geführt. Der 
<lb/> am allgemeinsten gebrauchte Weg sowohl nach <name type="geographic"><choice><orig> Mo- 
<lb/> retes</orig> <reg resp="#CE_UM">Morretes</reg></choice></name> als <name type="geographic">Antonina</name> liegt in der Gruppe des 
<lb/> <name type="geographic">Marumbi</name> und läuft durch ein Querthal, fast von 
<lb/> W gen O, welches sehr wohl westlich durch den <name type="geographic"><choice><orig> Moro 
<lb/> da Pedra branca</orig> <reg resp="#CE_UM"> Morro da Pedra Branca</reg></choice></name> und östlich durch den <name type="geographic">S<hi rendition="#sup"><supplied reason="omitted-in-original" resp="#CE_UM">err</supplied>a</hi> do Marumbi</name>
</ab></div>
<pb facs="http://gbif.naturkundemuseum-berlin.de/CDV2018/Sellow/ZM_S_I_Sellow_Exk_09_6_r__2487.tif" n="06_r" xml:id="ZM_S_I_Sellow_Exk_09_06_r"/>
<div><head>Seite 06, recto (Bericht 09)</head><ab corresp="#ZM_S_I_Sellow_Exk_09_06_r">
<lb/> bezeichnet wird, dieser der sechste Berg, des ganzen von 
<lb/> <name type="geographic">Paranaguá</name> und von <name type="geographic">Curitiba</name> aus in den Gesichtskreis 
<lb/> kommenden Stücks des Küstengebirges, jener der höchste Berg 
<lb/> auf der westlichen Gränze desselben, der seinen Namen 
<lb/> von einer nackten Stelle an seinem Kopfe hat, welche 
<lb/> man von Curitiba aus sehr wohl als grauen nackten Felsen 
<lb/> unterscheiden kann. 
</ab></div>
</body>
</text>
</TEI>