<?xml version="1.0" encoding="utf-8"?>
<?xml-model href="mfn_manuskripte_schema.rng" type="application/xml" schematypens="http://relaxng.org/ns/structure/1.0"?><?xml-model href="mfn_manuskripte_odd.xml" type="application/tei+xml" schematypens="http://www.tei-c.org/ns/1.0"?><TEI xmlns="http://www.tei-c.org/ns/1.0">
<teiHeader>
<fileDesc>
<titleStmt resp="#LK">
<title level="u" xml:id="de_title" xml:lang="de">Exkursionsberichte von Friedrich Sellow (digitale Transkripte)  – Bericht Nr. 17</title>
<title corresp="#de_title" xml:lang="en">Field trip reports written by Friedrich Sellow (digital transcriptions) – Report No. 17</title>
<author xml:id="FS">Friedrich Sellow</author>
<respStmt xml:id="CE_UM">
<name>Carsten Eckert</name>
<name>Ulrich Moritz</name>
<resp>Transkription und Edition</resp>
</respStmt>
<respStmt xml:id="LK">
<name>Laura E. Kaiser</name>
<resp>Konvertierung in TEI-konformes Markup</resp>
</respStmt>
</titleStmt>
<publicationStmt resp="#LK">
<authority>Museum für Naturkunde, Leibniz-Institut für Evolutions- und Biodiversitätsforschung</authority>
<date>2020</date>
<availability status="restricted">
<licence target="https://creativecommons.org/licenses/by-sa/3.0/de/"> 
                    Dieses Werk ist lizenziert unter einer Creative Commons Namensnennung - Weitergabe unter gleichen Bedingungen 3.0 Deutschland Lizenz.
                </licence>
</availability>
</publicationStmt>
<sourceDesc>
<bibl>Exkursionsberichte der Reisen durch Brasilien und Uruguay von Friedrich Sellow, 1822-1831</bibl>
</sourceDesc>
</fileDesc>
<encodingDesc resp="#LK">
<projectDesc>
<p>Die Texte wurden von Carsten Eckert und Ulrich Moritz für die wissenschaftliche Nutzung durch die Historische Arbeitsstelle des Museum für Naturkunde, Leibniz Institut für Evolutions- und Biodiversitätsforschung transkribiert.</p>
<p>Im Rahmen einer Masterarbeit wurden die Transkripte aus dem .doc-Format (MS Word) in ein TEI-konformes XML-Dokument überführt, dem das im verknüpften XML Schema spezifizierte Datenmodell zugrunde liegt.</p>
</projectDesc>
<editorialDecl>
<p>Sämtliche editorische Eingriffe wurden in den ursprünglichen Transkripten kenntlich gemacht. Alle dieser Markierungen wurden mit - soweit wie möglich - differenzierenden Tags kenntlich gemacht (siehe die beschriebenen Besonderheiten in &lt;tagsDecl&gt;.</p>
<p>Silbentrennung, Zeilenumbrüche und Interpunktion wurden aus dem Original übernommen.</p>
</editorialDecl>
<tagsDecl partial="true">
<rendition scheme="css" xml:id="et">margin-left:4em;</rendition>
<rendition scheme="css" xml:id="red">color:red</rendition>
<rendition scheme="css" xml:id="r">text-align:right;</rendition>
<rendition scheme="css" xml:id="c">text-align:center;</rendition>
<rendition scheme="css" xml:id="s">text-decoration:line-through</rendition>
<rendition scheme="css" xml:id="sup">vertical-align:super; font-size:.7em</rendition>
<rendition scheme="css" xml:id="u">text-decoration:underline</rendition>
<rendition scheme="css" xml:id="v">float:left; transform:rotate(270deg);</rendition>
<rendition scheme="css" selector="body">text-align:justify;</rendition>
<namespace name="https://tei-c.org/ns/1.0/">
<tagUsage gi="reg" resp="#LK">
                    &lt;reg&gt;-Elemente enthalten vom Original abweichende Schreibweisen. Diese umfassen einerseits, wie entsprechend der TEI Richtlinien für dieses Element vorgesehen, die Normalisierung untypischer Schreibweisen, darüber hinaus jedoch mitunter auch die Korrektur falscher Schreibweisen.
                    Diese Ungenauigkeit ist der ursprünglichen Transkription geschuldet, die keine Kodierung entsprechend der TEI-Richtlinien vorsah und entsprechend keine Differenzierung der editorischen Eingriffe vorgenommen hat. Da die Konvertierung nicht von den Transkribierern selbst, sondern von anderer Hand und weitgehend automatisiert vorgenommen wurde, wurden derartige Korrekturen vereinfachend ebenfalls mittels &lt;reg&gt; annotiert, was gegenüber einer (aufgrund mangelnder Expertise bezüglich historischer Schreibweisen) möglicherweise irrtümlichen Auszeichnung als korrigierte Form (&lt;corr&gt;) als geeignetere Strategie erscheint, die Konformität der Kodierung gegenüber dem TEI Abstract Model zu gewährleisten.
                    Eventuelle spätere Versionen dieser kodierten Texte sollten diesen Mangel beheben, indem Korrekturen innerhalb von &lt;corr&gt;-Elementen stehen und die originale Form entsprechend mit &lt;sic&gt; (anstatt derzeit &lt;orig&gt;) annotiert wird.
                </tagUsage>
<tagUsage gi="supplied" resp="#LK">
                    &lt;supplied&gt;-Elemente kennzeichnen editorische Ergänzungen. Da in den ursprünglichen Transkripten absichtlich abgekürzte Schreibweisen nicht eindeutig von (aufgrund vergessener Zeichen/Wörter) falschen Schreibweisen unterscheidbar waren, wurden jegliche editorischen Einfügungen durch ein &lt;supplied&gt;-Element gekennzeichnet, unabhängig davon, ob sie dem Zweck der Auflösung von Abkürzungen oder der Korrektur von Fehlern durch ausgelassenen Text bzw. Zeichen folgen.
                    In einer künftigen Version sollte diese Ungenauigkeit behoben werden, indem lediglich offensichtlich beabsichtigte Auslassungen mittels des &lt;supplied&gt;-Elements ausgezeichnet werden. Falsche Schreibweisen sollten korrigiert werden, indem die korrekte Schreibweise innerhalb eines &lt;corr&gt;-Elements neben der Original-Variante innerhalb eines &lt;sic&gt;-Elements steht, die wiederum beide von einem &lt;choice&gt;-Element umgeben sind. Abkürzungsauflösungen sollten dann anhand des &lt;expan&gt;-Tags ausgezeichnet werden, der neben dem abgekürzten originalen Textteil als &lt;abbr&gt;-Element innerhalb eines &lt;choice&gt;-Elements steht.
                </tagUsage>
<tagUsage gi="seg" resp="#LK">
                    &lt;seg&gt;-Elemente wurden für die Codierung thematisch kategorisierter Textpassagen verwendet. Darin enthaltene Namen sind aufgrund der automatischen Textcodierung noch nicht als solche codiert worden, weil einerseits nicht zwischen Textpassagen und Namen dieser thematischen Abschnitte vorgenommen wurde und andererseits auch keine automatisierte Zuordnung zum übergeordneten type-Attribut der &lt;name&gt;-Elemente möglich gewesen wäre. Bezüglich der &lt;seg&gt;-Elemente wäre es daher wünschenswert, in einer eventuellen künftigen Version Namen darin separat mit einer entsprechenden type- und subtype-Kategorisierung auszuzeichnen.
                    Darüber hinaus wurden &lt;seg&gt;-Elemente behelfsweise für die Auszeichnung von Messdaten verwendet, weil die fachliche Expertise zur feineren Codierung mittels &lt;measure&gt;- bzw. &lt;measureGrp&gt;-Elementen mit den zugehörigen Attributen fehlte. In künftigen Überarbeitungen sollte auch diese Unschärfe möglichst behoben werden.
                </tagUsage>
<tagUsage gi="foreign">
                    Das &lt;foreign&gt;-Element wird in der derzeitigen Codierung ohne die Angabe der Sprache im xml:lang-Attribut verwendet, weil die Unterscheidung zwischen portugiesisch und spanisch in den Transkripten nicht vorhanden war. In künftigen Überarbeitungen sollte diese Information für &lt;foreign&gt;-Elemente ergänzt werden.
                </tagUsage>
</namespace>
</tagsDecl>
<refsDecl>
<p>Jeder Exkursionsbericht ist über das @n-Attribut eines &lt;text&gt;- wie auch body-Elements eindeutig identifizier- und adressierbar.</p>
<p>Ebenso sind Seitenbeginne innerhalb des @n-Attributs jedes &lt;pb&gt;-Elements nummeriert und identifizierbar.</p>
<p>Darüber hinaus ist jede Seite innerhalb eines &lt;ab&gt;-Element über dessen @xml:id-Attribut eindeutig identifizierbar. Die jeweilige ID folgt dem Muster des regulären Ausdrucks'ZM_S_I_Sellow_Exk_[0-9]{2}_[0-9]{2}a?(_(r|v))?' und stellt die hausinterne Signatur innerhalb des Museums für Naturkunde dar.</p>
</refsDecl>
</encodingDesc>
<profileDesc>
<handNotes>
<handNote corresp="#FS">
<p>Handschrift Friedrich Sellows</p>
</handNote>
<handNote xml:id="CAT">
<p>Handschrift Carl August Tennes</p>
</handNote>
<handNote xml:id="unknown">
<p>Handschrift einer unbekannten Person (bzw. Identifizierung der Handschrift nicht angegeben)</p>
</handNote>
</handNotes>
</profileDesc>
<revisionDesc>
<change when="2020-06-29" who="#LK">
<p>Diese Änderung beinhaltet die Konvertierung der Transkripte aus dem doc-Format in TEI P5 konforme XML-Daten, wobei auch die editorischen Eingriffe der Transkribierer soweit möglich spezifiziert wurden.</p>
</change>
</revisionDesc>
</teiHeader>
<text>
<body>
<pb facs="http://gbif.naturkundemuseum-berlin.de/CDV2018/Sellow/ZM_S_I_Sellow_Exk_17_1_r__2525.tif" n="01_r" xml:id="ZM_S_I_Sellow_Exk_17_01_r"/>
<div><head>Seite 01, recto (Bericht 17)</head><ab corresp="#ZM_S_I_Sellow_Exk_17_01_r">
<lb/> <hi rendition="#r"> <add hand="#unknown">Prov Parana</add></hi>
<lb/> <hi rendition="#u">Excursion nach den <name type="geographic">Campos do Fortaleza</name>
<lb/></hi> Diese haben den Ruf, daß sie vorzügliche Viehweiden liefern, 
<lb/> und für nach den nördlichen Provinzen bestimmte Maulthier- 
<lb/> truppen die besten <name type="object">Invernadas</name> <note resp="#CE_UM" type="editorial">Überwinterung</note> im <name type="geographic">Campo geraes</name> abgeben; 
<lb/> zugleich werden sie für sehr reich an Pflanzen gehalten. Ihren 
<lb/> Namen haben sie von einem tief eingeschnittenen Bach 
<lb/> mit an Stellen felsigern Ufern, welche nur an wenigen 
<lb/> Stellen Übergänge gestatteten, den <name type="geographic">Ar<hi rendition="#sup"><supplied reason="omitted-in-original" resp="#CE_UM">roy</supplied>o</hi> do Fortaleza</name>, 
<lb/> der sich in den <name type="geographic"><choice><orig>Yapo </orig><reg resp="#CE_UM">Iapó</reg></choice></name> ergießt circa 1 L<supplied reason="omitted-in-original" resp="#CE_UM">egoa</supplied> oberhalb der 
<lb/> Mündung des letzteren in den <name type="geographic"><choice><orig>Tibagy </orig><reg resp="#CE_UM">Tibagi</reg></choice></name>. Um diese Cam- 
<lb/> pos zu besuchen<supplied reason="omitted-in-original" resp="#CE_UM">,</supplied> verließ ich <name type="geographic">Castro</name> am 5<hi rendition="#sup">ten</hi>, indem 
<lb/> auf Regenwetter, welches fast den ganzen October angehalten 
<lb/> hatte, nun trockeneres folgen zu wollen schien, und kam 
<lb/> diesen Tag bis zum <name type="person">Campo do Apariça</name>, 3 kleine Legoas 
<lb/> von <name type="geographic">Castro</name>. Der Weg läuft in westliche Richtung 
<lb/> in der Nähe des <name type="geographic">Yapo</name> an seinem linken Thalge- 
<lb/> hänge hin, und ist sehr gut, obschon er über Hügel läuft in 
<lb/> einer bergigen Gegend und oft durch <name type="object">Capoeiras</name> und 
<lb/> <name type="object"> <choice><orig/><reg resp="#CE_UM"> Catanduva</reg></choice><note resp="#CE_UM" type="editorial">Pflanzung von Nutz- bzw. Hartholz</note></name> geht, indem auf dieser ganzen Strecke 
<lb/> Wald und <name type="object">Campo</name> abwechselt. Die <name type="person">Caatanduvas</name> gehen 
<lb/> oft in mit <name type="plant">Pinheiros</name> besetzte <name type="object">Campestres</name>, und endlich 
<lb/> in reines Campo über, welche hier jedoch nur stets 
<lb/> arm an Grasarten sind. <name type="geographic">Castro</name> verliert man sehr 
<lb/> bald, schon nachdem man die nächsten westlichen Hügel 
<lb/> überstiegen, aus dem Gesichte; allein die Aussicht 
<lb/> von diesen aus gen Ost ist interessant und ziemlich 
<lb/> ausgedehnt; indem man mehrere am <name type="object">Certão</name> des 
<lb/> <name type="person">Acunguy</name> liegende Höhen sieht, wovon einige bis 3 
<lb/> und 4 Legoas entfernt sein mögen; der <supplied reason="omitted-in-original" resp="#CE_UM">Rio</supplied> <name type="geographic">Yapó</name>
<lb/> kommt weiterhin nicht früher zu Gesicht als außer 
<lb/> vor der Mündung des <name type="geographic">Ar<hi rendition="#sup"><supplied reason="omitted-in-original" resp="#CE_UM">roy</supplied>o</hi> do Aparicão</name>, indessen 
<lb/> bezeichnen Höhen zu beiden Seiten seinen Lauf 
<lb/> in den Yapó<supplied reason="omitted-in-original" resp="#CE_UM">.</supplied> Das auf diesem Wege hin wieder an- 
<lb/> stehende Gestein ist <name type="rock_mineral">Thonporphyr</name>, dem vollkommmen ähnlich<supplied reason="omitted-in-original" resp="#CE_UM">,</supplied>
<lb/> der bei <name type="geographic">Castro</name> bricht. Wo ich übernachtete<supplied reason="omitted-in-original" resp="#CE_UM">,</supplied> standen 
<lb/> 3 zerstreut liegende Wohnungen, wovon die eine<supplied reason="omitted-in-original" resp="#CE_UM">,</supplied> welche 
<lb/> dem Bache am nächsten lag<supplied reason="omitted-in-original" resp="#CE_UM">,</supplied> verlassen stand. An den 
<lb/> Ufern hin blüte noch die <name type="plant">Congonha Legitima</name> <note resp="#CE_UM" type="orig"><term>Ilex cerasifolia</term></note>. 
<lb/> Am 6<hi rendition="#sup">ten</hi> <choice><orig>9<hi rendition="#sup">ber</hi></orig> <reg resp="#CE_UM"> November</reg></choice> kam ich bis zur Est<hi rendition="#sup"><supplied reason="omitted-in-original" resp="#CE_UM">anci</supplied>a</hi> des <name type="person">Alf<hi rendition="#sup"><supplied reason="omitted-in-original" resp="#CE_UM">ons</supplied>o</hi> Alvaro Gl<hi rendition="#sup">z</hi> Martins</name> bei 7 L<supplied reason="omitted-in-original" resp="#CE_UM">egoa</supplied> von <name type="geographic">Castro</name>. Der Weg läuft 
</ab></div>
<pb facs="http://gbif.naturkundemuseum-berlin.de/CDV2018/Sellow/ZM_S_I_Sellow_Exk_17_1_v__2526.tif" n="01_v" xml:id="ZM_S_I_Sellow_Exk_17_01_v"/>
<div><head>Seite 01, verso (Bericht 17)</head><ab corresp="#ZM_S_I_Sellow_Exk_17_01_v">
<lb/> zunächst noch eine Strecke weit westlich bald durch <name type="object">Campo</name> bald 
<lb/> durch Wald über <name type="rock_mineral">Thonporphyr</name><supplied reason="omitted-in-original" resp="#CE_UM">,</supplied> in welchem <name type="rock_mineral">Lager von 
<lb/> Thoneistenstein</name> vorkommen, welcher sich aus dem <name type="rock_mineral">Porphyr</name> gebildet 
<lb/> zu haben scheint; dann findet man den <name type="rock_mineral">Porphyr mit Thon- 
<lb/> sandstein</name> von der Beschaffenheit des der <name type="person">Serra </name><name type="geographic">dos Carlos</name> be- 
<lb/> deckt. Die Gränze zwischen beiden Gesteinen zeigt sich hier 
<lb/> deutlich und der <name type="rock_mineral">Sandst<supplied reason="omitted-in-original" resp="#CE_UM">ein</supplied></name> ist an diesem Punkte seiger ab- 
<lb/> gestürzt<supplied reason="omitted-in-original" resp="#CE_UM">.</supplied> Die Bank schien bei 10 oder 12 Lachter mächtig. 
<lb/> Schichten von grobkörnigen durchsetzen den kleinkörnigen 
<lb/> mehrmals. Sie sind zum Theil an diesem Punkte 
<lb/> 5 – 10° nach W eingeschossen, an anderen Stellen söhlig und 
<lb/> nach verschiedenen anderen Richtungen hin geneigt, wie 
<lb/> es beim Sandstein von <name type="person">Toquary</name> zu geschehen pflegt. Hat 
<lb/> man diese Bank erstiegen, welches ohne Schwierigkeit 
<lb/> geschehen kann, so befindet man sich in einem reinen<supplied reason="omitted-in-original" resp="#CE_UM">,</supplied>
<lb/> sehr verflachten <name type="object">Campo</name>, worin nur selten kleine <name type="object">Capãos</name>
<lb/> vorkommen; und wo sich Felsen nur an einigen Schluchten 
<lb/> Bächen zeigen. Der Boden desselben ist sandig 
<lb/> nur an söhligen Stellen, wo sich Brüche erzeugen 
<lb/> können, schwarze Dammerde. Das Campo ist reich an 
<lb/> kleinen <name type="plant">Myrten (</name><name type="person">Patangos</name><name type="plant"> und </name><name type="person">Uvaras</name>)<supplied reason="omitted-in-original" resp="#CE_UM">.</supplied> Der Weg läuft 
<lb/> meist auf dem fünften Striche zwischen dem <name type="geographic">Tibagy</name>
<lb/> und <name type="geographic">Yapó</name> hin, und man übersieht von demselben aus 
<lb/> eine ansehnliche Strecke Landes. Das Thal des <name type="geographic">Yapó</name>
<lb/> zeigt sich von verschiedenen Stellen aus. 
<lb/> Das Niveau bleibt ziemlich gleich bis zur Est<hi rendition="#sup"><supplied reason="omitted-in-original" resp="#CE_UM">anci</supplied>a</hi> des 
<lb/> <name type="person">Alvaro</name>. Zweimal führt der Weg durch sogenannte <name type="object"><choice><orig> Boc- 
<lb/> querãos</orig> <reg resp="#CE_UM"> Boquerãos</reg></choice></name>, wo Strecken des Campo durch wenige Scheitel- 
<lb/> <unclear cert="unknown" resp="#CE_UM">punkte</unclear> zu beiden Seiten hinabsenkende Bachschluchten bis 
<lb/> auf wenige Klafter, wo man Gehege anzulegen pflegt<supplied reason="omitted-in-original" resp="#CE_UM">,</supplied>
<lb/> getrennt sind, so daß Vieh von der einen zur anderen 
<lb/> hinüber gelangen kann. In den Schluchten in den 
<lb/> Capãos finden sich <name type="plant">Pinheiros</name>. Noch ehe man <name type="person">Alvaros</name>
<lb/> Est<hi rendition="#sup"><supplied reason="omitted-in-original" resp="#CE_UM">anci</supplied>a</hi> erreicht<supplied reason="omitted-in-original" resp="#CE_UM">,</supplied> sieht man im <name type="object">Certão</name> die <name type="geographic"><choice><orig> Serras Agudos</orig> <reg resp="#CE_UM">Serra dos Agudos</reg></choice></name>, 
<lb/> drei Berge<supplied reason="omitted-in-original" resp="#CE_UM">,</supplied> wovon der eine eine Kegel<supplied reason="omitted-in-original" resp="#CE_UM">,</supplied> der andere 
<lb/> dreizackig<supplied reason="omitted-in-original" resp="#CE_UM">,</supplied> der dritte von gemeiner Form ist. 
<lb/> Das Haus des <name type="person">Alvaro</name> liegt an einem beträcht<supplied reason="omitted-in-original" resp="#CE_UM">lichen</supplied> <name type="object">Capão</name><supplied reason="omitted-in-original" resp="#CE_UM">,</supplied>
<lb/> aus dem sich ein Abzug hinab senkt. Bei demselben 
<lb/> lag ein kleiner Garten mit <seg type="agriculture_crafts">Orangen Limonen- 
<lb/> Bäumen einigen Blumen</seg>. Es war nur mit Stroh 
</ab></div>
<pb facs="http://gbif.naturkundemuseum-berlin.de/CDV2018/Sellow/ZM_S_I_Sellow_Exk_17_2_r__2527.tif" n="02_r" xml:id="ZM_S_I_Sellow_Exk_17_02_r"/>
<div><head>Seite 02, recto (Bericht 17)</head><ab corresp="#ZM_S_I_Sellow_Exk_17_02_r">
<lb/> gedeckt, allein reinlich und hatte einen großen Saal mit 
<lb/> Tisch und Bänken. Um mehr Raum zu haben<supplied reason="omitted-in-original" resp="#CE_UM">,</supplied> waren zwei 
<lb/> Häuser dicht aneinander gestellt und das Regenwasser 
<lb/> in einer durch den Saal laufenden aufgehängten hölzernen 
<lb/> Rinne aufgefangen. Die <name type="plant">Mais und Bohnenpflanzungen</name>
<lb/> der Est<hi rendition="#sup"><supplied reason="omitted-in-original" resp="#CE_UM">anci</supplied>a</hi> lagen am <name type="geographic">Yapó</name>, zu dem von hier circa 1 L<supplied reason="omitted-in-original" resp="#CE_UM">egoa</supplied>. 
<lb/> Ich wurde freundlich von ihm aufgenommen; nur waren seine 
<lb/> Bemühungen<supplied reason="omitted-in-original" resp="#CE_UM">,</supplied> sich gefällig zu machen<supplied reason="omitted-in-original" resp="#CE_UM">,</supplied> lästig. Seine Frau 
<lb/> kam nie zum Vorschein. Er war sehr besorgt, daß einer seiner 
<lb/> sechs Söhne<supplied reason="omitted-in-original" resp="#CE_UM">,</supplied> welcher noch zu Hause war<supplied reason="omitted-in-original" resp="#CE_UM">,</supplied> gegenwärtig genöthigt 
<lb/> werden würde, in den Krieg zu ziehen, und lamentirte 
<lb/> wiederholend deswegen. Gemeinsinn und Patrioitismus trifft 
<lb/> man hier nur selten; gemeiniglich findet man die Leute 
<lb/> auf ihrem engen Kreise eingeschränkt. Ich blieb 
<lb/> hier den nächsten Tag. <name type="person">Alvaro</name> verließ mich keinen Augen- 
<lb/> blick, und sah mir fast den ganzen Tag lang zu, <seg type="agriculture_crafts">wie ich Pflan- 
<lb/> zen untersuchte, oder mit anderen Naturalien beschäftigt 
<lb/> war</seg>, während er auf einer Bank hingestreckt lag. 
<lb/> Bei meiner Ankunft fand ich ihn auf einem Maulthiere um- 
<lb/> herreiten, dem die Sehne des einen Fußes durchschnitten worden 
<lb/> und welches daher nicht auf dem Hufe<supplied reason="omitted-in-original" resp="#CE_UM">,</supplied> sondern auf der 
<lb/> Vorderseite des Fußes gebrechlich und hinkend auftrat<supplied reason="omitted-in-original" resp="#CE_UM">.</supplied>
<lb/> Zum Reisen und zum Tragen schwerere Lasten unfähig, wurde 
<lb/> das Thier doch benutzt zum Dienste in der Nachbarschaft 
<lb/> der Häuser. 
<lb/> Den 8<hi rendition="#sup">ten</hi> <supplied reason="omitted-in-original" resp="#CE_UM">November</supplied> ging ich bis zur Mündung des <name type="geographic">Yapó</name>. Der Weg 
<lb/> läuft meist nordwestlich und das Niveau sinkt nach und 
<lb/> nach. Nicht weit von <name type="person">Alvaro</name> ließ ich die Est<hi rendition="#sup"><supplied reason="omitted-in-original" resp="#CE_UM">anci</supplied>a</hi> von 
<lb/> <name type="person">T<hi rendition="#sup"><supplied reason="omitted-in-original" resp="#CE_UM">enen</supplied>te</hi> José Gl<hi rendition="#sup">z</hi> Guimarães</name> Rechts liegen, der zu den reichsten 
<lb/> in <name type="geographic">Campos Geraes</name> gezählt wird. Die Häuser<supplied reason="omitted-in-original" resp="#CE_UM">,</supplied> welche nur klein 
<lb/> sind und nichts ausgezeichnetes haben<supplied reason="omitted-in-original" resp="#CE_UM">,</supplied> liegen an der Quelle 
<lb/> eines Bachs<supplied reason="omitted-in-original" resp="#CE_UM">,</supplied> um die sich ein Wäldchen hinzieht, die Aussicht 
<lb/> auf den <name type="object">Certão</name><supplied reason="omitted-in-original" resp="#CE_UM">,</supplied> dessen Gränze hier bis zum <name type="geographic">Yapó</name> <unclear cert="unknown" resp="#CE_UM"><supplied reason="omitted-in-original" resp="#CE_UM">o</supplied>der</unclear> <name type="geographic">Tibagy</name> reicht<supplied reason="omitted-in-original" resp="#CE_UM">,</supplied>
<lb/> ist von hier aus deutlicher. Letzterer scheint in h.11 zu laufen<supplied reason="omitted-in-original" resp="#CE_UM">.</supplied>. 
<lb/> <name type="animal">Curicacas</name> und <name type="person">Tero-teros <note resp="#CE_UM" type="orig"><term>Vanellus chilensis</term></note> (<term>Ibis albicollis</term> <note resp="#CE_UM" type="editorial">Curicacas</note> Tringa cayennensis <note resp="#CE_UM" type="editorial"/><name type="animal">Spornkibitz</name>)</name>
<lb/> kommen nicht selten hier vor. Erstere machen auch ein sehr 
<lb/> unangenehmes zweitöniges Geschrei beim Auffliegen<supplied reason="omitted-in-original" resp="#CE_UM">.</supplied>
<lb/> Man sieht davon oft paarweise, aber auch in Flügen von sechsen, zehnen mehrerer. Vom <name type="geographic">Yapó</name> erkennt man 
</ab></div>
<pb facs="http://gbif.naturkundemuseum-berlin.de/CDV2018/Sellow/ZM_S_I_Sellow_Exk_17_2_v__2528.tif" n="02_v" xml:id="ZM_S_I_Sellow_Exk_17_02_v"/>
<div><head>Seite 02, verso (Bericht 17)</head><ab corresp="#ZM_S_I_Sellow_Exk_17_02_v">
<lb/> so fort nichts mehr. Er entfernt sich von der Straße von 
<lb/> dem Punkt an<supplied reason="omitted-in-original" resp="#CE_UM">,</supplied> wo er die große <name type="rock_mineral">Sandst<supplied reason="omitted-in-original" resp="#CE_UM">ein</supplied>bank</name> durchschnei- 
<lb/> det und von diesem Punkte an bis zur Mündung des 
<lb/><name type="geographic">Rio do Fortaleza</name> soll er besonders viele Wasserfälle 
<lb/> haben, wovon einer die Höhe eines ausgewachsenen <name type="plant">Pinheiros</name>
<lb/> haben soll und seine Thalgehänge sollen dort steil 
<lb/> sein. Bald versinkt das Niveau merklich und das 
<lb/> <name type="object">Campo</name> ist nicht mehr sandig<supplied reason="omitted-in-original" resp="#CE_UM">,</supplied> sondern der Boden ein rother 
<lb/> <name type="rock_mineral">Lehmen</name>. Nicht weit von <name type="person">T<hi rendition="#sup"><supplied reason="omitted-in-original" resp="#CE_UM">enen</supplied>te</hi> José</name> kam ich an der 
<lb/> Est<hi rendition="#sup"><supplied reason="omitted-in-original" resp="#CE_UM">anci</supplied>a</hi> des <name type="ethnicity_group">Cap<hi rendition="#sup"><supplied reason="omitted-in-original" resp="#CE_UM">ita</supplied>m</hi></name> <name type="person">Balduino José de Alm<hi rendition="#sup"><supplied reason="omitted-in-original" resp="#CE_UM">ei</supplied>da</hi> Taquez</name> vorüber<supplied reason="omitted-in-original" resp="#CE_UM">,</supplied> die 
<lb/> an einem schönen<supplied reason="omitted-in-original" resp="#CE_UM">,</supplied> über <name type="rock_mineral">Sandstein</name> dem <name type="geographic">Yapó</name> zurieselnden 
<lb/> Bache liegt. Weiter hin mehren sich 
<lb/> Stauden und Sträucher im <name type="object">Campo</name>, einige Bäume er- 
<lb/> scheinen<supplied reason="omitted-in-original" resp="#CE_UM">,</supplied> so daß das Campo Ähnlichkeit mit dem von 
<lb/> <name type="geographic">Minas</name> bekommt. Viel <name type="plant">Guabirabas</name> <note resp="#CE_UM" type="orig"><term>Campomanesia malifolia</term></note><note resp="#CE_UM" type="editorial">Berg</note> und <name type="plant">Pitangas</name> <note resp="#CE_UM" type="orig"><term>Eugenia uniflora</term></note> mit 
<lb/> reifen Früchten traf ich hier auch an. Erstere sind 
<lb/> unstreitig die beste Frucht der hiesigen Gegend und viel- 
<lb/> leicht der <name type="plant">Jabuticaba</name> <note resp="#CE_UM" type="orig"><term>Myrciaria cauliflora (Mart.)</term></note> vorzuziehen. Sie schmecken genau wie 
<lb/> die besten Stachelbeeren<supplied reason="omitted-in-original" resp="#CE_UM">,</supplied> nur ein wenig aromatisch oder ge- 
<lb/> würzhaft von ihrer Rinde, oder auch von der Saamenhaut. 
<lb/> Die <name type="plant">Pitangas</name> gleichen an Geschmack den Kirschen. Unfern 
<lb/> der Mündung des <name type="geographic">Yapó</name> liegen mehrere Wohnungen zer- 
<lb/> streut, meist von armen Leuten bewohnt. Wo ich 
<lb/> über denselben setzte<supplied reason="omitted-in-original" resp="#CE_UM">,</supplied> ist er an 60 Sch<supplied reason="omitted-in-original" resp="#CE_UM">ritt</supplied> breit und am 
<lb/> Passo 3 – 4' tief; seine Mündung ist von hier bei 
<lb/> 2000 Schritte entfernt und im Bett steht stellenweise 
<lb/> feinkörniger söhliger glimmriger <name type="rock_mineral">Sandstein</name> zu Tage<supplied reason="omitted-in-original" resp="#CE_UM">,</supplied>
<lb/> der<supplied reason="omitted-in-original" resp="#CE_UM">,</supplied> wo sich Löcher in ihm finden<supplied reason="omitted-in-original" resp="#CE_UM">,</supplied> mehreren Arten <name type="animal">Bagres</name> <note resp="#CE_UM" type="editorial">Welsarten</note>
<lb/> und dem <name type="animal">Guacari</name> <note resp="#CE_UM" type="orig"><term>Loricaria plecostomusacari</term></note> Aufenthalt gewährt. Gleich oberhalb 
<lb/> der Mündung des <name type="geographic">Yapó</name> setzt ein Damm durch den 
<lb/> <name type="geographic">Tibagy</name><supplied reason="omitted-in-original" resp="#CE_UM">,</supplied> der jedoch jetzt von Wasser bedeckt war. 
<lb/> Auf dem rechten Thalgehänge beim <name type="object">Passo</name> liegt ein Haus<supplied reason="omitted-in-original" resp="#CE_UM">,</supplied>
<lb/> welches zur <name type="geographic">Est<hi rendition="#sup"><supplied reason="omitted-in-original" resp="#CE_UM">anci</supplied>a</hi> do Fortaleza</name> gehört, wo ein einzelner <name type="ethnicity_group">Neger</name>
<lb/> wohnt<supplied reason="omitted-in-original" resp="#CE_UM">,</supplied> der die Aufsicht über diesen Grenzpunkt ihres <name type="object">Campo</name>
<lb/> hat. Ich hoffte<supplied reason="omitted-in-original" resp="#CE_UM">,</supplied> hier Unterkommen zu finden und gehörigen 
<lb/> Raum<supplied reason="omitted-in-original" resp="#CE_UM">,</supplied> um hier einige Tage verbleiben zu können und 
<lb/> da ich mir schmeichelte<supplied reason="omitted-in-original" resp="#CE_UM">,</supplied> hier die Fische des <name type="geographic">Tibagy</name> einsammeln 
<lb/> zu können. Wir fanden es verschlossen<supplied reason="omitted-in-original" resp="#CE_UM">,</supplied> und kaum 
</ab></div>
<pb facs="http://gbif.naturkundemuseum-berlin.de/CDV2018/Sellow/ZM_S_I_Sellow_Exk_17_3_r__2529.tif" n="03_r" xml:id="ZM_S_I_Sellow_Exk_17_03_r"/>
<div><head>Seite 03, recto (Bericht 17)</head><ab corresp="#ZM_S_I_Sellow_Exk_17_03_r">
<lb/> war abgeladen worden<supplied reason="omitted-in-original" resp="#CE_UM">,</supplied> als die Leute sich von einer großen 
<lb/> Menge <name type="animal">Pulex penetrans</name> <note resp="#CE_UM" type="orig"><term>Tunga penetrans</term></note> angefallen fühlten, selbst auf dem 
<lb/> Hofe vor dem Hause. Hierauf wurde ich genöthigt<supplied reason="omitted-in-original" resp="#CE_UM">,</supplied> mich zu ent- 
<lb/> fernen und den Schutz meines Zelts vorzuziehen. Der <name type="ethnicity_group">Neger</name>
<lb/> kam bald und klagte<supplied reason="omitted-in-original" resp="#CE_UM">,</supplied> daß er sich vor diesen Flöhen kaum 
<lb/> retten könnte und fleißiges Kehren ihm nichts helfe; indessen 
<lb/> ist Mangel an Reinlichkeit an ihrer großen Vermehrung 
<lb/> doch wohl hauptsächlich schuld. Keiner von uns blieb von 
<lb/> ihnen verschont und einige hatten des Tages sich bei 
<lb/> 10 Thiere aus den Füßen zu ziehen. Südlicher hatten wir sie 
<lb/> bisher auf dem Hochlande kaum bemerkt. Ich sendete am 
<lb/> 9<hi rendition="#sup">ten</hi> früh nach einer kleinen Ortschaft circa 1 L<supplied reason="omitted-in-original" resp="#CE_UM">egoa</supplied> <name type="geographic">Tibagy</name>
<lb/> abwärts und an seinem linken Ufer, wo ein <name type="ethnicity_group">Cabo</name> <note resp="#CE_UM" type="editorial">Wachtmeister, Polizist</note><supplied reason="omitted-in-original" resp="#CE_UM">,</supplied> der 
<lb/> an des Commandanten Stelle war<supplied reason="omitted-in-original" resp="#CE_UM">,</supplied> wohnte, um mir Fische 
<lb/> bestellen zu lassen. Ich bekam während der 4 Tage<supplied reason="omitted-in-original" resp="#CE_UM">,</supplied>
<lb/> welche ich hier verbrachte<supplied reason="omitted-in-original" resp="#CE_UM">,</supplied> nur einen kleinen <name type="animal">Surubi</name> <note resp="#CE_UM" type="editorial">eine Welsart</note>, 
<lb/> einen <name type="animal">Jundia</name> <note resp="#CE_UM" type="orig"><term>Leiarius marmoratus</term></note>, zwei <name type="animal">Guacari</name> <note resp="#CE_UM" type="orig"><term>Pterygoplichthys sp</term></note> und einen <name type="animal">Pirapitinga</name> <note resp="#CE_UM" type="orig"><term>Piaractus brachypomus</term></note>. 
<lb/> Einige Personen besuchten mich vom linken Ufer des <name type="geographic">Yapó</name>
<lb/> her<supplied reason="omitted-in-original" resp="#CE_UM">,</supplied> hauptsächlich aber <seg type="medicine">um Arzenei wider ihre Krank- 
<lb/> heiten von mir zu bitten</seg>. Die meisten litten an <seg type="medicine">Bobas</seg> <note resp="#CE_UM" type="editorial">Frambösie, eine topische, nicht-venerische Infektionskrankheit</note>
<lb/> oder an Folgen derselben, zwei an <seg type="medicine">Leberverstopfung</seg>. 
<lb/> Jenes Übel hat in <name type="geographic">Campos Geraes</name> sehr überhand genommen<supplied reason="omitted-in-original" resp="#CE_UM">,</supplied>
<lb/> so daß Personen<supplied reason="omitted-in-original" resp="#CE_UM">,</supplied> die davon frei geblieben<supplied reason="omitted-in-original" resp="#CE_UM">,</supplied> Ausnahmen 
<lb/> zu machen scheinen. Mehrere behaupteten<supplied reason="omitted-in-original" resp="#CE_UM">,</supplied> sie durch von 
<lb/> Anderen angenommene <seg type="agriculture_crafts">Charutos</seg> <note resp="#CE_UM" type="editorial">Zigarren</note> bekommen zu haben; 
<lb/> wie dem auch sei, so ist es allgemein Sitte und<supplied reason="omitted-in-original" resp="#CE_UM">,</supplied> wie 
<lb/> es scheint<supplied reason="omitted-in-original" resp="#CE_UM">,</supplied> ein Zeichen von Wohlwollen<supplied reason="omitted-in-original" resp="#CE_UM">,</supplied> vertrauten Per- 
<lb/> sonen brennende <seg type="agriculture_crafts">Charutos oder Cigarros</seg> unmittelbar 
<lb/> aus dem Munde mitzutheilen. Einer<supplied reason="omitted-in-original" resp="#CE_UM">,</supplied> der sehr elend aus- 
<lb/> sah<supplied reason="omitted-in-original" resp="#CE_UM">,</supplied> hatte darwider ½ Drachme <note resp="#CE_UM" type="editorial"> Arzneigewicht</note> <seg type="medicine">rothen Präcipitat</seg> <note resp="#CE_UM" type="editorial">ein Quecksilberoxyd</note>
<lb/> in 3 Theile getheilt genommen. Die Anrede der Meisten 
<lb/> war: <foreign xml:lang="pt"><foreign><q><gap quantity="17" reason="illegible" resp="#CE_UM" unit="words"/>.</q></foreign></foreign> <seg type="agriculture_crafts">Reis</seg> gedeiht sehr gut in dieser Gegend, dagegen 
<lb/> waren <seg type="agriculture_crafts">Bohnen</seg> in mehreren Jahren schon nicht mehr 
<lb/> gerathen. Die Einwohner pflanzen im <name type="object">Certão</name> auf der 
<lb/> linken Seite des <name type="geographic">Tibagy</name>. Von einem der Vornehmsten 
<lb/> hier: <name type="person">M<hi rendition="#sup">l</hi> das Doces</name> erhielt ich Bananen und 
<lb/> einige Halme Zuckerrohr des <gap quantity="1" reason="illegible" resp="#CE_UM" unit="words"/> zum Geschenk<supplied reason="omitted-in-original" resp="#CE_UM">,</supplied> welche 
</ab></div>
<pb facs="http://gbif.naturkundemuseum-berlin.de/CDV2018/Sellow/ZM_S_I_Sellow_Exk_17_3_v__2530.tif" n="03_v" xml:id="ZM_S_I_Sellow_Exk_17_03_v"/>
<div><head>Seite 03, verso (Bericht 17)</head><ab corresp="#ZM_S_I_Sellow_Exk_17_03_v">
<lb/> sehr vollkommen waren. 
<lb/> Am 13<hi rendition="#sup">ten</hi> ging ich von hier nach der <name type="geographic">Est<hi rendition="#sup"><supplied reason="omitted-in-original" resp="#CE_UM">anci</supplied>a</hi> da Fortaleza</name>. Der 
<lb/> Weg läuft gänzlich auf der Wasserscheide hin zwischen dem 
<lb/> <name type="geographic">Yapo</name> und <name type="person">Rib<hi rendition="#sup"><supplied reason="omitted-in-original" resp="#CE_UM">ei</supplied>ro</hi> Alegre</name> zuerst, und ferner zwischen dem 
<lb/> <name type="geographic">Ar<hi rendition="#sup"><supplied reason="omitted-in-original" resp="#CE_UM">roy</supplied>o</hi> da Fortaleza</name> und dem <name type="geographic">Ar<hi rendition="#sup"><supplied reason="omitted-in-original" resp="#CE_UM">roy</supplied>o</hi> do Faisqueiro</name>, durch 
<lb/> <name type="object">Campo</name><supplied reason="omitted-in-original" resp="#CE_UM">,</supplied> welches ziemlich rein von Stauden, Sträuchern 
<lb/> Bäumen ist. Der Boden ist durchgehend ein rothbrau- 
<lb/> ner <name type="rock_mineral">Lehmen</name><supplied reason="omitted-in-original" resp="#CE_UM">,</supplied> welchen feinkörniger<supplied reason="omitted-in-original" resp="#CE_UM">,</supplied> meist glimmriger<supplied reason="omitted-in-original" resp="#CE_UM">,</supplied> an 
<lb/> der Oberfläche oft eisenschössiger <name type="rock_mineral">Sandstein</name> bedeckt, 
<lb/> der am <name type="geographic">Yapó</name> und auf dem Hügel der Passos dieser 
<lb/> Est<hi rendition="#sup"><supplied reason="omitted-in-original" resp="#CE_UM">anci</supplied>a</hi> zu Tage steht. Ehe man die Häuser erreicht<supplied reason="omitted-in-original" resp="#CE_UM">,</supplied> übersteigt 
<lb/> man einen ansehnlichen mit Wald bedeckten Hügel, dessen 
<lb/> Waldung großentheils schon in <name type="object">Capoeira</name> verwandelt. 
<lb/> Der <name type="object">Capão</name> ist jedoch ausgedehnt und gewährt noch für vie- 
<lb/> le Jahre <name type="person">Mato Virgem</name> zu <name type="person">Bassas</name>. Überall sah man viel 
<lb/> <name type="plant">Pinheiros</name>. Gleich nachdem man aus diesen <name type="object">Capoeiras</name> her- 
<lb/> vor getreten<supplied reason="omitted-in-original" resp="#CE_UM">,</supplied> von einer Höhe erblickt man die <name type="geographic">Estancia 
<lb/> do Fortaleza</name> circa 1/8 L<supplied reason="omitted-in-original" resp="#CE_UM">egoa</supplied> entfernt am südwestlichen Abhange 
<lb/> eines auch bewaldeten kleinen Hügelrückens. Mehrere 
<lb/> kleine Gebäude<supplied reason="omitted-in-original" resp="#CE_UM">,</supplied> mit Ziegel gedeckt<supplied reason="omitted-in-original" resp="#CE_UM">,</supplied> bilden einen großen 
<lb/> Theil eines 80 Sch<supplied reason="omitted-in-original" resp="#CE_UM">ritt</supplied> langen und ebenso breiten Vierecks<supplied reason="omitted-in-original" resp="#CE_UM">,</supplied>
<lb/> das<supplied reason="omitted-in-original" resp="#CE_UM">,</supplied> wo keine Häuser, durch gute Mauern abgeschlossen ist. 
<lb/> An dieses schließen sich noch mehrere größere und klei- 
<lb/> nere Zwinger an; gen SWS SO liegen Gärten 
<lb/> mit schönen alten <name type="plant">Orangenbäumen</name>, welche zum Theil 
<lb/> noch mit reifen Früchten beladen waren, während andere 
<lb/> fast schon wieder reiften. Hier entspringt auch ein kleiner 
<lb/> Bach<supplied reason="omitted-in-original" resp="#CE_UM">,</supplied> der in St<supplied reason="omitted-in-original" resp="#CE_UM">unde</supplied> 7 von hier seine Mündung in den <name type="geographic">Ar<hi rendition="#sup"><supplied reason="omitted-in-original" resp="#CE_UM">roy</supplied>o</hi>
<lb/> do Fortaleza</name> hat. Ich verweilte hier meherere Tage<supplied reason="omitted-in-original" resp="#CE_UM">,</supplied>
<lb/> da ich hier Raum und freundliche Aufnahme fand. 
<lb/> Ein Theil des hiesigen Campo, zumal das<supplied reason="omitted-in-original" resp="#CE_UM">,</supplied> welches dem 
<lb/> <name type="object">Certão</name> zunächst liegt<supplied reason="omitted-in-original" resp="#CE_UM">,</supplied> hat große Ähnlichkeit mit den 
<lb/> <name type="object">Campos</name> von <name type="geographic">Sorocaba</name>; es besitzt die meisten der 
<lb/> dort vorkommenden Campobäume. Zu dieser Est<supplied reason="omitted-in-original" resp="#CE_UM">stanci</supplied><hi rendition="#sup">a</hi> gehören 
<lb/> 3 <name type="object">Sismarien</name> <note resp="#CE_UM" type="editorial">Ländereien</note> und die Besitzer haben außerdem noch die 
<lb/> <name type="geographic">Est<hi rendition="#sup"><supplied reason="omitted-in-original" resp="#CE_UM">anci</supplied>a</hi> do Taquara</name><supplied reason="omitted-in-original" resp="#CE_UM">,</supplied> welche auch eine <name type="object">Sismaria</name> begreifen soll 
<lb/> noch ein Campo bei Castro. In den meisten der Bäche hier sind <name type="rock_mineral">Diamanten</name> gefunden 
<lb/> worden<supplied reason="omitted-in-original" resp="#CE_UM">,</supplied> besonders im <name type="rock_mineral">Rio do Fortaleza</name><supplied reason="omitted-in-original" resp="#CE_UM">,</supplied> welcher über 
<lb/> <name type="rock_mineral">Sandstein</name> fließt, wo ich ihn besuchte, und in dem <name type="geographic">Ar<hi rendition="#sup"><supplied reason="omitted-in-original" resp="#CE_UM">roy</supplied>o</hi> do Faisqueira</name> ¼ L<supplied reason="omitted-in-original" resp="#CE_UM">egoa</supplied> gen N von der Est<hi rendition="#sup"><supplied reason="omitted-in-original" resp="#CE_UM">anci</supplied>a</hi><supplied reason="omitted-in-original" resp="#CE_UM">,</supplied> der auch 
</ab></div>
<pb facs="http://gbif.naturkundemuseum-berlin.de/CDV2018/Sellow/ZM_S_I_Sellow_Exk_17_4_r__2531.tif" n="04_r" xml:id="ZM_S_I_Sellow_Exk_17_04_r"/>
<div><head>Seite 04, recto (Bericht 17)</head><ab corresp="#ZM_S_I_Sellow_Exk_17_04_r">
<lb/> <name type="rock_mineral">Sandstein</name> im Bett hat. Wegen der Nähe des <name type="object">Certãos</name>
<lb/> wird dieses <name type="object">Campo</name> nicht selten von <name type="ethnicity_group">Wilden</name> besucht 
<lb/> und es ist nöthig<supplied reason="omitted-in-original" resp="#CE_UM">,</supplied> hier stets bewaffnet zu gehen. 
<lb/> Der verstorbene Oberstleutnant <name type="person">José Feliz do Sylva</name><supplied reason="omitted-in-original" resp="#CE_UM">,</supplied>
<lb/> der diese Faz<hi rendition="#sup"><supplied reason="omitted-in-original" resp="#CE_UM">en</supplied>da</hi> gestiftet<supplied reason="omitted-in-original" resp="#CE_UM">,</supplied> zeigte der Regierung, zur 
<lb/> Zeit des <name type="person">Candido Linhares</name>, das Vorkommen von Diamanten 
<lb/> im <name type="geographic">Tibagy</name> an, und überreichte ½ Pfund davon. Darauf wurde 
<lb/> er authorisirt<supplied reason="omitted-in-original" resp="#CE_UM">,</supplied> hier eine Compagnie <name type="person"><choice><orig>Certanistas </orig><reg resp="#CE_UM">Sertanista</reg></choice></name><note resp="#CE_UM" type="editorial"> Bewohner der sertão</note> zu er- 
<lb/> richten. Die Untersuchung der <name type="object"><choice><orig>Certams </orig><reg resp="#CE_UM">Certãos</reg></choice></name> wurde jedoch nicht 
<lb/> weiter verfolgt als bis zu dem <name type="geographic">Campo dos Agudes</name>
<lb/> in der Nachbarschaft der sogenannten Berge am rechten Ufer 
<lb/> des <name type="geographic">Tibagy</name>. Man beschränkte sich<supplied reason="omitted-in-original" resp="#CE_UM">,</supplied> den <name type="geographic">Tibagy</name> etwas zu 
<lb/> patrulliren<supplied reason="omitted-in-original" resp="#CE_UM">,</supplied> um das Waschen der Diamanten zu verhin- 
<lb/> dern. Ein interessanter Punkt hier unfern der Est<hi rendition="#sup"><supplied reason="omitted-in-original" resp="#CE_UM">anci</supplied>a</hi>
<lb/> ist der <name type="geographic">Alto do Lagoinha</name>. Er liegt in h. 11 3 von den 
<lb/> Häusern bei ¼ L<supplied reason="omitted-in-original" resp="#CE_UM">egoa</supplied> entfernt bei 300' höher als sie und 
<lb/> dominirt einen großen Theil der Gegend. Von hier 
<lb/> aus erkennt man, wiewohl nicht deutlich<supplied reason="omitted-in-original" resp="#CE_UM">,</supplied> in NW die <name type="geographic">Serras <supplied reason="omitted-in-original" resp="#CE_UM">dos</supplied></name>
<lb/> <name type="geographic">Agudos</name><supplied reason="omitted-in-original" resp="#CE_UM">,</supplied> vor welcher der <name type="geographic">Tibagy</name> hingeht; sie mögen bei 
<lb/> 12 L<supplied reason="omitted-in-original" resp="#CE_UM">egoa</supplied> von hier entfernt liegen. Das ganze Land jen- 
<lb/> seits des <name type="geographic">Tibagy</name> zeigt sich von hier aus bergig. 
<lb/> Gerade in Ost zeichnet sich der <name type="person">S<hi rendition="#sup"><supplied reason="omitted-in-original" resp="#CE_UM">err</supplied>a</hi> do <choice><orig/><reg resp="#CE_UM">Embaú</reg></choice></name> von der 
<lb/>Gestalt eines Grabhügels aus; söhlig abgedachte Berge 
<lb/> sind überhaupt die am häufigsten vorkommende Form. 
<lb/> Zwischen diesen liegt ein Kopf der <name type="geographic">S<hi rendition="#sup"><supplied reason="omitted-in-original" resp="#CE_UM">err</supplied>a</hi> da Apu- 
<lb/> carana</name> (h 7.4.). In SW 
<lb/> zeichnet sich die <name type="geographic">S<hi rendition="#sup"><supplied reason="omitted-in-original" resp="#CE_UM">err</supplied>a</hi> do Borges</name> aus<supplied reason="omitted-in-original" resp="#CE_UM">,</supplied> welche wegen 
<lb/> <name type="rock_mineral">Diamanten und Gold</name> im Ruf steht, wovon man in dem 
<lb/> von derselben herabkommenden <name type="geographic">Ribeiro do Borges</name> einen 
<lb/> Reichthum gefunden haben soll. <name type="ethnicity_group">Garimpeiros</name> <note resp="#CE_UM" type="editorial">illegale Goldsucher</note> aus 
<lb/> <name type="person">Campos=Geraes</name> sollen diese Gegend noch oft besuchen. 
<lb/> Die <name type="person">Serra da Pedro branca</name> nicht weit oberhalb 
<lb/> der <name type="person">B<supplied reason="omitted-in-original" resp="#CE_UM">arr</supplied><hi rendition="#sup">a</hi></name> des <name type="geographic">Yapó</name> zeigen sich in h. 1. 6 und in großer 
<lb/> Form in h. 12 6 der <name type="geographic">S<hi rendition="#sup"><supplied reason="omitted-in-original" resp="#CE_UM">err</supplied>a</hi> do Amparo</name> auch in Grab- 
<lb/> hügelform. Alle diese Berge scheinen stufenweise 
<lb/> hintereinander geordnet (<name type="rock_mineral"> <choice><orig/><reg resp="#CE_UM">échelon</reg></choice></name> zu stehen) und sind 
<lb/> alle mit Hochwald bedeckt. Der <name type="object">Certão</name> beginnt gleich jenseits 
<lb/> des <name type="geographic">Tibagy</name><supplied reason="omitted-in-original" resp="#CE_UM">,</supplied> und bald unterhalb der <name type="geographic">B<hi rendition="#sup">a</hi> des Yapó</name> hat er auch schon viel Waldung zur Rechten. Der Übergang aus 
</ab></div>
<pb facs="http://gbif.naturkundemuseum-berlin.de/CDV2018/Sellow/ZM_S_I_Sellow_Exk_17_4_v__2532.tif" n="04_v" xml:id="ZM_S_I_Sellow_Exk_17_04_v"/>
<div><head>Seite 04, verso (Bericht 17)</head><ab corresp="#ZM_S_I_Sellow_Exk_17_04_v">
<lb/> Campo in Hochwald, hat<supplied reason="omitted-in-original" resp="#CE_UM">,</supplied> wie ich es auf dem Wege nach <name type="geographic">Guara- 
<lb/> puava</name> sah<supplied reason="omitted-in-original" resp="#CE_UM">,</supplied> durch <name type="object">Camprestes <choice><orig>Caatanduvas </orig><reg resp="#CE_UM">Catanduvas</reg></choice></name> und nur stellen- 
<lb/> weise plötzlich Statt. Gen O zeichnet sich eine beträcht- 
<lb/> liche Höhe mit abgerundetem<supplied reason="omitted-in-original" resp="#CE_UM">,</supplied> fast söhligem<supplied reason="omitted-in-original" resp="#CE_UM">,</supplied> nach N zu gesenk- 
<lb/> tem Dache aus<supplied reason="omitted-in-original" resp="#CE_UM">,</supplied> der <name type="geographic">Monte negro</name><supplied reason="omitted-in-original" resp="#CE_UM">,</supplied> bei welchem der <name type="geographic">Rio 
<lb/> do Fortaleza</name> entspringt. Gen S zieht sich scheinbar in 
<lb/> St<supplied reason="omitted-in-original" resp="#CE_UM">unde</supplied> 6 streichend Hochland über das linke Thalgehänge 
<lb/> des genannten kleinen Flusses ausmachend, auf 
<lb/> welchem sich mehrere ausgezeichnete <name type="object">Capãos</name> erkennen 
<lb/> lassen; jedoch ohne auffallend hervorspringende Höhen<supplied reason="omitted-in-original" resp="#CE_UM">,</supplied>
<lb/> sondern meist auf ziemlich gleichem Niveau. 
<lb/> Gen N ist die Aussicht beschränkter. Es zeigt sich dort 
<lb/> vornehmlich der Lauf des <name type="geographic">Ar<hi rendition="#sup"><supplied reason="omitted-in-original" resp="#CE_UM">roy</supplied>o</hi> do Faisqueira</name>. 
<lb/> Das Campo soll hier einen bei 6 L<supplied reason="omitted-in-original" resp="#CE_UM">egoa</supplied> tiefen Sack 
<lb/> nach N hin machen. Ein anderer interessanter 
<lb/> hoher Punkt, wo man die <name type="geographic">Serra Agudas</name> deutlicher 
<lb/> sehen kann<supplied reason="omitted-in-original" resp="#CE_UM">,</supplied> soll der <name type="geographic">Alto da Sepultura</name>, von einem 
<lb/> <name type="object">Begräbnißplatze</name> der <name type="ethnicity_group">Wilden</name> so genannt, sein<supplied reason="omitted-in-original" resp="#CE_UM">,</supplied> circa 
<lb/> 3 L<supplied reason="omitted-in-original" resp="#CE_UM">egoa</supplied> von der Est<hi rendition="#sup"><supplied reason="omitted-in-original" resp="#CE_UM">anci</supplied>a</hi> entfernt. Diesen hatte ich nicht 
<lb/> Gelegenheit zu besuchen. 
<lb/> Während meines Hierseins wurden zur Maulthierzucht 
<lb/> zwei junge Esel zweien Stuten untergeschoben. Das 
<lb/>Verfahren war dieses: Man richtete die jungen Esel 
<lb/> zuvor, während eines oder 2 Tagen, ab, an Stuten zu 
<lb/> saugen, dann tödtete man bei eintretender Nacht 
<lb/> die Füllen der Stute, und band die Haut derselben, 
<lb/> ohne viel Künstelei zu machen<supplied reason="omitted-in-original" resp="#CE_UM">,</supplied> über die jungen Esel, 
<lb/> die man einige Stunden lang hatte hungern lassen. 
<lb/> Die Stuten waren in getrennten Zwingern, wo 
<lb/> ihnen die verkappten Esel zugeführt wurden. Man 
<lb/> versicherte<supplied reason="omitted-in-original" resp="#CE_UM">,</supplied> daß sie<supplied reason="omitted-in-original" resp="#CE_UM">,</supplied> durch den Geruch der überhangenden Haut 
<lb/> betrogen, gewöhnlich die Esel gleich annähmen. Dieses 
<lb/> mal geschah es nicht. Die Esel liefen gierig zu, allein 
<lb/> die Stuten scheuten sich, beide, und bissen die Esel; 
<lb/> es war nöthig<supplied reason="omitted-in-original" resp="#CE_UM">,</supplied> sie einzufangen, ihnen Halfter anzulegen 
<lb/> und es mit vieler Mühe und Geduld dahin zu bringen<supplied reason="omitted-in-original" resp="#CE_UM">,</supplied>
<lb/> daß die jungen saugen konnten. Binnen 24 Stunden waren 
<lb/> sie jedoch daran gewöhnt und konnten auf die Weide 
<lb/> gelassen werden. Man hat einen auf solche Weise 
<lb/> aufgezogenen<supplied reason="omitted-in-original" resp="#CE_UM">,</supplied> an Stuten gewöhnten Esel hier mit 
<lb/> 80 und 100 milreis bezahlt. 
</ab></div>
<pb facs="http://gbif.naturkundemuseum-berlin.de/CDV2018/Sellow/ZM_S_I_Sellow_Exk_17_5_r__2533.tif" n="05_r" xml:id="ZM_S_I_Sellow_Exk_17_05_r"/>
<div><head>Seite 05, recto (Bericht 17)</head><ab corresp="#ZM_S_I_Sellow_Exk_17_05_r">
<lb/> Ich zog von hier am 22 <choice><orig>9<hi rendition="#sup">br</hi></orig> <reg resp="#CE_UM">November</reg></choice><hi rendition="#sup"/> früh weiter. Der Weg führt 
<lb/> bald, nachdem man die Hügel östl<supplied reason="omitted-in-original" resp="#CE_UM">ich</supplied> von der Est<hi rendition="#sup"><supplied reason="omitted-in-original" resp="#CE_UM">anci</supplied>a</hi>
<lb/> überstiegen, durch den <name type="geographic">Ar<hi rendition="#sup"><supplied reason="omitted-in-original" resp="#CE_UM">roy</supplied>o</hi> do Worá</name> in der Nähe seiner 
<lb/>Ergießung in den <name type="geographic">Rio do Fortaleza</name>, und z<supplied reason="omitted-in-original" resp="#CE_UM">ur</supplied> L<supplied reason="omitted-in-original" resp="#CE_UM">inken</supplied> an 
<lb/> diesem hinauf, der stets in bald größerer<supplied reason="omitted-in-original" resp="#CE_UM">,</supplied> bald geringe- 
<lb/> rer Entfernung bleibt. Der Weg ist vortrefflich 
<lb/> und das Terrain meist flach. Das <name type="object">Campo</name> ist<supplied reason="omitted-in-original" resp="#CE_UM">,</supplied> sobald 
<lb/> man sich vom Rande des <name type="object">Sertãos</name> etwas entfernt<supplied reason="omitted-in-original" resp="#CE_UM">,</supplied> stets 
<lb/> wieder rein von Büschen und Sträuchern. Der vom 
<lb/> <name type="person">Worá</name> aus zunächst folgende Bach hat nichts Ausgezeich- 
<lb/> netes<supplied reason="omitted-in-original" resp="#CE_UM">,</supplied> allein der 2te<supplied reason="omitted-in-original" resp="#CE_UM">,</supplied> der <name type="geographic">Ar<hi rendition="#sup"><supplied reason="omitted-in-original" resp="#CE_UM">roy</supplied>o</hi> da <choice><orig/><reg resp="#CE_UM">Cocheira</reg></choice></name><supplied reason="omitted-in-original" resp="#CE_UM">,</supplied> rieselt 
<lb/> durch dieses Gebüsch über <name type="rock_mineral">Sandstein</name>, in welchem er unzählige Kessel von verschiedensten Formen 
<lb/> ausgewaschen hat. Im Winkel, den er mit einem 
<lb/> and<supplied reason="omitted-in-original" resp="#CE_UM">eren</supplied> Bache macht, standen viel <name type="plant">Guabirobas</name> <note resp="#CE_UM" type="orig"><term>Campomanesia pubescens</term></note>
<lb/> mit reifen Früchten, und auch viel reife <name type="plant">Pitangas</name> <note resp="#CE_UM" type="orig"><term>Eugenia uniflora</term></note>
<lb/> boten sich dem Reisenden an. Der <name type="rock_mineral">Sandstein</name> ist 
<lb/> durchgehends hier mit rothbraunem <name type="rock_mineral">Lehmen</name> bedeckt. 
<lb/> Die Est<hi rendition="#sup"><supplied reason="omitted-in-original" resp="#CE_UM">anci</supplied>a</hi> des T<hi rendition="#sup"><supplied reason="omitted-in-original" resp="#CE_UM">enen</supplied>te</hi> <name type="person">Ant<hi rendition="#sup"><supplied reason="omitted-in-original" resp="#CE_UM">oni</supplied>o</hi> Tagaço de Souza</name> liegt am SW<supplied reason="omitted-in-original" resp="#CE_UM">lichen</supplied> Abhange und fast am NW<supplied reason="omitted-in-original" resp="#CE_UM">lichen</supplied> Ende des Rückens von 
<lb/> <name type="geographic">Monte Negro</name>, der an diesem Punkte sich deutlicher auszu- 
<lb/> scheiden anfängt, sich sehr allmälig erhebend bis 
<lb/> er nach 1 ½ L<supplied reason="omitted-in-original" resp="#CE_UM">egoa</supplied> plötzlich versinkt und absetzt, 
<lb/> gen SW hin eine steil abgestürzte Wand, 
<lb/> die sich h. 8 4, im Allgemeinen betrachtet, hinzieht, 
<lb/> bildend. Am Fuße dieser Wand zieht sich eine 
<lb/> bewaldete Schlucht hin<supplied reason="omitted-in-original" resp="#CE_UM">,</supplied> durch die ein Zweig des <name type="geographic">Fortaleza</name>
<lb/> Abzug nimmt. Diese Lage ist sehr interessant. 
<lb/> <name type="person">Tagaço</name> empfing uns sehr artig und führte uns sogleich 
<lb/> in seinen Garten, wo schöne <seg type="agriculture_crafts">Weinreben</seg>, vortreff- 
<lb/> liche <seg type="agriculture_crafts">Orangenbäume</seg> und ein besonders schöner 
<lb/> <seg type="agriculture_crafts">Bananal</seg> <note resp="#CE_UM" type="editorial">Bananengarten</note> zu sehen waren, der Boden<supplied reason="omitted-in-original" resp="#CE_UM">,</supplied> obschon 
<lb/> ganz in der Nähe einer <name type="rock_mineral">Sandsteinbank</name>, ist rothbrauner 
<lb/> <name type="rock_mineral">Lehmen</name> und ungemein fruchtbar. Der Garten war 
<lb/> im <name type="object">Campo</name> angelegt. Ich wurde sehr gut bewirthet<supplied reason="omitted-in-original" resp="#CE_UM">,</supplied>
<lb/> selbst Wein und Caffe fehlten nicht. Da ich den Wunsch 
<lb/> äußerte<supplied reason="omitted-in-original" resp="#CE_UM">,</supplied> die höchste Ecke des <name type="geographic">Monte Negro</name> zu besuchen<supplied reason="omitted-in-original" resp="#CE_UM">,</supplied>
<lb/> so erbot sich <name type="person">Tagaço</name> sogleich<supplied reason="omitted-in-original" resp="#CE_UM">,</supplied> mich dahin zu führen, 
<lb/> ungeachtet er kränklich war, und an <seg type="medicine">Wassergeschwulsten</seg> litt, und ließ sich dieses nicht ausreden. Ich sendete 
</ab></div>
<pb facs="http://gbif.naturkundemuseum-berlin.de/CDV2018/Sellow/ZM_S_I_Sellow_Exk_17_5_v__2534.tif" n="05_v" xml:id="ZM_S_I_Sellow_Exk_17_05_v"/>
<div><head>Seite 05, verso (Bericht 17)</head><ab corresp="#ZM_S_I_Sellow_Exk_17_05_v">
<lb/> früh mein Gepäck nach <name type="geographic">Caxambú</name> <note resp="#CE_UM" type="editorial">Jundiaí</note> weiter, und trat nach Ein- 
<lb/> nahme eines guten Frühstücks mit <name type="person">Tagaço</name> die Exkursion an. 
<lb/> Wenige 100 Schritte vom Hause erreichten wir hohen zu Ta- 
<lb/> ge stehenden <name type="rock_mineral">Sandstein</name> und sofort findet sich kein rothbrau- 
<lb/> ner <name type="rock_mineral">Lehmen</name> mehr, sondern mit <name type="rock_mineral">Dammerde</name> gemengter <name type="rock_mineral">Sand</name>
<lb/> bedeckt das Gestein. Der Abhang ist so sanft<supplied reason="omitted-in-original" resp="#CE_UM">,</supplied> daß 
<lb/> die Pferde hier kaum ermüden. Der Rücken ist breit 
<lb/> und liefert<supplied reason="omitted-in-original" resp="#CE_UM">,</supplied> zumal an den söhligen Stellen<supplied reason="omitted-in-original" resp="#CE_UM">,</supplied> wo die 
<lb/> <name type="rock_mineral">Dammerde</name> liegen bleiben kann<supplied reason="omitted-in-original" resp="#CE_UM">,</supplied> sehr gute Weide. Schönes 
<lb/> <seg type="agriculture_crafts">Rindvieh</seg> und eine Menge schöner <seg type="agriculture_crafts">Pferde</seg> sah ich hier. Eine 
<lb/> tiefe Schlucht zieht sich der Länge nach durch den Berg 
<lb/> mit steil abgestürzten <name type="rock_mineral">Sandsteinwänden</name>, der hier 
<lb/> Neigung hat sich würflich abzusondern. Ehe man den 
<lb/> höchsten Punkt des Berges erreicht<supplied reason="omitted-in-original" resp="#CE_UM">,</supplied> kommt man durch eine 
<lb/> flache geringe Vertiefung mit Wald bedeckt<supplied reason="omitted-in-original" resp="#CE_UM">,</supplied> wo sich 
<lb/> ein kleiner Bach zusammenzieht. Hier sahen wir die 
<lb/> Überreste eines <name type="object">Corals</name> von einer vor vielen Jahren 
<lb/> hier angesessenen Est<hi rendition="#sup"><supplied reason="omitted-in-original" resp="#CE_UM">anci</supplied>a</hi>, welche später nach einem anderen 
<lb/> Punkt der <name type="object">Sismaria</name> verlegt worden. Vermuthlich ging 
<lb/> dem Eigenthümer das Nützliche dem Augenscheine vor, 
<lb/> denn eine schönere Lage als dieser Punkt bot vielleicht 
<lb/> kein anderes seiner <name type="object">Campo</name> dar; 
<lb/> gutes Wasser, Salz, reine Luft und die herrliche 
<lb/> Aussicht rund um gewährt er. Die höchste Stelle 
<lb/> des <name type="geographic">Monto negro</name> liegt nahe an einem großen <name type="object">Capão</name><supplied reason="omitted-in-original" resp="#CE_UM">,</supplied>
<lb/> den man von weit her sehen kann. Die Aussicht<supplied reason="omitted-in-original" resp="#CE_UM">en</supplied> von 
<lb/> hier aus gen N und gen W sind die Interessantesten<supplied reason="omitted-in-original" resp="#CE_UM">.</supplied>
<lb/> Man erkennt die <name type="geographic">Serras agudas</name>, wiewohl nur mit 
<lb/> Mühe. In N am Rande des <name type="object"><choice><orig>Certams </orig><reg resp="#CE_UM">Certãos</reg></choice></name> zeichnet 
<lb/> sich der kegelförmige Berg von <name type="geographic">Caxambú</name> aus. 
<lb/> Noch andere Kegelberge nach derselben Rich- 
<lb/> tung hin<supplied reason="omitted-in-original" resp="#CE_UM">,</supplied> allein viel entfernter und nicht so isolirt<supplied reason="omitted-in-original" resp="#CE_UM">.</supplied>
<lb/> Die Berge im Hintergrunde gen W sind alle söhlig 
<lb/> abgedacht. Gen Ost zeigt sich die Höhe von <name type="geographic"><choice><orig> Jaguary- 
<lb/> aiva</orig> <reg resp="#CE_UM">Jaguariaiva</reg></choice></name> und gen S. scheint hohes Land sich z<supplied reason="omitted-in-original" resp="#CE_UM">ur</supplied> Linken des 
<lb/> <name type="geographic">Ar<hi rendition="#sup"><supplied reason="omitted-in-original" resp="#CE_UM">roy</supplied>o</hi> do Fortaleza</name> hin abzuziehen, alles <name type="object">Campo</name> und hier 
<lb/> und da eine <name type="object">Capão</name>, wogegen gen N, jenseits des 
<lb/> <name type="geographic">Ar<hi rendition="#sup"><supplied reason="omitted-in-original" resp="#CE_UM">roy</supplied>o</hi> de Caxambú</name><supplied reason="omitted-in-original" resp="#CE_UM">,</supplied> welcher<supplied reason="omitted-in-original" resp="#CE_UM">,</supplied> nördlich vom S<hi rendition="#sup"><supplied reason="omitted-in-original" resp="#CE_UM">err</supplied>a</hi> gleichen Namens 
<lb/> vorbeigehend, den <name type="geographic"><choice><orig>Rio das Cinsas</orig> <reg resp="#CE_UM">Rio das Cinzas</reg></choice></name> sich einverleibt<supplied reason="omitted-in-original" resp="#CE_UM">,</supplied> ist das Land mit Hochwald bedeckt, dem die <name type="plant">Araucaria</name>
</ab></div>
<pb facs="http://gbif.naturkundemuseum-berlin.de/CDV2018/Sellow/ZM_S_I_Sellow_Exk_17_6_r__2535.tif" n="06_r" xml:id="ZM_S_I_Sellow_Exk_17_06_r"/>
<div><head>Seite 06, recto (Bericht 17)</head><ab corresp="#ZM_S_I_Sellow_Exk_17_06_r">
<lb/> ein düsteres Ansehen gibt. <name type="rock_mineral">Quader-Sandstein</name> wie der von der 
<lb/> <name type="geographic">Serra dos Carlos</name> bildet diese Höhe und an dem höchsten Punkt 
<lb/> hier ist er glimmrig und feinkörnig. Wir kehrten mit <name type="person">Tagaço</name>
<lb/> nach seinem Hause zurück und ruhten hier etwas aus<supplied reason="omitted-in-original" resp="#CE_UM">,</supplied>
<lb/> als die Hitze groß und es gewitterschwanger war. 
<lb/> Nachdem wir uns durch eine Schale geronnener Milch 
<lb/> von vorzüglicher Güte erfrischt, setzte ich den Marsch 
<lb/> nach <name type="geographic">Caxambú</name> fort. Der Weg läuft auf einer Grate 
<lb/> zwischen zwei Bächen hin und ist vortrefflich, allein 
<lb/> ich wurde sehr durch einen Sturm aus Ost gestöhrt<supplied reason="omitted-in-original" resp="#CE_UM">,</supplied> der statt 
<lb/> des gefühlten Regens losbrach. Bei eintretender Dunkel- 
<lb/> heit langte ich auf der <name type="geographic">Est<hi rendition="#sup"><supplied reason="omitted-in-original" resp="#CE_UM">anci</supplied>a</hi> de Caxambú</name> an und wurde 
<lb/> durch die Beschaffenheit derselben, durch die Art<supplied reason="omitted-in-original" resp="#CE_UM">,</supplied> wie hier alles 
<lb/> angeordnet<supplied reason="omitted-in-original" resp="#CE_UM">,</supplied> sehr überrascht und glaubte plötzlich<supplied reason="omitted-in-original" resp="#CE_UM">,</supplied> in eine 
<lb/> längst civilisirte Gegend versetzt worden zu sein. Der 
<lb/> Eigenthümer <name type="person">Fr<hi rendition="#sup"><supplied reason="omitted-in-original" resp="#CE_UM">ancis</supplied>co</hi> Xav<hi rendition="#sup"><supplied reason="omitted-in-original" resp="#CE_UM">ie</supplied>r</hi> de Souza</name> war anwesend, ein be- 
<lb/> jahrter Mann von ehrwürdigem Ansehen, der<supplied reason="omitted-in-original" resp="#CE_UM">,</supplied> in Portugal 
<lb/> geboren, seit 90 Jahren abwechselnd bald in <name type="geographic">Sorocaba</name>, 
<lb/> bald in <name type="geographic">Campo Geraes</name> gelebt und durch Handel mit Vieh 
<lb/> sich ein ansehnliches Vermögen erworben hatte. Freund- 
<lb/> lich wurde ich von ihm bewillkommned; er führte mich in ein 
<lb/> geräumiges kühles Haus, wo er mein Gepäck, welches vor 
<lb/> mir angekommen war, ohne daß ich meinem <name type="ethnicity_group">Capataz</name> eine 
<lb/> schriftliche Bitte um Quartier mitgegeben, hatte unterstellen 
<lb/> lassen, und wo ich hinlänglich Raum fand für meine Absichten, 
<lb/> und wo es auch nicht an Tischen, Bänken Bettstellen fehlte<supplied reason="omitted-in-original" resp="#CE_UM">.</supplied>
<lb/> Auf einem der Ersteren stand ein großer Korb mit vortreff-
<lb/> lichen Orangen, welche er in der Vermuthung beordert hatte<supplied reason="omitted-in-original" resp="#CE_UM">,</supplied>
<lb/> daß ich noch während der Hitze des Tages ankommen würde. 
<lb/> Darauf lud er mich in das Haus<supplied reason="omitted-in-original" resp="#CE_UM">,</supplied> welches er selbst bewohnte<supplied reason="omitted-in-original" resp="#CE_UM">,</supplied>
<lb/> um mit ihm zu Nacht zu essen. Die Est<hi rendition="#sup"><supplied reason="omitted-in-original" resp="#CE_UM">anci</supplied>a</hi> liegt am linken 
<lb/> Gehänge eines tiefeingeschnittenen<supplied reason="omitted-in-original" resp="#CE_UM">,</supplied> nach N laufenden<supplied reason="omitted-in-original" resp="#CE_UM">,</supplied>
<lb/> in den <name type="geographic"><choice><orig>Rio das Cinsas</orig> <reg resp="#CE_UM">Rio das Cinzas</reg></choice></name> sich ergießenden Bachs. Die Gebäude 
<lb/> liegen in einer Linie. Ihnen gegenüber, so daß eine 
<lb/> breite Straße bleibt, welche an beiden Enden durch Thorwege 
<lb/> verschlossen werden kann, liegt ein Garten mit herrlichen 
<lb/> <seg type="agriculture_crafts">Orangenbäumen, Weintrauben, Ananas und Blumenbeeten</seg>. 
<lb/> Durch diese werden die Häuser von den <name type="object">Corals</name> getrennt<supplied reason="omitted-in-original" resp="#CE_UM">,</supplied>
<lb/> welche hügelabwärts sich an ihn anschließen, letztere 
<lb/> sind mit hohen wilden <seg type="agriculture_crafts">Feigen</seg> eingefaßt<supplied reason="omitted-in-original" resp="#CE_UM">,</supplied> welche dem 
<lb/> eingefangenen Vieh Schatten geben dazu beitragen<supplied reason="omitted-in-original" resp="#CE_UM">,</supplied>
<lb/> die Gebäude vor Staub zu schützen. Unterhalb des <name type="object">Corals</name>
<lb/> liegt ein großer <seg type="agriculture_crafts">Garten</seg><supplied reason="omitted-in-original" resp="#CE_UM">,</supplied> der sich bis zum Bache hinab er- 
<lb/> streckt. Alle diese Anlagen sind regelmäßig und auf 
</ab></div>
<pb facs="http://gbif.naturkundemuseum-berlin.de/CDV2018/Sellow/ZM_S_I_Sellow_Exk_17_6_v__2536.tif" n="06_v" xml:id="ZM_S_I_Sellow_Exk_17_06_v"/>
<div><head>Seite 06, verso (Bericht 17)</head><ab corresp="#ZM_S_I_Sellow_Exk_17_06_v">
<lb/> die Dauer eingerichtet. <seg type="agriculture_crafts">Ananas</seg> und die vortrefflich-
<lb/> sten <seg type="agriculture_crafts">Orangen</seg> liefert der Garten in einem Überfluß<supplied reason="omitted-in-original" resp="#CE_UM">,</supplied>
<lb/> daß damit ein großer Theil von <name type="geographic">Campos geraes</name> ver- 
<lb/> sehen werden kann. Und wie Jener seit einigen 
<lb/> Jahren aus dem <seg type="agriculture_crafts">Cayennschen Zuckerschilfe</seg> Zucker und Brannt-
<lb/> wein für seinen Hausgebrauch gewann, so hoffte er 
<lb/> auch auf eine reichliche Erndte an <seg type="agriculture_crafts">Kaffe</seg> von einer Anzahl 
<lb/> sehr schöner Bäume seines Gartens. Der Bananenwald 
<lb/> stand dem von <name type="person">Tagaco</name> nicht nach an Schönheit. In 
<lb/> den Gärten wie in den Gebäuden herschte Ordnung und Rein- 
<lb/> lichkeit. Daher wurde hier auch kein Schwein kein Huhn 
<lb/> geduldet. Die Zucht dieser unentbehrlichen Hausthiere ließ 
<lb/> er auf einer besonderen, dazu recht geeigneten <name type="object">Chacara</name>
<lb/> betreiben. An die Estancia schlossen sich auch große 
<lb/> von Gräben eingeschlossene <name type="object">Potreiros</name> an, wo einige Reit-
<lb/> thiere stets bei der Hand gehalten und die Thiere eines 
<lb/> Reisenden untergebracht werden konnten. 
<lb/> Ich machte Excursionen nach verschiedenen Punkten dies<supplied reason="omitted-in-original" resp="#CE_UM">es</supplied>
<lb/> <name type="object">Campos</name>. Die Bäche<supplied reason="omitted-in-original" resp="#CE_UM">,</supplied> deren Anzahl beträchtlich ist<supplied reason="omitted-in-original" resp="#CE_UM">,</supplied> rieseln 
<lb/> hier alle über <name type="rock_mineral">Sandstein</name>. Diesen fand ich zwischen dem 
<lb/> <name type="geographic">Rio das Cinsas</name> und <name type="geographic">Rio do Caxambú</name> an mehreren 
<lb/> Punkten mit <name type="rock_mineral">Schieferthon</name> bedeckt, welcher ungemein reich 
<lb/> an <name type="rock_mineral">Muschelabdrücken</name> ist. Dieser <name type="rock_mineral">Schieferthon</name> ist manchmal 
<lb/> Sandsteinartig und glimmrig. Man glaubt hier<supplied reason="omitted-in-original" resp="#CE_UM">,</supplied> sich in 
<lb/> einem großen Bassin zu befinden<supplied reason="omitted-in-original" resp="#CE_UM">,</supplied> dessen Ufer 
<lb/> der Rücken von <name type="geographic">Monte Negro</name>, die sogenannte <name type="geographic">Fur- 
<lb/> na</name> <note resp="#CE_UM" type="editorial">Grotte</note> <name type="geographic">do Carreira</name><supplied reason="omitted-in-original" resp="#CE_UM">,</supplied> die Höhen von <name type="geographic">Jaguaryaiva</name> pc 
<lb/> waren und welches vielleicht mit Wasser gefüllt war<supplied reason="omitted-in-original" resp="#CE_UM">,</supplied>
<lb/> bis gen N hin ein Durchbruch geschah, wobei der <name type="geographic">S<supplied reason="omitted-in-original" resp="#CE_UM">err</supplied><hi rendition="#sup">a</hi></name>
<lb/> <name type="geographic">de Caxambú</name><supplied reason="omitted-in-original" resp="#CE_UM">,</supplied> an dessen Fuß ich <name type="rock_mineral">Grünsteinblöcke</name> sah<supplied reason="omitted-in-original" resp="#CE_UM">,</supplied>
<lb/> sich ausschied. Dieser <name type="rock_mineral">Schieferthon</name> liegt söhlig und ist hier 
<lb/> von keiner anderen Formation bedeckt. Das Campo dieser 
<lb/> <name type="object">Fazenda</name>, wie bei der <name type="geographic">do Fortaleza</name><supplied reason="omitted-in-original" resp="#CE_UM">,</supplied> ist am Rande des 
<lb/> mit Wald bedeckten <name type="object">Certãos</name> stets durch Campo-Bäume<supplied reason="omitted-in-original" resp="#CE_UM">,</supplied>
<lb/> vornehmlich durch viel <name type="plant">Barbatimão</name> <note resp="#CE_UM" type="orig"><term>Stryphnodendron adstringens</term></note>, <name type="plant">Mangaba braba</name> <note resp="#CE_UM" type="orig"><term>Lafoensia pacari</term></note> verunreinigt; etwas 
<lb/> entfernter hat es viel <name type="plant">Guabiroba felpuda</name> <term><supplied reason="omitted-in-original" resp="#CE_UM">Campomanesia discolor</supplied></term> <note resp="#CE_UM" type="editorial">Berg</note><supplied reason="omitted-in-original" resp="#CE_UM">,</supplied> deren Früchte 
</ab></div>
<pb facs="http://gbif.naturkundemuseum-berlin.de/CDV2018/Sellow/ZM_S_I_Sellow_Exk_17_7_r__2537.tif" n="07_r" xml:id="ZM_S_I_Sellow_Exk_17_07_r"/>
<div><head>Seite 07, recto (Bericht 17)</head><ab corresp="#ZM_S_I_Sellow_Exk_17_07_r">
<lb/> jetzt reiften, die <name type="plant">Guabiroba lisa</name> ist dagegen häufiger bei 
<lb/> <name type="geographic">Castro</name> und hier nur selten. <name type="plant">Pitangas do Campo</name> <note resp="#CE_UM" type="orig"><term>Eugenia uniflora</term></note> und 
<lb/> <name type="plant">Acajú do Campo</name> <note resp="#CE_UM" type="orig"><term>Anacardium occidentale</term></note> boten ebenfalls reife Früchte gegenwär- 
<lb/> tig dar. Im <name type="object">Certão</name>, am Rande des <name type="object">Campo</name>, sind <name type="plant">Pinhei</name>-
<lb/> <name type="plant">ros</name> noch häufig, allein jemehr man ins Innere vordringt<supplied reason="omitted-in-original" resp="#CE_UM">,</supplied>
<lb/> desto seltener sie werden und bald gänzlich ver- 
<lb/> schwinden. An den sumpfigen Ufern einiger Bäche des 
<lb/> Campo blühte die <name type="plant">Talauma</name><supplied reason="omitted-in-original" resp="#CE_UM">,</supplied> welche bei <name type="geographic">Soricaba</name> und 
<lb/> <name type="geographic"><choice><orig>St Juão do Ypanema</orig> <reg resp="#CE_UM">São Juão do Ipanema</reg></choice></name> so häufig vorkommt, und ich südlicher auf 
<lb/> dem Festlande nicht gesehen hatte. An <seg type="medicine">Heilkräuter</seg> wurde mir 
<lb/> hier auch nur der <name type="plant">Herva Mulas, Danadinha, Caroba 
<lb/> do Campo, Jalapo do Campo, Jacaranda, Bararisó</name>
<lb/> genannt. <name type="person">Xav<supplied reason="omitted-in-original" resp="#CE_UM">ie</supplied><hi rendition="#sup">r</hi></name> hat eine anständige wohlgeordnete 
<lb/> Hauscapelle. Ein Priester aus der Nachbarschaft pflegte 
<lb/> an Sonn und Festtagen hier Messe zu lesen und 
<lb/> <name type="person">Xaviers</name> Nachbarn versammleten sich an solchen Tagen 
<lb/> bei ihm. Die Meisten pflegten schon am Sonnabend 
<lb/> Abend zurückzukehren. Alle wurden aufs Beste 
<lb/> bewirthet und an solchen Tagen kam auch ein guter 
<lb/> Wein auf den Tisch. Xav<supplied reason="omitted-in-original" resp="#CE_UM">ie</supplied><hi rendition="#sup">r </hi>erschien unter ihnen als ein 
<lb/> sehr ehrwürdiger Vater; die Armen unterstütz- 
<lb/> te er auf alle Weise, den Wohlhabenden stand 
<lb/> er mit Rath bei, wo es die Gelegenheit erheischte; 
<lb/> alle erbaute er durch seine Tugenden. 
<lb/> Nachdem ich<supplied reason="omitted-in-original" resp="#CE_UM">,</supplied> um meine Sammlungen zu fördern<supplied reason="omitted-in-original" resp="#CE_UM">,</supplied> lange bei ihm 
<lb/> verweilt hatte, in der Gewißheit<supplied reason="omitted-in-original" resp="#CE_UM">,</supplied> ihm nicht lästig zu sein<supplied reason="omitted-in-original" resp="#CE_UM">,</supplied>
<lb/> kehrte ich auf dem geraden Wege von hier nach <name type="geographic">Castro</name> zurück 
<lb/> und mein dort gelassenes Gepäck zu holen und die Reise 
<lb/> auf der großen Straße nach <name type="geographic">S. Paulo</name> fortzusetzen. 
<lb/> Man rechnet 12 Legoas von hier nach <name type="geographic">Castro</name>, 5 bis 
<lb/> <name type="geographic">Serra de Furnas</name> und 7 von dort nach <name type="geographic">Castro</name>. 
<lb/> Der Weg läuft südlich<supplied reason="omitted-in-original" resp="#CE_UM">,</supplied> meist in der 11<hi rendition="#sup">ten</hi> Stunde. Nach einer 
<lb/> guten Viertellegoa kommt man durch den Bach oder vielmehr 
<lb/> durch einen Zweig desselben, der am Hause des <name type="person">Xavier</name>
<lb/> vorbei geht nach N hin. Sofort findet man <name type="rock_mineral">Sand- 
<lb/></name> <hi rendition="#r"><name type="rock_mineral">stein</name></hi>
</ab></div>
<pb facs="http://gbif.naturkundemuseum-berlin.de/CDV2018/Sellow/ZM_S_I_Sellow_Exk_17_7_v__2538.tif" n="07_v" xml:id="ZM_S_I_Sellow_Exk_17_07_v"/>
<div><head>Seite 07, verso (Bericht 17)</head><ab corresp="#ZM_S_I_Sellow_Exk_17_07_v">
<lb/> zu Tage. Durch ein grotteskes Thal kommt ein anderer 
<lb/> Zweig von N her des erwähnten Bachs 
<lb/> rechts vom Wege bleibend. Die Schlucht hat hin 
<lb/> wieder üppiges Gebüsch. Sobald man ein etwas hohes 
<lb/> Niveau erreicht hat<supplied reason="omitted-in-original" resp="#CE_UM">,</supplied> zeigt sich das Campo von derselben 
<lb/> Beschaffenheit als das von der Höhe von <name type="geographic">Monte Negro</name>. 
<lb/> Nachdem man kaum 2 L<supplied reason="omitted-in-original" resp="#CE_UM">egoa</supplied> zurückgelegt<supplied reason="omitted-in-original" resp="#CE_UM">,</supplied> erreicht man un- 
<lb/> gefähr das Niveau des <name type="geographic">Monte Negro</name> und hier ver- 
<lb/> sinkt der Boden plötzlich um mehrere hundert Fuß<supplied reason="omitted-in-original" resp="#CE_UM">,</supplied>
<lb/> senkrechte Wände bildend<supplied reason="omitted-in-original" resp="#CE_UM">,</supplied> welche hier in der 1<hi rendition="#sup">sten</hi> St<supplied reason="omitted-in-original" resp="#CE_UM">unde</supplied>
<lb/> streichen, und steigt aus dem Grunde wieder all- 
<lb/> mälig auf in dem Verhältnisse als es bisher 
<lb/> von <name type="person">Xavier</name> aus Statt gehabt. <name type="object">Furnas</name> <note resp="#CE_UM" type="editorial">Grotte, Höhle</note> nennen 
<lb/> die Einwohner Abfälle<supplied reason="omitted-in-original" resp="#CE_UM">.</supplied> Vielleicht von den Löchern her<supplied reason="omitted-in-original" resp="#CE_UM">,</supplied>
<lb/> welche die abgestürzten Sandsteinwände oft zeigen, deren 
<lb/> Dach meist flach gewölbt ist, oder vielleicht auch von 
<lb/> der Ähnlichkeit mit einem Backofen, welche Parthien 
<lb/> des Sandsteingebirges zeigen mögen. Der Weg ins 
<lb/> Thal hinab, obschon steil, ist nicht allzu schlimm für Last- 
<lb/> thiere. Unten liegt mit einer romantischen Um- 
<lb/> gebung der Hof des <name type="person">Luciano Pinto</name> am l<supplied reason="omitted-in-original" resp="#CE_UM">inken</supplied> Ufer des 
<lb/> <name type="geographic">Ar<hi rendition="#sup"><supplied reason="omitted-in-original" resp="#CE_UM">roy</supplied>o</hi> do Carreira</name><supplied reason="omitted-in-original" resp="#CE_UM">,</supplied> welcher hier bei 30 Sch<supplied reason="omitted-in-original" resp="#CE_UM">ritt</supplied> breit 
<lb/> 6'' tief in St<supplied reason="omitted-in-original" resp="#CE_UM">unde</supplied> 2 ½ nach NO geht, um sich im Campo 
<lb/> von <name type="person">Xavier</name> den <name type="geographic">Rio do Cinsas</name> einzuverleiben. 
<lb/> Eine kleine L<supplied reason="omitted-in-original" resp="#CE_UM">egoa</supplied> diesseits der angeblichen <name type="geographic">Serra do <supplied reason="omitted-in-original" resp="#CE_UM">das</supplied> Furnas</name>
<lb/> blieb mir die Est<hi rendition="#sup"><supplied reason="omitted-in-original" resp="#CE_UM">anci</supplied>a</hi> des <name type="person">Padre Gaspar</name> z<supplied reason="omitted-in-original" resp="#CE_UM">ur</supplied> R<supplied reason="omitted-in-original" resp="#CE_UM">echten</supplied>. Dieser war 
<lb/> es<supplied reason="omitted-in-original" resp="#CE_UM">,</supplied> der bei <name type="person">Xav<supplied reason="omitted-in-original" resp="#CE_UM">ie</supplied><hi rendition="#sup">r</hi></name> Messe zu lesen pflegte. Er hatte mir 
<lb/> erzählt<supplied reason="omitted-in-original" resp="#CE_UM">,</supplied> wie er seine Pergamente<supplied reason="omitted-in-original" resp="#CE_UM">,</supplied> welche seinen Adel 
<lb/> bewiesen<supplied reason="omitted-in-original" resp="#CE_UM">,</supplied> in guter Ordnung bewahre, und mir seine adligen 
<lb/> Verwandten<supplied reason="omitted-in-original" resp="#CE_UM">,</supplied> Aeltern und Vorältern alle vorgezählt. 
<lb/> Ich traute daher meinen Augen kaum<supplied reason="omitted-in-original" resp="#CE_UM">,</supplied> als ich statt eines 
<lb/> erwarteten Palasts eine kleine Strohhütte fand, welche 
<lb/> so vieler Großen Abkömmling beherbergte. Daß er sich 
<lb/> übrigens hier wohl befand<supplied reason="omitted-in-original" resp="#CE_UM">,</supplied> bewies seine ungemeine Corpulenz 
<lb/> und da er der einzige Geistliche war, welcher zwischen <name type="geographic">Castro</name>
<lb/> und <name type="geographic">Itapéva</name>, eine 30 L<supplied reason="omitted-in-original" resp="#CE_UM">egoa</supplied> lange Straße, lebte, so wurde 
<lb/> <hi rendition="#r">er</hi>
</ab></div>
<pb facs="http://gbif.naturkundemuseum-berlin.de/CDV2018/Sellow/ZM_S_I_Sellow_Exk_17_8_r__2539.tif" n="08_r" xml:id="ZM_S_I_Sellow_Exk_17_08_r"/>
<div><head>Seite 08, recto (Bericht 17)</head><ab corresp="#ZM_S_I_Sellow_Exk_17_08_r">
<lb/> er dem Bezirk sehr wichtig. Nah<supplied reason="omitted-in-original" resp="#CE_UM">,</supplied> ferner sanft ansteigend<supplied reason="omitted-in-original" resp="#CE_UM">,</supplied>
<lb/> erreichte ich bald die eigentliche Höhe von <name type="geographic">Furnas</name>. 
<lb/> Von hier aus genießt man eine herrliche weite Aussicht 
<lb/> besonders nach SO hin. Das Terrain fällt hier plötzlich steil 
<lb/> ab, zum Theil mit senkrechten Wänden, so daß für die von 
<lb/> <name type="geographic">Castro</name> Kommenden eine kleine <name type="object">Serra</name> entsteht. Allein keine 
<lb/> vollkommene Ebene bietet sich dem Blicke dar; in gerin- 
<lb/> ger Entfernung erhebt sich das Land wieder, beinahe 
<lb/> zu gleichem Niveau als dieser Punkt, einen Berg- 
<lb/> zug bildend, welcher einer Seits Bäche in den <name type="geographic">Piray- 
<lb/> guacu</name><supplied reason="omitted-in-original" resp="#CE_UM">,</supplied> anderer Seits in den <name type="geographic"> <choice><orig/><reg resp="#CE_UM">Rio Iapó</reg></choice></name> sendet. Die Wand 
<lb/> von <name type="geographic">Furnas</name> streicht in der 2<hi rendition="#sup">ten</hi> Stunde, diese ist 
<lb/> auch die Richtung jenes Bergrückens und folglich der 
<lb/> genannten Flüsse. Jener Rücken und das Thal des <name type="geographic">Piray- 
<lb/> guacu</name> sind großentheils mit Wald bedeckt<supplied reason="omitted-in-original" resp="#CE_UM">,</supplied> wovon 
<lb/> viel <name type="plant">Araucarien</name> vorkommen<supplied reason="omitted-in-original" resp="#CE_UM">,</supplied> doch auch viel <name type="object">Campo</name>
<lb/> zeigt sich untermengt. Bei hellem Wetter erkennt 
<lb/> man von hier aus Berge im <name type="object">Certão</name> von <name type="geographic">Acunguy</name>
<lb/> auf der Wasserscheide zwischen diesem und dem <name type="geographic">Iguacú</name><supplied reason="omitted-in-original" resp="#CE_UM">,</supplied>
<lb/> und von verschieden hohen Punkten hier läßt sich gewiß 
<lb/> bei heiterem Himmel der <name type="geographic">Marumbi</name> erkennen. 
<lb/> Anderer Seits sieht man auch sehr wohl von hier 
<lb/> den <name type="geographic">M<supplied reason="omitted-in-original" resp="#CE_UM">orr</supplied><hi rendition="#sup">o</hi> do Caxambú</name> (333° 40' M)<supplied reason="omitted-in-original" resp="#CE_UM">.</supplied> Z<supplied reason="omitted-in-original" resp="#CE_UM">ur</supplied> L<supplied reason="omitted-in-original" resp="#CE_UM">inken</supplied> liegen 
<lb/> Punkte des <name type="rock_mineral">Sandsteins</name> noch höher als dieser umher<supplied reason="omitted-in-original" resp="#CE_UM">,</supplied> von 
<lb/> welchem der Weg von <name type="person">Xavier</name> in die große Straße 
<lb/> von <name type="geographic">Castro</name> nach <name type="person">Fachina <note resp="#CE_UM" type="editorial">Itapeba</note></name> fällt, nämlich bei der <name type="object">Bassa</name>
<lb/> des <name type="person">Padre Gaspar</name> circa 1/8 L<supplied reason="omitted-in-original" resp="#CE_UM">egoa</supplied> von hier in 5. 4 O. 
<lb/> Indem man zu dieser <name type="object">Bassa</name> hinabsteigt, kommt man 
<lb/> an einigen malerischen Sandsteinparthien vorüber, wo 
<lb/> derselbe stark würflich verklüftet ist. Ich ging heute 
<lb/> noch bis zur <name type="object">Fazenda</name> von <name type="person">Miguel Sutil</name>, den ich bei <name type="person">Xav<hi rendition="#sup"><supplied reason="omitted-in-original" resp="#CE_UM">ie</supplied>r</hi></name> hatte kennen gelernt und wo ich freundlich bewirthet 
<lb/> wurde. Am folgenden Tage langte ich gegen Mittag 
<lb/> in <name type="geographic">Castro</name> an; man rechnet 5 L<supplied reason="omitted-in-original" resp="#CE_UM">egoa</supplied> von <name type="person">Sutil</name> dahin, 
<lb/> die auf circa 3 reducirt werden würden<supplied reason="omitted-in-original" resp="#CE_UM">,</supplied> wenn man 
<lb/> in gerader Linie reisen könnte; allein das Terrain 
<lb/> ist sehr eng undulirt und zwingt sehr viele Krümm- 
<lb/> ungen zu beschreiben. 
</ab></div>
</body>
</text>
</TEI>