<?xml version="1.0" encoding="utf-8"?>
<?xml-model href="mfn_manuskripte_schema.rng" type="application/xml" schematypens="http://relaxng.org/ns/structure/1.0"?><?xml-model href="mfn_manuskripte_odd.xml" type="application/tei+xml" schematypens="http://www.tei-c.org/ns/1.0"?><TEI xmlns="http://www.tei-c.org/ns/1.0">
<teiHeader>
<fileDesc>
<titleStmt resp="#LK">
<title level="u" xml:id="de_title" xml:lang="de">Exkursionsberichte von Friedrich Sellow (digitale Transkripte)  – Bericht Nr. 11</title>
<title corresp="#de_title" xml:lang="en">Field trip reports written by Friedrich Sellow (digital transcriptions) – Report No. 11</title>
<author xml:id="FS">Friedrich Sellow</author>
<respStmt xml:id="CE_UM">
<name>Carsten Eckert</name>
<name>Ulrich Moritz</name>
<resp>Transkription und Edition</resp>
</respStmt>
<respStmt xml:id="LK">
<name>Laura E. Kaiser</name>
<resp>Konvertierung in TEI-konformes Markup</resp>
</respStmt>
</titleStmt>
<publicationStmt resp="#LK">
<authority>Museum für Naturkunde, Leibniz-Institut für Evolutions- und Biodiversitätsforschung</authority>
<date>2020</date>
<availability status="restricted">
<licence target="https://creativecommons.org/licenses/by-sa/3.0/de/"> 
                    Dieses Werk ist lizenziert unter einer Creative Commons Namensnennung - Weitergabe unter gleichen Bedingungen 3.0 Deutschland Lizenz.
                </licence>
</availability>
</publicationStmt>
<sourceDesc>
<bibl>Exkursionsberichte der Reisen durch Brasilien und Uruguay von Friedrich Sellow, 1822-1831</bibl>
</sourceDesc>
</fileDesc>
<encodingDesc resp="#LK">
<projectDesc>
<p>Die Texte wurden von Carsten Eckert und Ulrich Moritz für die wissenschaftliche Nutzung durch die Historische Arbeitsstelle des Museum für Naturkunde, Leibniz Institut für Evolutions- und Biodiversitätsforschung transkribiert.</p>
<p>Im Rahmen einer Masterarbeit wurden die Transkripte aus dem .doc-Format (MS Word) in ein TEI-konformes XML-Dokument überführt, dem das im verknüpften XML Schema spezifizierte Datenmodell zugrunde liegt.</p>
</projectDesc>
<editorialDecl>
<p>Sämtliche editorische Eingriffe wurden in den ursprünglichen Transkripten kenntlich gemacht. Alle dieser Markierungen wurden mit - soweit wie möglich - differenzierenden Tags kenntlich gemacht (siehe die beschriebenen Besonderheiten in &lt;tagsDecl&gt;.</p>
<p>Silbentrennung, Zeilenumbrüche und Interpunktion wurden aus dem Original übernommen.</p>
</editorialDecl>
<tagsDecl partial="true">
<rendition scheme="css" xml:id="et">margin-left:4em;</rendition>
<rendition scheme="css" xml:id="red">color:red</rendition>
<rendition scheme="css" xml:id="r">text-align:right;</rendition>
<rendition scheme="css" xml:id="c">text-align:center;</rendition>
<rendition scheme="css" xml:id="s">text-decoration:line-through</rendition>
<rendition scheme="css" xml:id="sup">vertical-align:super; font-size:.7em</rendition>
<rendition scheme="css" xml:id="u">text-decoration:underline</rendition>
<rendition scheme="css" xml:id="v">float:left; transform:rotate(270deg);</rendition>
<rendition scheme="css" selector="body">text-align:justify;</rendition>
<namespace name="https://tei-c.org/ns/1.0/">
<tagUsage gi="reg" resp="#LK">
                    &lt;reg&gt;-Elemente enthalten vom Original abweichende Schreibweisen. Diese umfassen einerseits, wie entsprechend der TEI Richtlinien für dieses Element vorgesehen, die Normalisierung untypischer Schreibweisen, darüber hinaus jedoch mitunter auch die Korrektur falscher Schreibweisen.
                    Diese Ungenauigkeit ist der ursprünglichen Transkription geschuldet, die keine Kodierung entsprechend der TEI-Richtlinien vorsah und entsprechend keine Differenzierung der editorischen Eingriffe vorgenommen hat. Da die Konvertierung nicht von den Transkribierern selbst, sondern von anderer Hand und weitgehend automatisiert vorgenommen wurde, wurden derartige Korrekturen vereinfachend ebenfalls mittels &lt;reg&gt; annotiert, was gegenüber einer (aufgrund mangelnder Expertise bezüglich historischer Schreibweisen) möglicherweise irrtümlichen Auszeichnung als korrigierte Form (&lt;corr&gt;) als geeignetere Strategie erscheint, die Konformität der Kodierung gegenüber dem TEI Abstract Model zu gewährleisten.
                    Eventuelle spätere Versionen dieser kodierten Texte sollten diesen Mangel beheben, indem Korrekturen innerhalb von &lt;corr&gt;-Elementen stehen und die originale Form entsprechend mit &lt;sic&gt; (anstatt derzeit &lt;orig&gt;) annotiert wird.
                </tagUsage>
<tagUsage gi="supplied" resp="#LK">
                    &lt;supplied&gt;-Elemente kennzeichnen editorische Ergänzungen. Da in den ursprünglichen Transkripten absichtlich abgekürzte Schreibweisen nicht eindeutig von (aufgrund vergessener Zeichen/Wörter) falschen Schreibweisen unterscheidbar waren, wurden jegliche editorischen Einfügungen durch ein &lt;supplied&gt;-Element gekennzeichnet, unabhängig davon, ob sie dem Zweck der Auflösung von Abkürzungen oder der Korrektur von Fehlern durch ausgelassenen Text bzw. Zeichen folgen.
                    In einer künftigen Version sollte diese Ungenauigkeit behoben werden, indem lediglich offensichtlich beabsichtigte Auslassungen mittels des &lt;supplied&gt;-Elements ausgezeichnet werden. Falsche Schreibweisen sollten korrigiert werden, indem die korrekte Schreibweise innerhalb eines &lt;corr&gt;-Elements neben der Original-Variante innerhalb eines &lt;sic&gt;-Elements steht, die wiederum beide von einem &lt;choice&gt;-Element umgeben sind. Abkürzungsauflösungen sollten dann anhand des &lt;expan&gt;-Tags ausgezeichnet werden, der neben dem abgekürzten originalen Textteil als &lt;abbr&gt;-Element innerhalb eines &lt;choice&gt;-Elements steht.
                </tagUsage>
<tagUsage gi="seg" resp="#LK">
                    &lt;seg&gt;-Elemente wurden für die Codierung thematisch kategorisierter Textpassagen verwendet. Darin enthaltene Namen sind aufgrund der automatischen Textcodierung noch nicht als solche codiert worden, weil einerseits nicht zwischen Textpassagen und Namen dieser thematischen Abschnitte vorgenommen wurde und andererseits auch keine automatisierte Zuordnung zum übergeordneten type-Attribut der &lt;name&gt;-Elemente möglich gewesen wäre. Bezüglich der &lt;seg&gt;-Elemente wäre es daher wünschenswert, in einer eventuellen künftigen Version Namen darin separat mit einer entsprechenden type- und subtype-Kategorisierung auszuzeichnen.
                    Darüber hinaus wurden &lt;seg&gt;-Elemente behelfsweise für die Auszeichnung von Messdaten verwendet, weil die fachliche Expertise zur feineren Codierung mittels &lt;measure&gt;- bzw. &lt;measureGrp&gt;-Elementen mit den zugehörigen Attributen fehlte. In künftigen Überarbeitungen sollte auch diese Unschärfe möglichst behoben werden.
                </tagUsage>
<tagUsage gi="foreign">
                    Das &lt;foreign&gt;-Element wird in der derzeitigen Codierung ohne die Angabe der Sprache im xml:lang-Attribut verwendet, weil die Unterscheidung zwischen portugiesisch und spanisch in den Transkripten nicht vorhanden war. In künftigen Überarbeitungen sollte diese Information für &lt;foreign&gt;-Elemente ergänzt werden.
                </tagUsage>
</namespace>
</tagsDecl>
<refsDecl>
<p>Jeder Exkursionsbericht ist über das @n-Attribut eines &lt;text&gt;- wie auch body-Elements eindeutig identifizier- und adressierbar.</p>
<p>Ebenso sind Seitenbeginne innerhalb des @n-Attributs jedes &lt;pb&gt;-Elements nummeriert und identifizierbar.</p>
<p>Darüber hinaus ist jede Seite innerhalb eines &lt;ab&gt;-Element über dessen @xml:id-Attribut eindeutig identifizierbar. Die jeweilige ID folgt dem Muster des regulären Ausdrucks'ZM_S_I_Sellow_Exk_[0-9]{2}_[0-9]{2}a?(_(r|v))?' und stellt die hausinterne Signatur innerhalb des Museums für Naturkunde dar.</p>
</refsDecl>
</encodingDesc>
<profileDesc>
<handNotes>
<handNote corresp="#FS">
<p>Handschrift Friedrich Sellows</p>
</handNote>
<handNote xml:id="CAT">
<p>Handschrift Carl August Tennes</p>
</handNote>
<handNote xml:id="unknown">
<p>Handschrift einer unbekannten Person (bzw. Identifizierung der Handschrift nicht angegeben)</p>
</handNote>
</handNotes>
</profileDesc>
<revisionDesc>
<change when="2020-06-29" who="#LK">
<p>Diese Änderung beinhaltet die Konvertierung der Transkripte aus dem doc-Format in TEI P5 konforme XML-Daten, wobei auch die editorischen Eingriffe der Transkribierer soweit möglich spezifiziert wurden.</p>
</change>
</revisionDesc>
</teiHeader>
<text>
<body>
<pb facs="http://gbif.naturkundemuseum-berlin.de/CDV2018/Sellow/ZM_S_I_Sellow_Exk_11_1_r__2488.tif" n="01_r" xml:id="ZM_S_I_Sellow_Exk_11_01_r"/>
<div><head>Seite 01, recto (Bericht 11)</head><ab corresp="#ZM_S_I_Sellow_Exk_11_01_r">
<lb/> <add hand="#unknown"><hi rendition="#u">Prov Parana</hi></add> <hi rendition="#u">Excursion nach den Kalkhöhlen von <name type="geographic">Curitiba</name>.</hi> Die Höhle der <name type="person">Maiana</name> liegt in nordwestlicher Richtung 
<lb/> von Curitiba bei 4 Legoas entfernt. Der Weg führt sehr 
<lb/> bald ins Gebüsch, welches jedoch kleine Campestres einschließt 
<lb/> und diese werden vorzugsweise zu Wohnungen gewählt, 
<lb/> und enthalten nach Verhältnis ihrer Größe eine oder 
<lb/> mehrere Hütten, welche meistens nur klein und ärmlich 
<lb/> sind und bei denen man von Anpflanzungen selten 
<lb/> mehr als einige Pfirsigbäume sieht. Gewöhnlich trifft 
<lb/> man einige Kühe bei diesen Hütten und stets ein 
<lb/> Rudel Schweine, welche den Boden aufwühlen. 
<lb/> Hat man den <name type="geographic"><choice><orig>Ybarigui </orig><reg resp="#CE_UM">Rio Barigui</reg></choice></name> überschritten, der hier nur 
<lb/> ein Bach ist, so führt der Weg durch einen dichten 
<lb/> <name type="person">Taquaral</name> <note resp="#CE_UM" type="editorial">Bambusdickicht</note> aus welchem sich ziemlich hohe Stämme des 
<lb/> <name type="plant">Guratinga</name> erheben und fast ohne Einmengung einer 
<lb/> anderen Baumart. Dieses Gebüsch währt bis zum 
<lb/> <name type="geographic">Campo de Butiatuba</name> <note resp="#CE_UM" type="editorial">Geleepalmenhain</note> fort. – In der Nähe der V<hi rendition="#sup"><supplied reason="omitted-in-original" resp="#CE_UM">il</supplied>a </hi>von 
<lb/> <name type="geographic">Curitiba</name> findet sich Lehmen des Flötztrapps. Zwischen ihm 
<lb/> dem <name type="geographic">Ybarigui</name> sah ich verwitterten Gneus zu Tage 
<lb/> und auf höherem Niveau Lehmen mit Grünsteinkugeln 
<lb/> und an einer anderen Stelle Raseneisenstein. 
<lb/> Gegen das <name type="geographic">Campo de Butiatuba</name> hin steigt das Niveau 
<lb/> etwas an und dort finden sich viel Quarzgeschiebe<supplied reason="omitted-in-original" resp="#CE_UM">,</supplied> welche 
<lb/> aus einem vermuthlich zur Grauwacke gehörigen Sandstein 
<lb/> herstammen. Dieses <name type="object">Campo</name> ist stark bewohnt; von der Höhe<supplied reason="omitted-in-original" resp="#CE_UM">,</supplied>
<lb/> von welcher man in dasselbe tritt<supplied reason="omitted-in-original" resp="#CE_UM">,</supplied> fallen bis 20 zerstreut 
<lb/> liegende Hütten ins Auge. Es hat bei 1 L<supplied reason="omitted-in-original" resp="#CE_UM">egoa</supplied> Länge von SW 
<lb/> nach NO und ¼, ½, ¾ L<supplied reason="omitted-in-original" resp="#CE_UM">egoa</supplied> Breite. Das Land wird hier 
<lb/> bergig; man ist in der Nähe der Wasserscheide zwischen 
<lb/> den <name type="person">Acunguy</name> <supplied reason="omitted-in-original" resp="#CE_UM">Rio</supplied> <name type="geographic">Capivary</name> und dem <name type="geographic"><choice><orig>Yguacú </orig><reg resp="#CE_UM">Iguaçu</reg></choice></name> und auf dieser 
<lb/> zeichnet sich hier gen NW der <name type="person">Moro da Tranqueira</name> aus, in 
<lb/> einer Entfernung von circa 1 ½ Legoa. Der <name type="geographic">Ybarigui</name><supplied reason="omitted-in-original" resp="#CE_UM">,</supplied> welcher 
<lb/> an diesem Berge entspringen soll, fließt hier gen NO durch 
<lb/> das <name type="geographic">Campo da Butiatuba</name>, so genannt weil hier ehemals viel 
<lb/> <name type="plant">Butia</name> <note resp="#CE_UM" type="editorial">Geleepalmen</note> wuchsen und an Stellen noch gegenwärtig daran ange- 
<lb/> troffen werden. – An einem sich in den <name type="geographic">Ybarigui</name> ergießen- 
<lb/> den Bache sah ich einen graublauen Thonschiefer zu Tage<supplied reason="omitted-in-original" resp="#CE_UM">,</supplied>
</ab></div>
<pb facs="http://gbif.naturkundemuseum-berlin.de/CDV2018/Sellow/ZM_S_I_Sellow_Exk_11_1_v__2489.tif" n="01_v" xml:id="ZM_S_I_Sellow_Exk_11_01_v"/>
<div><head>Seite 01, verso (Bericht 11)</head><ab corresp="#ZM_S_I_Sellow_Exk_11_01_v">
<lb/> welcher Körner von Rauchquarz enthält und in Sandst<supplied reason="omitted-in-original" resp="#CE_UM">ein</supplied>
<lb/> übergeht<supplied reason="omitted-in-original" resp="#CE_UM">,</supplied> der zur Grauwacke gehören mag. Überall 
<lb/> an den niedrigen Stellen dieses Campo liegt schwarze Damm<name type="rock_mineral">-
<lb/></name> erde oben auf. Auf niedrigerem Niveau als der Thonsch<supplied reason="omitted-in-original" resp="#CE_UM">iefer</supplied>
<lb/> am nun folgenden Bache liegt ein an 6 Lachter mäch- 
<lb/> tiges Lager von Kalkstein, von weiß<supplied reason="omitted-in-original" resp="#CE_UM">lich</supplied> grauer Farbe, 
<lb/> dicht von splittrigem Bruche und<supplied reason="omitted-in-original" resp="#CE_UM">,</supplied> wie es schien<supplied reason="omitted-in-original" resp="#CE_UM">,</supplied> ungeschichtet<supplied reason="omitted-in-original" resp="#CE_UM">.</supplied>
<lb/> Er steht als Damm an<supplied reason="omitted-in-original" resp="#CE_UM">,</supplied> in der 3<hi rendition="#sup">ten</hi> Stunde gestreckt<supplied reason="omitted-in-original" resp="#CE_UM">,</supplied> von 
<lb/> 4 – 5 Lachter Höhe mit meist senkrecht abgestürzten 
<lb/> Wänden von rauher Oberfläche, und liegt häufig ge- 
<lb/> trennt und zerspalten<supplied reason="omitted-in-original" resp="#CE_UM">.</supplied> – Der Weg läuft ferner über 
<lb/> kleine Höhen, bald durch Wald, bald durch <name type="object">Campestres</name>. – 
<lb/> Die nächste Höhe hat rundligte Blöcke von Grünstein 
<lb/> aufzuweisen<supplied reason="omitted-in-original" resp="#CE_UM">,</supplied> welche auf oder in gelbem Lehmen liegen; 
<lb/> die folgende am linken Ufer des <name type="geographic"><choice><orig>Pasauna </orig><reg resp="#CE_UM">Rio Passauna</reg></choice></name>, der hier 
<lb/> noch sehr klein ist, besteht aus einer feinkörnigen weißlichen<supplied reason="omitted-in-original" resp="#CE_UM">,</supplied>
<lb/> durch Trümmer, Gänge und Lager von reinem Quarz häufig 
<lb/> durchsetzten Sandstein mit thonigtem Bindemittel, welches 
<lb/> mit Thonschiefer abwechselt und im Allgemeinen und 
<lb/> beständig genug in h. 3:4 – 4:4 streicht und nach SO. 
<lb/> 35 – 40 – 60º eingeschossen ist. Der Thonschiefer zeigt sich an 
<lb/> dieser Stelle nur in sehr schwachen Lagern und scheint fast 
<lb/> ein Schieferthon. Diese Gebirgsmasse ist sehr verwittert<supplied reason="omitted-in-original" resp="#CE_UM">,</supplied>
<lb/> nur der viele Quarz liegt noch zum Theil in festen Stücken 
<lb/> darin. Glimmer scheint selten darin<supplied reason="omitted-in-original" resp="#CE_UM">.</supplied> – Von dieser Höhe sieht 
<lb/> man gen S. circa ½ L<supplied reason="omitted-in-original" resp="#CE_UM">egoa</supplied> entfernt ein ansehnliches <name type="object">Campo</name><supplied reason="omitted-in-original" resp="#CE_UM">,</supplied>
<lb/> das <name type="geographic">Campo de Juruqui</name> liegen. Am r<supplied reason="omitted-in-original" resp="#CE_UM">echten</supplied> Ufer des 
<lb/> <name type="geographic">Pasauna</name> im Thale steht <supplied reason="omitted-in-original" resp="#CE_UM">b</supplied>lauer Thonschiefer an, sehr ho- 
<lb/> mogen, einem Thons<name type="rock_mineral">chiefer</name> nicht unähnlich nach SO eingeschossen<supplied reason="omitted-in-original" resp="#CE_UM">.</supplied>
<lb/> Dieselbe Anhöhe zeigt bald auf höherem Niveau einen 
<lb/> gelblichen schieferthonartigen Thonschiefer<supplied reason="omitted-in-original" resp="#CE_UM">,</supplied> welcher mit einem 
<lb/> feinkörnigen grauen von Quarzadern durchsetzten mürben 
<lb/> Sandstein abwechselt; auf dem höchsten Punkt bildet 
<lb/> der Sandst<supplied reason="omitted-in-original" resp="#CE_UM">ein</supplied> abgerundete Blöcke als Trümmer eines mächtigen 
<lb/> Bogens. Auch dieses Gebilde streicht h 4 und ist 60º nach 
<lb/> SO eingeschossen. Wahrscheinlich gehört es zur Grau<name type="rock_mineral">- 
<lb/></name> wacke wie jener Kalkstein zum <name type="rock_mineral">Übergangsgebirge</name><supplied reason="omitted-in-original" resp="#CE_UM">.</supplied> – 
<lb/> Ich gelangte sodann durch das kleine Campo do <name type="geographic"><choice><orig> Marmel- 
<lb/> leirenho</orig> <reg resp="#CE_UM">Campo do Marmeleiro</reg></choice></name><supplied reason="omitted-in-original" resp="#CE_UM">,</supplied> worin auch Butia Palmen, worunter Schäfte 
</ab></div>
<pb facs="http://gbif.naturkundemuseum-berlin.de/CDV2018/Sellow/ZM_S_I_Sellow_Exk_11_2_r__2490.tif" n="02_r" xml:id="ZM_S_I_Sellow_Exk_11_02_r"/>
<div><head>Seite 02, recto (Bericht 11)</head><ab corresp="#ZM_S_I_Sellow_Exk_11_02_r">
<lb/> vorkommen von 12 – 15' Höhe, und noch einige andere kleine <name type="object">Cam- 
<lb/> pestres</name> zur <name type="geographic">F<supplied reason="omitted-in-original" resp="#CE_UM">azien</supplied><hi rendition="#sup">da</hi> de Marmelleiros</name> bei schon einbrechender 
<lb/> Nacht. – Der Hausherr war nicht anwesend und wir würden 
<lb/> daher, trotz der Nacht, vermuthlich haben weiter gehen 
<lb/> müssen, wenn mein Vaqueiro nicht hier bekannt gewe- 
<lb/> sen wäre. Dieser ging nach der Kirche, und redete mit 
<lb/> der Frau, und brachte seine Empfehlung von <name type="ethnicity_group">Cap<hi rendition="#sup"><supplied reason="omitted-in-original" resp="#CE_UM">ita</supplied>m</hi> Mor</name>
<lb/> an, worauf man uns das Zimmer öffnete, mir ein 
<lb/> Bett bereitete, und später ein Abendbrodt herbei brach- 
<lb/> te. Der Hausherr, ein <name type="ethnicity_group">Padre,</name> kam bald und bezeigte 
<lb/> sich sehr zufrieden, mich beherbergen zu können. 
<lb/> Sein Haus bestand in einem ziemlich geräumigen Saal 
<lb/> einer Kammer. Es war mit Ziegel gedeckt, und die Zimmer 
<lb/> gedielt, die Decke der Zimmer bestanden in einer aus Taqua<name type="plant">- 
<lb/></name> ra gewebten Matte. Vom Saale aus konnte man 
<lb/> einerseits sogleich in die Kirche treten, welche in einer 
<lb/> niedrigen engen Strohhütte bestand<supplied reason="omitted-in-original" resp="#CE_UM">,</supplied> und der vorzügliche 
<lb/> Aufenthalt der Familie in dieser Jahreszeit zu sein schien<supplied reason="omitted-in-original" resp="#CE_UM">.</supplied>
<lb/> Jene Kammer war mit Mais angefüllt. Die Möbel 
<lb/> des Saals bestanden in einer mit Riemen überfloch- 
<lb/> tenen Bettstelle, und in einer hohen Bank, welche 
<lb/> bald als Tisch bald als Sitz dienen mußte. Der Mann 
<lb/> hielt die Empfehlung von seinem <name type="ethnicity_group">Cap<hi rendition="#sup"><supplied reason="omitted-in-original" resp="#CE_UM">ita</supplied>m</hi> Mor</name> so in Ehren<supplied reason="omitted-in-original" resp="#CE_UM">,</supplied>
<lb/> daß er uns ein junges Schwein zum Frühstück vorsetzte. 
<lb/> Von diesem Punkte aus übersteigt der Weg zunächst einen 
<lb/> ansehnlich bewaldeten Hügel<supplied reason="omitted-in-original" resp="#CE_UM">,</supplied> welcher in gelblichem Thon- 
<lb/> schiefer, gemengt mit Würfel von Schwefelkies, besteht, 
<lb/> und in der Nähe von <name type="geographic">Marmelleiros</name> Bogen von grauem 
<lb/> Grünwacke ähn<supplied reason="omitted-in-original" resp="#CE_UM">lichem</supplied> Sandstein enthielt, streichend h 4. Auf 
<lb/> der Höhe zeigen sich sehr viel Brocken von Quarz und 
<lb/> man darf nicht zweifeln, daß man sich noch auf derselben 
<lb/> Formation befindet als am <name type="geographic">Pasauna</name>. Dieselbe Formation 
<lb/> hält ferner an, zwischen dem <name type="geographic">Ar<hi rendition="#sup"><supplied reason="omitted-in-original" resp="#CE_UM">roy</supplied>o</hi> do </name><name type="person">Maiana peq<hi rendition="#sup"><supplied reason="omitted-in-original" resp="#CE_UM">uen</supplied>o</hi></name> und 
<lb/> <name type="person">Maiana gr<hi rendition="#sup"><supplied reason="omitted-in-original" resp="#CE_UM">ran</supplied>de</hi>. </name>Freilich sah ich den Thonschiefer hier 
<lb/> nicht mehr zu Tage, allein bald feinen weißen, 
<lb/> kleinkörnigen grauen, von zahllosen Quarz- 
<lb/> kammern durchsetzten<supplied reason="omitted-in-original" resp="#CE_UM">,</supplied> in St<supplied reason="omitted-in-original" resp="#CE_UM">unde</supplied> 3.4 streichenden 50º<supplied reason="omitted-in-original" resp="#CE_UM">,</supplied> nach SO 
<lb/> eingeschossenen Sandst<supplied reason="omitted-in-original" resp="#CE_UM">ein</supplied>. Das Land ist hier sehr gebrochen 
<lb/> und bergig. In der Nähe des <name type="geographic">Ar<hi rendition="#sup"><supplied reason="omitted-in-original" resp="#CE_UM">roy</supplied>o</hi> do </name><name type="person">Maiana grande 
<lb/></name> von einer Höhe<supplied reason="omitted-in-original" resp="#CE_UM">,</supplied> wo am 1 Juli h. 3 des ☿ <unit>a/c 12 25 3 72 28 10 04</unit> stand 
<lb/> bei Wind W 7 N und welche mit Grünstein bedeckt<supplied reason="omitted-in-original" resp="#CE_UM">,</supplied> der hier 
</ab></div>
<pb facs="http://gbif.naturkundemuseum-berlin.de/CDV2018/Sellow/ZM_S_I_Sellow_Exk_11_2_v__2491.tif" n="02_v" xml:id="ZM_S_I_Sellow_Exk_11_02_v"/>
<div><head>Seite 02, verso (Bericht 11)</head><ab corresp="#ZM_S_I_Sellow_Exk_11_02_v">
<lb/> auf Übergangskalk liegt<supplied reason="omitted-in-original" resp="#CE_UM">,</supplied> zieht sich ein Pfad z<supplied reason="omitted-in-original" resp="#CE_UM">ur</supplied> L<supplied reason="omitted-in-original" resp="#CE_UM">inken</supplied> hinab 
<lb/> in das Thal der Höhle. Von jener Höhe aus sieht man 
<lb/> einen ziemlich ausgezeichneten Berg in h 10 NW unge- 
<lb/> fähr 1 L<supplied reason="omitted-in-original" resp="#CE_UM">egoa</supplied> ab, den <name type="person">Moro do Batara</name>. Der Hügel der 
<lb/> Höhle scheint sich in h. 7 4 auszudehnen und der <name type="person">Maiana</name><name type="geographic">
<lb/></name> <name type="person">grande</name> mit dieser Richtung, nachdem er unter diesem Hügel 
<lb/> durchgegangen. Ins Thal hinabgelangt, findet man auf 
<lb/> jener nordöstlichen Seite eine senkrechte bis 10 Klafter 
<lb/> hohe Kalksteinwand<name type="rock_mineral">,</name> welche hier, wo der <name type="geographic">Ar<hi rendition="#sup"><supplied reason="omitted-in-original" resp="#CE_UM">roy</supplied>o</hi> do </name><name type="person">Maiana</name>
<lb/> grande<supplied reason="omitted-in-original" resp="#CE_UM">,</supplied> der aus S.W her ankommt<supplied reason="omitted-in-original" resp="#CE_UM">,</supplied> sich ihr nahet, einen 
<lb/> Winkel von beinahe 90º bildet. Der <name type="person">Maiana</name><supplied reason="omitted-in-original" resp="#CE_UM">,</supplied> dessen 
<lb/> Breite hier 12 Schritte beträgt und den man hier auch 
<lb/> <name type="person"><choice><orig>Ribeirão </orig><reg resp="#CE_UM">Ribeiro</reg></choice> do Ermida</name> nennt, richtet sich auf den gen 
<lb/> W gewendeten Theil der Wand und verliert sich 
<lb/> dort unter ihr. An seinem Ufer stand das ☿ 
<lb/>
<table cols="8" rows="3">
<row>
<cell> am 1 Juli um 0. </cell> <cell> <seg type="measurement-data">a/c 12</seg> </cell> <cell> <seg type="measurement-data">25</seg> </cell> <cell> <seg type="measurement-data">6</seg> </cell> <cell> <seg type="measurement-data">92</seg> </cell> <cell> <seg type="measurement-data">28</seg> </cell> <cell> <seg type="measurement-data">11</seg> </cell> <cell> <seg type="measurement-data">42 W W 7 N.</seg> </cell>
</row>
<row>
<cell> </cell> <cell> <seg type="measurement-data">g 12.5</seg> </cell> <cell> </cell> <cell> </cell> <cell> </cell> <cell> </cell> <cell> </cell> <cell> <seg type="measurement-data">Wolkig</seg> </cell>
</row>
<row>
<cell> </cell> <cell> <seg type="measurement-data">11</seg> </cell> <cell> <seg type="measurement-data">25</seg> </cell> <cell> <seg type="measurement-data">7</seg> </cell> <cell> <seg type="measurement-data">34</seg> </cell> <cell> <seg type="measurement-data">29</seg> </cell> <cell> <seg type="measurement-data">0</seg> </cell> <cell> <seg type="measurement-data">14 Still. Unbewölkt</seg> </cell>
</row>
</table>
<lb/> Die Eingänge zur Höhle befinden sich in dem gen 
<lb/> S gerichteten Theile. Dieser hat eine senkrechte Höhe von circa 
<lb/> 9 Klafter. Über der ganzen Bank, wo der Boden noch 
<lb/> ferner und ziemlich steil ansteigt, steht hohe Waldung. 
<lb/> Beide Eingänge, deren Zwischenwand nicht über 4 Klafter 
<lb/> beträgt, und wovon der größte bis dicht in den Win- 
<lb/> kel greift, stellen spitze gotische Bögen dar, welche, als 
<lb/> wäre das Gebäude versunken, nach W hin über geneigt 
<lb/> sind, circa 25º von der senkrechten Linie 
<lb/> abweichend. Der größte Bogen<supplied reason="omitted-in-original" resp="#CE_UM">,</supplied> welcher z<supplied reason="omitted-in-original" resp="#CE_UM">ur</supplied> R<supplied reason="omitted-in-original" resp="#CE_UM">echten</supplied><supplied reason="omitted-in-original" resp="#CE_UM">,</supplied> hat von 
<lb/> der Schwelle des Haupteingangs an, welche 2 ½ Lachter 
<lb/> über dem Bache liegt, eine Höhe von 5 ½ Lachter und 
<lb/> seine Breite beträgt 5 Lachter. Der kleinere Bogen 
<lb/> z<supplied reason="omitted-in-original" resp="#CE_UM">ur</supplied> L<supplied reason="omitted-in-original" resp="#CE_UM">inken</supplied> hat eine Höhe von circa 4 Lachter eine Breite von 
<lb/> dreien. Dieser stellt einen einfachen Eingang dar mit 
<lb/> etwas abschüssiger Sohle und fast ohne Verzierungen. 
<lb/> Der größere hingegen bildet zunächst eine 6 Klafter 
<lb/> tiefe Vorhalle. Im Grunde dieser liegt ein auf die Kante 
<lb/> gestellter Würfel, dessen Querdiagonale 3 Län- 
<lb/> gendiagonale 4 Klafter beträgt und welcher ohne Zwei- 
<lb/> fel sich einst vom Dache trennte. Diesen Block nannte ein Führer die Kanzel des Eremiten, die er ohne Schwie- 
</ab></div>
<pb facs="http://gbif.naturkundemuseum-berlin.de/CDV2018/Sellow/ZM_S_I_Sellow_Exk_11_3_r__2492.tif" n="03_r" xml:id="ZM_S_I_Sellow_Exk_11_03_r"/>
<div><head>Seite 03, recto (Bericht 11)</head><ab corresp="#ZM_S_I_Sellow_Exk_11_03_r">
<lb/> rigkeit erstieg<supplied reason="omitted-in-original" resp="#CE_UM">,</supplied> um die Stellung eines predigenden an- 
<lb/> zunehmen. Bei speziellerer Betrachtung erkennt man 
<lb/> ferner dort zwei Eingänge, den einen östlich, den anderen 
<lb/> westlich von der Kanzel, mit gleichfalls gotischen<supplied reason="omitted-in-original" resp="#CE_UM">,</supplied> allein 
<lb/> aufrechten Bögen, wovon der west<supplied reason="omitted-in-original" resp="#CE_UM">lich</supplied> von der Sohle der 
<lb/> Kanzel an gerechnet 4 ½ Klafter Höhe<supplied reason="omitted-in-original" resp="#CE_UM">,</supplied> der östliche 4 Klafter 
<lb/> hat. Von diesen hängen eine Menge zum Theil sehr 
<lb/> lange und mannigförmige Stalaktiten herab, und auch 
<lb/> schon der große Boden der Vorhalle ist mit Stalaktiten <note resp="#CE_UM" type="editorial">eigentl. Stalagmiten</note>
<lb/> verziert. Vor der Kanzel erheben sich Stalakmiten 
<lb/> und tragen dazu bei<supplied reason="omitted-in-original" resp="#CE_UM">,</supplied> beide Bögen deutlich darzustellen<supplied reason="omitted-in-original" resp="#CE_UM">.</supplied>
<lb/> Den westlichen wählt sich der Bach, welcher, nachdem er gen Ost in 
<lb/> den Felsen eingegangen, sich sogleich nördlich 
<lb/> wendet, und nach circa 8 Meter unterirdischem 
<lb/> Lauf rauschend in der Vorhalle erscheint, und bald<supplied reason="omitted-in-original" resp="#CE_UM">,</supplied> nach- 
<lb/> dem er in die Höhle eingegangen<supplied reason="omitted-in-original" resp="#CE_UM">,</supplied>
<lb/> sich stets hart an die westliche Wand 
<lb/> haltend sich aufs neue unter Felsen ver- 
<lb/> liert. Der öst<supplied reason="omitted-in-original" resp="#CE_UM">liche</supplied> dieser Bögen gewährte uns einen 
<lb/> nicht unbequemen Durchgang. Das Innere zeigt 
<lb/> zunächst einen St<supplied reason="omitted-in-original" resp="#CE_UM">unde</supplied> 12.4 streichenden, an 13 Klafter langen Corredor von 
<lb/> circa 1 ½ – 2 Klafter Breite, dessen Dach um 55º 
<lb/> nach W einschießt, und dessen Sohle gleichfalls 
<lb/> eine sehr starke Neigung bis zum Bache hinab nach W hin hat. Es ist 
<lb/> eigentlich eine 50 – 60º gen W eingeschossene Felsspalte<supplied reason="omitted-in-original" resp="#CE_UM">,</supplied>
<lb/> deren Abstand der Sohle vom Dache selten über 
<lb/> 2 Klafter beträgt deren Breite im Allgemeinen 
<lb/> 6 bis 8 Lachter hat. Vom Dache dieses Corredors 
<lb/> hangen eine Menge größerer und kleinerer 
<lb/> Stalaktiten, bald als einfache Zapfen<supplied reason="omitted-in-original" resp="#CE_UM">,</supplied> bald büschelweise 
<lb/> aneinander gewachsen und von mannigfaltigen 
<lb/> Formen; von der Sohle erheben sich senkrechte 
<lb/> Stalakmiten<supplied reason="omitted-in-original" resp="#CE_UM">,</supplied> wovon viele zu Pfeilern und Säulen 
<lb/> angewachsen<supplied reason="omitted-in-original" resp="#CE_UM">,</supplied> welche das Dach zu stützen scheinen. 
<lb/> Die östliche Wand<supplied reason="omitted-in-original" resp="#CE_UM">,</supplied> welche beinahe senkrecht ansteigt<supplied reason="omitted-in-original" resp="#CE_UM">,</supplied>
<lb/> während die westliche und das Dach in einander 
<lb/> verlaufen<supplied reason="omitted-in-original" resp="#CE_UM">,</supplied> ist mit ähnlichen Gebilden verschieden- 
<lb/> artig bekleidet; an vielen Stellen hat sie <choice><orig>canel- 
<lb/> lirte</orig> <reg resp="#CE_UM">kanellierte</reg></choice> Pilaster wie auch die älteren oder <name type="person"><gap quantity="1" reason="illegible" resp="#CE_UM" unit="words"/></name>
<lb/> Säulen meistens canellirt, oft wie articulirt canellirt 
<lb/> erscheinen, während die Pfeiler oder jüngere Stalak- 
<lb/> miten meistens nur knorrig (torulosa) sind; an anderen 
<lb/> <hi rendition="#r">Stellen</hi>
</ab></div>
<pb facs="http://gbif.naturkundemuseum-berlin.de/CDV2018/Sellow/ZM_S_I_Sellow_Exk_11_3_v__2494.tif" n="03_v" xml:id="ZM_S_I_Sellow_Exk_11_03_v"/>
<div><head>Seite 03, verso (Bericht 11)</head><ab corresp="#ZM_S_I_Sellow_Exk_11_03_v">
<lb/> zumal<supplied reason="omitted-in-original" resp="#CE_UM">,</supplied> wo sich Thon in den Kalk mengt<supplied reason="omitted-in-original" resp="#CE_UM">,</supplied> sind die Flächen 
<lb/> mit Dendriten überzogen. Manche der Pfeiler haben 
<lb/> Formen, welchen etwas Einbildungskraft menschliche Figu- 
<lb/> ren s.w. leiht. Je mehr man in das Innere dringt<supplied reason="omitted-in-original" resp="#CE_UM">,</supplied>
<lb/> so dunkeler der Gang wird, desto reicher verziert findet 
<lb/> man ihn. Am Ende dieses Corredors herscht schon voll-
<lb/> kommene Finsterniß und man bedarf Fackeln<supplied reason="omitted-in-original" resp="#CE_UM">,</supplied> um weiter 
<lb/> gehen zu können. Man wendet sich nun gen h. 7.4 W und 
<lb/> blickt durch eine Art Vorkammer in das Innerste der 
<lb/> Höhle, wo besonders große Massen von Stalaktiten<supplied reason="omitted-in-original" resp="#CE_UM">,</supplied>
<lb/> welche gleich Kronenleuchter vom Gewölbe herabhängen<supplied reason="omitted-in-original" resp="#CE_UM">,</supplied>
<lb/> auffallen. Um auf den Boden dieser Vorkammer 
<lb/> zu gelangen<supplied reason="omitted-in-original" resp="#CE_UM">,</supplied> muß man abrupt 1 Klafter tief hinab- 
<lb/> steigen. Sie hat 6 Klafter Länge und ihre 
<lb/> senkrechten<supplied reason="omitted-in-original" resp="#CE_UM">,</supplied> freilich nicht glatten<supplied reason="omitted-in-original" resp="#CE_UM">,</supplied> nur circa 1 Klafter 
<lb/> von einander abstehenden Wände sind nicht mit Sta- 
<lb/> laktiten übergossen. Aus der Vorkammer steigt 
<lb/> man noch ein Lachter tief hinab und findet hier den 
<lb/> Bach wieder und befindet sich in einem kreis- 
<lb/> förmigen Saal mit gewölbter Decke mit einem Durch- 
<lb/> messer von O g<supplied reason="omitted-in-original" resp="#CE_UM">en</supplied> W von 6 und von S gen N von 7 Klaf- 
<lb/> ter und einer Höhe von circa 4 ½ Klafter. Wenn die 
<lb/> Wände und Decke des Corredors reich verziert sind<supplied reason="omitted-in-original" resp="#CE_UM">,</supplied>
<lb/> so sind es noch vielmehr die des Saales. Die Decke ist 
<lb/> dicht mit z<supplied reason="omitted-in-original" resp="#CE_UM">um</supplied> Theil ungeheuren Massen von Stalaktiten 
<lb/> besetzt, welche man mit durch Leinwand überzogene Kro-
<lb/> nenleuchter (in Flor gehüllte) vergleichen könnte. Die Wände sind größten- 
<lb/> theils auch mit Tropfstein überkleidet. Hin und wieder 
<lb/> ziehen sich Schlupfwinkel hinein, welche mehrere Personen 
<lb/> beherbergen könnten. Stalakmiten von verschiedenen 
<lb/> Größen sind auch häufig und zuweilen stoßen diese 
<lb/> auf Gerüste<supplied reason="omitted-in-original" resp="#CE_UM">,</supplied> welche gleich Fachwerk von den Wän- 
<lb/> den hervorragen und außer ihrer Last am Pfeiler 
<lb/> noch viele Menschen tragen könnten, obschon sie nur 
<lb/> dünn erscheinen. Besonders merkwürdig ist eine herr- 
<lb/> liche Säule<supplied reason="omitted-in-original" resp="#CE_UM">,</supplied> welche beinahe in der Mitte des Saals 
<lb/> nur etwas gen Süd gerückt das Gewölbe unterstützt. 
<lb/> Ihre Form ist fast keulenförmig<supplied reason="omitted-in-original" resp="#CE_UM">,</supplied> indem sie nach oben 
<lb/> zu ziemlich schnell, nach unten zu allmälich an Stärke 
<lb/> abnimmt. Sie ist gefurcht, am Kopfe fast artikulirt gef<supplied reason="omitted-in-original" resp="#CE_UM">ormt</supplied><supplied reason="omitted-in-original" resp="#CE_UM">,</supplied>
<lb/> hat 3 Klafter Höhe und gegen die Mitte hin 2 Klafter 
<lb/> 2 Spann Umfang. Der Bach<supplied reason="omitted-in-original" resp="#CE_UM">,</supplied> welcher hier mit einer Breite 
<lb/> von 8 Schritten erscheint<supplied reason="omitted-in-original" resp="#CE_UM">,</supplied> hält sich dicht an die östliche 
<lb/> Wand und verliert sich in h.1.4 nach N gehend aufs Neue 
</ab></div>
<pb facs="http://gbif.naturkundemuseum-berlin.de/CDV2018/Sellow/ZM_S_I_Sellow_Exk_11_4_r__2495.tif" n="04_r" xml:id="ZM_S_I_Sellow_Exk_11_04_r"/>
<div><head>Seite 04, recto (Bericht 11)</head><ab corresp="#ZM_S_I_Sellow_Exk_11_04_r">
<lb/> Neue in dem Fels. Die Westliche Wand hängt nach Ost über 
<lb/> und man erkennt auch hier eine nach W eingeschossene Gebirgs-
<lb/> spalte. Wir gelangten durch den bereits erwähnten 
<lb/> westlichen Eingang hinaus. Dieser Corredor ist circa 14 Klafter 
<lb/> lang<supplied reason="omitted-in-original" resp="#CE_UM">,</supplied> allein etwas weniger hoch und breit als der 
<lb/> östliche und auch nicht ganz so reich an Stalaktiten und 
<lb/> Stalakmiten. Er streicht St<supplied reason="omitted-in-original" resp="#CE_UM">unde</supplied> 12. Der Bach drang in früheren Zeiten ohne 
<lb/> Zweifel durch beide Eingänge in den Saal, von wo 
<lb/> aus er weiter durch den Berg zu gelangen sucht. Als 
<lb/> er ein niedrigeres Niveau erreichte, trocknete der 
<lb/> restliche aus. Das Wasser im Saale scheint gegenwär- 
<lb/> tig auch nur zurückgedrängt. Sein Bett war hier mit feinem 
<lb/> gelbem Sand<supplied reason="omitted-in-original" resp="#CE_UM">,</supplied> mit kl<supplied reason="omitted-in-original" resp="#CE_UM">einen</supplied> verwitterten Würfel von Schwefelkies 
<lb/> gemengt<supplied reason="omitted-in-original" resp="#CE_UM">,</supplied> angefüllt. In diesem Kalkstein konnte ich nir- 
<lb/> gends Versteinerungen entdecken, wo immer ich es auch 
<lb/> anschlug. Nachdem ich noch vom Anblick dieser schönen 
<lb/> Höhle gesättigt, kehrte ich nach <name type="geographic">Marmelleiros</name> zurück<supplied reason="omitted-in-original" resp="#CE_UM">,</supplied> wo ich noch einmal übernachtete, und so freundlich als das 
<lb/> erste mal behandelt wurde. Die Gegend am <name type="person">Maiana</name>
<lb/> und an anderen Bächen<supplied reason="omitted-in-original" resp="#CE_UM">,</supplied> welche in den <name type="person">Acunguy</name> gehen<supplied reason="omitted-in-original" resp="#CE_UM">,</supplied>
<lb/> ist schon stark bewohnt. Die meisten <name type="ethnicity_group">Curitibaner</name> haben 
<lb/> hier ihre <seg type="agriculture_crafts">Mais und Bohnenpflanzungen</seg> und man kennt 
<lb/> keine fruchtbarere Gegend bei Curitiba als diesen 
<lb/> <name type="object">Certão</name>. Ein ansehnlicher Theil der Waldung ist be- 
<lb/> reits in <name type="object">Capoeiras</name> verwandelt und diese geben 
<lb/> im Winter den besten Aufenthalt für Pferde und 
<lb/> Maulthiere; sie erhalten sich hier muskulös, selbst 
<lb/> ohne Maisfutter, während sie in dieser Jahreszeit 
<lb/> auf dem <name type="object">Campo</name> zu Skeleten herabsinken würden. 
<lb/> Mein Wirth erzählte von vielen anderen Kalkhöhlen 
<lb/> der Nachbarschaft, wovon jedoch keine der des <name type="person">Maiana</name> an Größe gleich käme. Am nächsten Tage kehrte ich 
<lb/> nach <name type="geographic">Curitiba</name> zurück und unternahm am folgenden eine 
<lb/> Excursion nach der Kalksteinhöhle des <name type="geographic"><choice><orig> Arrayal Queimato</orig> <reg resp="#CE_UM">Arraial Queimado</reg></choice><name type="person"/></name><name type="geographic"/>
<lb/> in nördlicher oder nordnordöstlicher Richtung von 
<lb/> dieser Villa. Der Weg dahin ist bis über den <name type="geographic">Ar<hi rendition="#sup"><supplied reason="omitted-in-original" resp="#CE_UM">roy</supplied>o</hi><choice><orig>
<lb/> Bacayiry </orig><reg resp="#CE_UM">Bacacheri</reg></choice></name> hinaus derselbe als nach <name type="geographic">Borda do Campo</name>
<lb/> oder <name type="geographic">Paranagua</name>; weiter hin lenkt er links ab und geht 
</ab></div>
<pb facs="http://gbif.naturkundemuseum-berlin.de/CDV2018/Sellow/ZM_S_I_Sellow_Exk_11_4_v__2496.tif" n="04_v" xml:id="ZM_S_I_Sellow_Exk_11_04_v"/>
<div><head>Seite 04, verso (Bericht 11)</head><ab corresp="#ZM_S_I_Sellow_Exk_11_04_v">
<lb/> bald in Wald ein, welcher kleine <name type="object">Campestres</name> einschließt<supplied reason="omitted-in-original" resp="#CE_UM">.</supplied>
<lb/> Wo man circa 3 L<supplied reason="omitted-in-original" resp="#CE_UM">egoa</supplied> von der Villa durch den <name type="geographic">Rio Atuba ? </name>
<lb/> kommt<supplied reason="omitted-in-original" resp="#CE_UM">,</supplied> läßt man einen nicht unansehnlichen Hof am Wege. 
<lb/> Von hier aus wird das Land hochhüglig und die Waldung 
<lb/> dichter<supplied reason="omitted-in-original" resp="#CE_UM">.</supplied> Eine kleine Legoa weiter gelangt man aufs 
<lb/> Neue in <name type="object">Campestres</name> zunächst in das <name type="geographic">Campo camprido</name>. 
<lb/> Hier wurde ich von der Nacht überfallen und war froh<supplied reason="omitted-in-original" resp="#CE_UM">,</supplied>
<lb/> hier eine Hütte anzutreffen. Der Herr derselben machte 
<lb/> anfangs einige Schwierigkeiten uns einzulassen, allein 
<lb/> wir beseitigten sie, und ich sah bald ein, daß nicht sowohl böser 
<lb/> Wille sie veranlaßt, sondern die Besorgniß<supplied reason="omitted-in-original" resp="#CE_UM">,</supplied> eine 
<lb/> allzu schlechte Herberge herzugeben. Das Innere der 
<lb/> Hütte hatte keine Abtheilung; es war schon ein Gast vor-
<lb/> handen, und den noch entbehrlichen Raum hatte man einer 
<lb/> kranken Kuh abgetreten, in der Mitte auf dem Boden 
<lb/> unterhält man ein Feuer, wodurch der ganze Raum mit 
<lb/> Rauch erfüllt wurde. Man brachte die Kuh in ein nahes 
<lb/> Gebüsch, rückte eine alte Bettstelle an den Platz 
<lb/> und bereitete mir ein Bett mit meiner Satteldecke, 
<lb/> und einige Eier gaben ein reinliches Abendbrodt. 
<lb/> Der Hausherr war einer der Surgenten des <choice><orig/><reg resp="#CE_UM">Bairro</reg></choice><supplied reason="omitted-in-original" resp="#CE_UM">,</supplied>
<lb/> dem der <name type="ethnicity_group">Cap<hi rendition="#sup"><supplied reason="omitted-in-original" resp="#CE_UM">ita</supplied>m</hi> Mor</name> durch meinen <name type="ethnicity_group">Vaqueiro</name> auftragen ließ<supplied reason="omitted-in-original" resp="#CE_UM">,</supplied>
<lb/> dafür zu sorgen, daß der Pfad zur Höhle, wenn er 
<lb/> verwachsen sein sollte, geöffnet würde. Er begleitete 
<lb/> uns daher am nächsten Morgen. Wir gelangten 
<lb/> bald in das Gebiet des <name type="geographic"><choice><orig>Capivary </orig><reg resp="#CE_UM">Rio Capivari</reg></choice></name><supplied reason="omitted-in-original" resp="#CE_UM">,</supplied> dessen allgemeiner 
<lb/> Lauf gen h 4 NO geht und welcher nördlich von der<name type="geographic"> S<supplied reason="omitted-in-original" resp="#CE_UM">err</supplied><hi rendition="#sup">a</hi>
<lb/> dos Orgãos</name> hinab fließt, worauf er sich mehr nach N 
<lb/> wendet<supplied reason="omitted-in-original" resp="#CE_UM">,</supplied> um sich mit dem <name type="person"><choice><orig> Rio do Ribeira</orig> <reg resp="#CE_UM">Rio Ribeira</reg></choice> oder Acunguy</name>
<lb/> zu vereinigen. Fast ohne es zu bemerken gelangt 
<lb/> man hier über die Wasserscheide zwischen ihm und dem 
<lb/> <name type="geographic"><choice><orig>Yguacú </orig><reg resp="#CE_UM">Iguaçú</reg></choice></name>, jedoch wird das Land sofort bergig. Wo wir 
<lb/> ihn durchschritten<supplied reason="omitted-in-original" resp="#CE_UM">,</supplied> hat er 20 Sch<supplied reason="omitted-in-original" resp="#CE_UM">ritt</supplied> Breite bei 6 – 8'' Tiefe. 
<lb/> Viel <name type="plant"><choice><orig>Chachi </orig><reg resp="#CE_UM">Chachí bravo</reg></choice><note resp="#CE_UM" type="orig"><term>Alsophila setosa</term></note><note resp="#CE_UM" type="editorial">Baumfarn</note></name> wachsen in dieser Gegend, welche zugleich auch 
<lb/> reich an <name type="plant">Taquara</name> ist. Wir kamen an einer Menge 
<lb/> kleiner mit Stroh gedeckter Wohnungen vorüber, 
<lb/> zumal in den kleinen <name type="object">Campestres</name><supplied reason="omitted-in-original" resp="#CE_UM">,</supplied> durch die der Weg führt<supplied reason="omitted-in-original" resp="#CE_UM">.</supplied>
<lb/> <name type="person">Eine eigene Manier Papageien zu erlegen<supplied reason="omitted-in-original" resp="#CE_UM">,</supplied> besonders Coralleiros <note resp="#CE_UM" type="orig"><term>Amazona vinacea</term></note><supplied reason="omitted-in-original" resp="#CE_UM">,</supplied>
<lb/> wovon in dieser Jahreszeit große Schwärme anwesend 
<lb/> und welche um die Maiserndte sehr fett sind, sah ich </name>
</ab></div>
<pb facs="http://gbif.naturkundemuseum-berlin.de/CDV2018/Sellow/ZM_S_I_Sellow_Exk_11_5_r__2497.tif" n="05_r" xml:id="ZM_S_I_Sellow_Exk_11_05_r"/>
<div><head>Seite 05, recto (Bericht 11)</head><ab corresp="#ZM_S_I_Sellow_Exk_11_05_r">
<lb/> <name type="person">hier üblich welche wahrscheinlich noch von den Wilden herstammt. 
<lb/></name> Der Jäger macht sich von Zweigen eine kleine gewölbte 
<lb/> Hütte<supplied reason="omitted-in-original" resp="#CE_UM">,</supplied> neben welche er einen mit einigen Haken versehenen 
<lb/> Pfahl steckt, auf diesen setzt er einen zahmen angebun-
<lb/> denen <name type="person">Coralleiro </name>und stellt sich mit einem kleinen Bogen 
<lb/> und Pfeilen versehen in der Hütte an; bald kommen wilde 
<lb/> Papageien herbei<supplied reason="omitted-in-original" resp="#CE_UM">,</supplied> um sich zu jenem zu gesellen, die er <note resp="#CE_UM" type="editorial">der Jäger</note> dann 
<lb/> ganz aus der Nähe und ohne Geräusch herabschießt. Das Laub 
<lb/> des <name type="plant">Chachi</name> schickt sich vortrefflich zu diesen Hütten und die 
<lb/> hiesigen bestanden meistens daraus. Nachdem wir circa 
<lb/> 2 Legoas zurückgelegt<supplied reason="omitted-in-original" resp="#CE_UM">,</supplied> befanden wir uns bei der Höhle<supplied reason="omitted-in-original" resp="#CE_UM">,</supplied> welche 
<lb/> unter dem Namen <name type="person">Hermida do Arrayal queimado</name> bekannt 
<lb/> ist. Der Kalkstein<supplied reason="omitted-in-original" resp="#CE_UM">,</supplied> in welchem sie liegt<supplied reason="omitted-in-original" resp="#CE_UM">,</supplied> ist von der- 
<lb/> selben Formatiom als der am <name type="person">Maiana</name> und diesem 
<lb/> vollkommen gleich. Er bildet hier einen sanft ansteigen-
<lb/> den Hügel<supplied reason="omitted-in-original" resp="#CE_UM">,</supplied> welcher an 150 Fuß Höhe haben mag und zum 
<lb/> Theil nur mit Hochwald bewachsen, zum Theil zu <seg type="agriculture_crafts">Maispflan-
<lb/> zung</seg> benutzt war. Diesmal durchströmt, von W gen Ost, 
<lb/> ein Bach, von circa 12 Schritte Breite und 1 Fuß Tiefe (trotz 
<lb/> des trockenen Wetters<supplied reason="omitted-in-original" resp="#CE_UM">,</supplied> welches wir gehabt hatten), welcher 
<lb/> ohne Zweifel wenigstens beigetragen hat<supplied reason="omitted-in-original" resp="#CE_UM">,</supplied> diese Höhle zu 
<lb/> vergrößern, und welcher unter dem Namen <name type="person">Ribeirao 
<lb/> do Ermida</name> in den <name type="geographic">Capivary</name> geht. Das Gewölbe<supplied reason="omitted-in-original" resp="#CE_UM">,</supplied> welches er 
<lb/> durchströmt<supplied reason="omitted-in-original" resp="#CE_UM">,</supplied> hat bei 122 Klafter Länge<supplied reason="omitted-in-original" resp="#CE_UM">,</supplied> 5 – 8 Klafter Höhe und 
<lb/> gewährt den bequemsten Eingang und liegt denen von 
<lb/> <name type="geographic">Curitiba</name> kommenden am nächsten. Sie ist auch am meisten 
<lb/> verziert und gewährt den interessantesten Anblick<supplied reason="omitted-in-original" resp="#CE_UM">.</supplied>
<lb/> Der Kalkfels ist hier steil abgeschossen und stellt 
<lb/> eine in St<supplied reason="omitted-in-original" resp="#CE_UM">unde</supplied> 6 streichende senkrechte Wand dar von 
<lb/> 9 – 10 Klafter Höhe. Der Bogen der Pforte ist vom 
<lb/> Bache aus gerechnet 5 Klafter hoch und oben bei 
<lb/> 7 Klafter breit, allein theils durch Muttergestein, theils 
<lb/> durch Stalaktiten ist die Pforte so verengt<supplied reason="omitted-in-original" resp="#CE_UM">,</supplied> daß sie an 
<lb/> der schmalsten Stelle nur wenig über 2 Klafter Breite 
<lb/> hat und vom Grunde des Bachs zur längsten aus 
<lb/> dem Bogen herabhangenden Stalaktitenmasse auf 
<lb/> nur wenig mehr als 2 Klafter absteht. Der Bach<supplied reason="omitted-in-original" resp="#CE_UM">,</supplied>
<lb/> welcher fast die ganze Höhle in der 6<hi rendition="#sup">ten</hi> St<supplied reason="omitted-in-original" resp="#CE_UM">unde</supplied> durchflossen, wen- 
<lb/> det sich<supplied reason="omitted-in-original" resp="#CE_UM">,</supplied> ehe er durch diese Pforte heraus geht<supplied reason="omitted-in-original" resp="#CE_UM">,</supplied> gerade plötzlich 
</ab></div>
<pb facs="http://gbif.naturkundemuseum-berlin.de/CDV2018/Sellow/ZM_S_I_Sellow_Exk_11_5_v__2498.tif" n="05_v" xml:id="ZM_S_I_Sellow_Exk_11_05_v"/>
<div><head>Seite 05, verso (Bericht 11)</head><ab corresp="#ZM_S_I_Sellow_Exk_11_05_v">
<lb/> nach St<supplied reason="omitted-in-original" resp="#CE_UM">unde</supplied> 1 N. und bald nach seinem Austritt rieselt 
<lb/> er über eine kleine Staffel hinab. Gleich vor der Höhle 
<lb/> steigen seine Ufer sanft an und sind mit kräftiger 
<lb/> Waldung bewachsen. Hohe <name type="person">Lorbers</name><name type="plant">tämme</name><supplied reason="omitted-in-original" resp="#CE_UM">,</supplied> welche sich unter 
<lb/> andern Laubhölzern auszeichnen, Baumfarne, die 
<lb/> hiesige Dracena und zwischen ihnen <name type="person">Bogenwerfende Bam- 
<lb/> busstengel</name> verzieren die Pforte. Da der Bach die gan- 
<lb/> ze Schwelle bedeckt<supplied reason="omitted-in-original" resp="#CE_UM">,</supplied> so muß man sich<supplied reason="omitted-in-original" resp="#CE_UM">,</supplied> um trockenen 
<lb/> Fußes hinein zu gelangen<supplied reason="omitted-in-original" resp="#CE_UM">,</supplied> durch unförmliche Säulen 
<lb/> hindurch drängen<supplied reason="omitted-in-original" resp="#CE_UM">,</supplied> welche den östlichen Theil der Pforte 
<lb/> verengen und man hat vom Bache aus ziemlich steil 
<lb/> zu ihnen hinan zu steigen. Der Anblick des Inneren ist 
<lb/> wegen der Größe des Gewölbes und des schönen Bachs viel 
<lb/> eindrücklicher als in der Höhle von <name type="person">Maianá</name><supplied reason="omitted-in-original" resp="#CE_UM">,</supplied> welche 
<lb/> im Vergleich zu dieser nur klein ist, wenngleich diese nicht 
<lb/> so viele zierliche Säulen aufzuweisen hat. Von der 
<lb/> Decke hangen wie dort zahllose Stalaktiten herab<supplied reason="omitted-in-original" resp="#CE_UM">.</supplied>
<lb/> Die Ufer des Bachs sind am Eingang bei 3 Klafter 
<lb/> hoch und steil abgestürzt und zum Theil überhangend, 
<lb/> nach dem Inneren zu senken sie sich allmälig bis 
<lb/> zum Niveau des Bachs. Auf eine beträchtliche 
<lb/> Strecke vom Eingang aus sind sie mit größeren und 
<lb/> kleineren Stalakmiten besetzt, welche bald Säulen 
<lb/> bald Pfeiler von verschiedenen Formen vorstellen. 
<lb/> Besonders reich daran ist das linke Ufer, wo sie 
<lb/> so eng stehen<supplied reason="omitted-in-original" resp="#CE_UM">,</supplied> daß man nur mit Mühe hie und da 
<lb/> sich durchdrängen kann, wogegen das rechte Ufer 
<lb/> einen geräumigen nicht unbequemen Pfad dar- 
<lb/> bietet; zu beiden Seiten bemerkt man Seiten-
<lb/> kammern und Schlupfwinkel. Wo die Ufer nicht mehr 
<lb/> prallig sind<supplied reason="omitted-in-original" resp="#CE_UM">,</supplied> sieht man die durch den Bach abgesetzten 
<lb/> Geschiebe, welche größtentheils abgerundete schwärz- 
<lb/> lich überzogene Quarzstücke sind<supplied reason="omitted-in-original" resp="#CE_UM">,</supplied> durch Tropfstein Masse 
<lb/> zusammen gekittet. Die Wände sind wie in der <name type="person">Maiana</name>
<lb/> Höhle häufig mit Dendriten bekleidet<supplied reason="omitted-in-original" resp="#CE_UM">,</supplied> dazu trifft 
<lb/> man hier<supplied reason="omitted-in-original" resp="#CE_UM">,</supplied> besonders fast in der Mitte der Höhle<supplied reason="omitted-in-original" resp="#CE_UM">,</supplied> an 
<lb/> der rechten oder südlichen Wand ein wun-
<lb/> derliches Gebilde von kleinen Bassins<supplied reason="omitted-in-original" resp="#CE_UM">,</supplied> welche ein 
<lb/> klares Wasser enthalten. Sie liegen hier mannig- 
<lb/> faltig in einander greifend auf ansteigender Fläche 
<lb/> übereinander mit meistens ondulirten Wänden<supplied reason="omitted-in-original" resp="#CE_UM">.</supplied>
<lb/> Die Außenseite der Wände<supplied reason="omitted-in-original" resp="#CE_UM">,</supplied> zumal der Rand<supplied reason="omitted-in-original" resp="#CE_UM">,</supplied> sind voll-
<lb/> kommen glatt, die inneren hingegen mit Dendriten dicht 
<lb/> <hi rendition="#r"> besetzt</hi>
</ab></div>
<pb facs="http://gbif.naturkundemuseum-berlin.de/CDV2018/Sellow/ZM_S_I_Sellow_Exk_11_6_r__2499.tif" n="06_r" xml:id="ZM_S_I_Sellow_Exk_11_06_r"/>
<div><head>Seite 06, recto (Bericht 11)</head><ab corresp="#ZM_S_I_Sellow_Exk_11_06_r">
<lb/> dicht besetzt. Im Grunde dieser kleinen Behälter<supplied reason="omitted-in-original" resp="#CE_UM">,</supplied> welche 
<lb/> meistens von 1 – 9 Fuß Länge bei ½ – 1 ½ Fuß Breite 
<lb/> auf 3 – 6 Zoll Tiefe haben<supplied reason="omitted-in-original" resp="#CE_UM">,</supplied> liegen Sphäroiden mit 
<lb/> rauher Oberfläche von der Größe einer Erbse bis zu der 
<lb/> eines Apfels, vollkommen frei. Das Wasser<supplied reason="omitted-in-original" resp="#CE_UM">,</supplied> welches 
<lb/> sie enthalten<supplied reason="omitted-in-original" resp="#CE_UM">,</supplied> ist gänzlich geschmack und geruchslos<supplied reason="omitted-in-original" resp="#CE_UM">.</supplied>
<lb/> Über die Mitte hinaus zeigt sich die Höhle weniger reich an 
<lb/> Tropfstein und im westlichsten Theile erscheint sie fast 
<lb/> <supplied reason="omitted-in-original" resp="#CE_UM">als</supplied> ein nacktes Gewölbe. Nach Zurücklegung von circa 55 
<lb/> Klaftern hat man circa 26 Klafter weit keinen anderen 
<lb/> Weg als das Bett des Bachs. Wo man wieder trocken 
<lb/> gehen kann<supplied reason="omitted-in-original" resp="#CE_UM">,</supplied> ist die Höhle durch eine sehr schief einhängende 
<lb/> Wand auf 4 Klafter Breite und 4 Klafter Höhe ver- 
<lb/> engt und der Bach hält sich hier an die rechte Wand. 
<lb/> Circa 15 Klafter von der westlichen Pforte verengt 
<lb/> sie sich auf eine Höhe von 2 Klafter bei 6 ¾ Klafter 
<lb/> Breite. Die westliche Pforte ist 12 ½ Klafter breit und 
<lb/> hat 8 ½ Kl<supplied reason="omitted-in-original" resp="#CE_UM">after</supplied> Höhe und eine Menge großer Felsblöcke 
<lb/> liegt auf ihrer Schwelle. Sie richtet sich nach 7. 4 W und 
<lb/> liegt auch in einer senkrecht abgestürzten Wand. 
<lb/> Die Thalgehänge<supplied reason="omitted-in-original" resp="#CE_UM">,</supplied> zwischen welchen der Bach hier ankommt<supplied reason="omitted-in-original" resp="#CE_UM">,</supplied> stei-
<lb/> gen steil an. In dem diesseitigen Abhange 
<lb/> dieses Hügels circa 60 – 70 Fuß über dem Bache und 
<lb/> circa 25 Schritte z<supplied reason="omitted-in-original" resp="#CE_UM">ur</supplied> Rechten oder südlich von dieser Pforte 
<lb/> liegt der Eingang zu einer anderen zwar nicht so 
<lb/> großen<supplied reason="omitted-in-original" resp="#CE_UM">,</supplied> aber auch sehr merkwürdigen an Tropfstein 
<lb/> bei weitem reichere Höhle als die beschriebene. 
<lb/> Der Eingang ist nicht völlig 1 Klafter breit und hat 
<lb/> vorn zwar 1 ½ Klafter Höhe; diese verringert sich 
<lb/> aber an der Mündung<supplied reason="omitted-in-original" resp="#CE_UM">,</supplied> noch ehe daß man<supplied reason="omitted-in-original" resp="#CE_UM">,</supplied> nicht ohne sich zu bücken<supplied reason="omitted-in-original" resp="#CE_UM">,</supplied> ins 
<lb/> Innere gelangen kann. Hier erweitert sie sich aber 
<lb/> sogleich wieder und hat im Allgemeinen 4 – 6 Klafter 
<lb/> Breite und eine ähnliche Höhe und ist an 78 Klafter lang, 
<lb/> in h. 6 streichend. Am interessantesten ist sie 
<lb/> gegen die Mitte hin, wo die Wände ungemein 
<lb/> schön verziert und wo sich auch einige sehr schöne 
</ab></div>
<pb facs="http://gbif.naturkundemuseum-berlin.de/CDV2018/Sellow/ZM_S_I_Sellow_Exk_11_6_v__2500.tif" n="06_v" xml:id="ZM_S_I_Sellow_Exk_11_06_v"/>
<div><head>Seite 06, verso (Bericht 11)</head><ab corresp="#ZM_S_I_Sellow_Exk_11_06_v">
<lb/> freistehende Säulen finden. Die zahrtesten Tropf- 
<lb/> steinbildungen findet man stets in den kleinen 
<lb/> Seitenkammern und Schlupfwinkeln. Das Östliche 
<lb/> Ende ist weniger geschmückt und auch beträchtlich 
<lb/> enger. Am merkwürdigsten ist dort der Punkt<supplied reason="omitted-in-original" resp="#CE_UM">,</supplied>
<lb/> wo eine sehr dünne Wand sich in schiefer Richtung 
<lb/> so einschiebt<supplied reason="omitted-in-original" resp="#CE_UM">,</supplied> daß eine Pforte über der anderen 
<lb/> gebildet wird, ein Gewölbe<supplied reason="omitted-in-original" resp="#CE_UM">,</supplied> welches man dreist 
<lb/> betreten kann. In die hinterste Kammer kann 
<lb/> man nur mit Mühe hinein kriechen. An vielen 
<lb/> Stellen tönt der Boden beim Auftreten<supplied reason="omitted-in-original" resp="#CE_UM">,</supplied> wo unten 
<lb/> hohl<supplied reason="omitted-in-original" resp="#CE_UM">,</supplied> und auch in der westlichen Hälfte senkt sich 
<lb/> ein Bach steil abschießend hinaus zur senkrecht 
<lb/> abgestürzten Wand<supplied reason="omitted-in-original" resp="#CE_UM">,</supplied> durch welches Tageslicht eindringen 
<lb/> kann. An mehreren Stellen lag etwas Lehmen 
<lb/> in der Höhle<supplied reason="omitted-in-original" resp="#CE_UM">,</supplied> vermuthlich durch Spalten von der Decke 
<lb/> des Hügels durch Wasser herabgeschlemmt. Tageslicht 
<lb/> kann nur auf eine sehr geringe Strecke in diese Höhle 
<lb/> dringen wegen der Enge ihres einzigen Eingangs<supplied reason="omitted-in-original" resp="#CE_UM">,</supplied>
<lb/> wogegen es in der unteren fast bis zur Mitte 
<lb/> hindämmert, während auch schon von W her eine schwache 
<lb/> Dämmerung eindringt. Je feuchter dergleichen Höhlen<supplied reason="omitted-in-original" resp="#CE_UM">,</supplied>
<lb/> je weniger dem Zudrange der Luft offen<supplied reason="omitted-in-original" resp="#CE_UM">,</supplied> desto freier 
<lb/> scheint die Bildung des Tropfsteins vor sich zu gehen. 
<lb/> Auch war derselbe hier größtentheils sehr rein und 
<lb/> weiß, wogegen der in der unteren und in der von 
<lb/> <name type="person">Maiana</name> durch hineingeweheten Staub von rothem 
<lb/> Lehmen an Stellen röthlich gefärbt war. Im Innern eines 
<lb/> ziemlich starken Stalakmiten fand ich verkapselte <name type="plant">Taquara</name><supplied reason="omitted-in-original" resp="#CE_UM">,</supplied> welche ohne Zweifel einst von der Fackel 
<lb/> eines diese Höhle Besuchenden ausgefallen und 
<lb/> nachmals überzogen worden war. Auch mir dienten 
<lb/> Bündel von aufgeschlagener trockener Taquara als Fackel<supplied reason="omitted-in-original" resp="#CE_UM">,</supplied>
<lb/> wiewohl nicht sehr genügend; mit guten Pechfackeln 
<lb/> versehen<supplied reason="omitted-in-original" resp="#CE_UM">,</supplied> würde man einen viel größeren Genuß 
<lb/> haben. Der Herr dieser Länderei hatte ganz in 
</ab></div>
<pb facs="http://gbif.naturkundemuseum-berlin.de/CDV2018/Sellow/ZM_S_I_Sellow_Exk_11_7_r__2501.tif" n="07_r" xml:id="ZM_S_I_Sellow_Exk_11_07_r"/>
<div><head>Seite 07, recto (Bericht 11)</head><ab corresp="#ZM_S_I_Sellow_Exk_11_07_r">
<lb/> in der Nähe eine Hütte<supplied reason="omitted-in-original" resp="#CE_UM">,</supplied> wo ich übernachtete und aufs freundlich-
<lb/> ste bewirthet wurde. Mehrere Nachbarn kamen herbei<supplied reason="omitted-in-original" resp="#CE_UM">,</supplied>
<lb/> um sich bei dieser Gelegenheit die Höhlen zu besehen<supplied reason="omitted-in-original" resp="#CE_UM">,</supplied>
<lb/> welche bei vielen sehr in Achtung stehen<supplied reason="omitted-in-original" resp="#CE_UM">,</supplied> so daß sie 
<lb/> gelegentlich in der großen Höhle Gebete verrichten 
<lb/> und dem unsichtbaren Heiligen derselben Gelübde ver-
<lb/> heißen. Die Leute dieser Gegend scheinen mir sehr 
<lb/> wohl zu leben und eine gute Gesundheit zu haben. 
<lb/> <seg type="medicine">Nirgends sahe ich hier Kröpfige, und die 2 Weiber mit 
<lb/> Kröpfen</seg><supplied reason="omitted-in-original" resp="#CE_UM">,</supplied> welche ich am <name type="person">Maiana</name> sahe<supplied reason="omitted-in-original" resp="#CE_UM">,</supplied> sollen dieselben 
<lb/> aus <name type="geographic">Sorocaba</name> mitgebracht haben. Die <name type="object">Campestres</name>
<lb/> sind hier nur beschränkt<supplied reason="omitted-in-original" resp="#CE_UM">,</supplied> allein in den schon vorhan-
<lb/> denen großen <name type="object">Capoeiras</name> findet sich reichlich Futter 
<lb/> für Milchkühe und Pferde oder Maulthiere. 
<lb/> Auch hier ist die Preparation der Herva ein Haupt- 
<lb/> geschäft und die Verständigeren fangen an sich <name type="object">Hervaos</name>
<lb/> zu bilden. Das Solanum pseudoquina kennt man 
<lb/> hier allgemein und hält es in Ehren, wie eine <name type="plant">Rubia- 
<lb/> cea</name> ebenfalls als <name type="person"><choice><orig>China </orig><reg resp="#CE_UM">Chinarinde</reg></choice></name><supplied reason="omitted-in-original" resp="#CE_UM">,</supplied> welche man mir hier 
<lb/> zeigte. Ein <name type="plant">Cynanchium</name><supplied reason="omitted-in-original" resp="#CE_UM">,</supplied>dem sehr ähnlich<supplied reason="omitted-in-original" resp="#CE_UM">,</supplied> welches 
<lb/> bei den <name type="person">Orientaes Tasi</name> heißt<supplied reason="omitted-in-original" resp="#CE_UM">,</supplied> wird hier als Hanpf 
<lb/> benutzt. Am <name type="person">Ribeirao do Hermida</name> stand am 
<lb/> <hi rendition="#et"><seg type="measurement-data">21 das ☿ a/c/g 12 25 8 44 29 0 84. Wolkig W<supplied reason="omitted-in-original" resp="#CE_UM">ind</supplied> N scharf</seg></hi>
<lb/> Ich kehrte auf einem kleinen Umwege zur 
<lb/> Villa zurück<supplied reason="omitted-in-original" resp="#CE_UM">,</supplied> indem ich hoffte, mich von einem Berge<supplied reason="omitted-in-original" resp="#CE_UM">,</supplied>
<lb/> welcher hier <name type="person">Moro da Volta</name> heißt<supplied reason="omitted-in-original" resp="#CE_UM">,</supplied> noch besser in der 
<lb/> Gegend umsehen zu können. Leider begünstigte 
<lb/> die Witterung meine Absicht nicht. Auf dem 
<lb/> Gipfel dieses Berges<supplied reason="omitted-in-original" resp="#CE_UM">,</supplied> welcher mit <name type="object">Campo</name> bedeckt ist<supplied reason="omitted-in-original" resp="#CE_UM">,</supplied>
<lb/> <seg type="measurement-data">stand das ☿ um 23 ¾ a/c/g 15.7 25 4 69 28 10 60 Wolkig</seg>
<lb/> W h 11 N frisch. In der Nähe liegen höhere 
<lb/> Berge als dieser zumal gen N und W hin. Die 
<lb/> Menge Quarzstücke<supplied reason="omitted-in-original" resp="#CE_UM">,</supplied> welche auf seinem Abhange 
<lb/> umherlagen<supplied reason="omitted-in-original" resp="#CE_UM">,</supplied> scheinen zu bezeigen<supplied reason="omitted-in-original" resp="#CE_UM">,</supplied> daß er aus 
<lb/> jenem Grauwackensandstein der Gegend am <name type="person">Maia- na</name> bestehe. Ich zweifle nicht<supplied reason="omitted-in-original" resp="#CE_UM">,</supplied> daß jene Formation 
</ab></div>
<pb facs="http://gbif.naturkundemuseum-berlin.de/CDV2018/Sellow/ZM_S_I_Sellow_Exk_11_7_v__2502.tif" n="07_v" xml:id="ZM_S_I_Sellow_Exk_11_07_v"/>
<div><head>Seite 07, verso (Bericht 11)</head><ab corresp="#ZM_S_I_Sellow_Exk_11_07_v">
<lb/> sich bis hier her erstreckt<supplied reason="omitted-in-original" resp="#CE_UM">,</supplied> obschon ich nirgends hier 
<lb/> auf dem ganzen Wege Gestein anstehend fand. 
<lb/> Der <name type="geographic">Capivary</name> streicht am nörd<supplied reason="omitted-in-original" resp="#CE_UM">lichen</supplied> Fuß dieses Berges 
<lb/> vorbei gen NO in h. 4. Die <name type="object">Ermida</name> liegt von diesem 
<lb/> Punkt h. 8 4 NW ungefähr ½ L<supplied reason="omitted-in-original" resp="#CE_UM">egoa</supplied> ab. 
<lb/> Der <name type="person">Serra do Pedra branca</name> am <name type="geographic">Borda do Campo</name> 125 M. 
<lb/> Der höchste Gipfel des <name type="person">S<supplied reason="omitted-in-original" resp="#CE_UM">err</supplied><hi rendition="#sup">a</hi> da Maicatira</name> von dort 
<lb/> ab 20°18' D. Sept. der <name type="person">S<supplied reason="omitted-in-original" resp="#CE_UM">err</supplied>a de Putuna</name> 97º 10 <name type="person">S<supplied reason="omitted-in-original" resp="#CE_UM">err</supplied><hi rendition="#sup">a</hi> de 
<lb/> S Anna</name> (Mitte) 29º 13. Der <name type="person">Moro de Butiatumiri</name>
<lb/> 254 30 M. Zu <name type="geographic">Curitiba</name><supplied reason="omitted-in-original" resp="#CE_UM">,</supplied> wo ich noch vor Abend 
<lb/> anlangte<supplied reason="omitted-in-original" resp="#CE_UM">,</supplied> stand um h 6. <seg type="measurement-data">a/c/g 19 25 7 2 29 0 2 N</seg> scharf. 
</ab></div>
</body>
</text>
</TEI>