ID,A,Certificate
ALICE,48038,"b""x{\xa8\xb8\xfc!(\xf7\xf5\xb4\xc7/\xd5DY4&\xd4\x95\xb1>\x90D\x96`\xc7m\xd8\xcagC\x14v\xd9-\xa1m'\xac\x14|\xf5\xa7\xb6`\xae\xb4\x1b\x87\xbd\xd0%\x123\x14\xcczW\xc9U\x9aw\x81\xc7=n\xd8\xc9#\x8e\xf1K\xc1q\x93\xe3\n\xec\xf8?\xc3Q\xae\x12\xf3\x95\xca\x1f\xdb\xb9vB\x0b\x82/\xaf\xa4\x8e91\xa6{l\xefK\x86\x15sT\xb9\x8dU<\xd1J\xcf\xd1$\x8d\xbf\xe11\x87\xc7/\xe26\n"""
Uli,15857,"b""8\xd0\xd1\xfc]\x95\xb2Wb.\x80I_\xdce\xf4w8\xb8\x9f\x92/od\xde\x82\x14\x0c6E8\xbb\xe9\x1c\xc5a&\xac,B\xa1\x1a\xb0\x9f\xbf\xc9\xec&W\xfa\x8a\xbc-\x81\r\x07\xf7P\xe6t\x1d\xc1\xeb\xba\xa7\x80'F\xd1T\x89%\x03\xfb \x84\x0f_l\xa2\xd4\x0f\x9f\xdfv\xb7\x82EX\x9f\xe5ww}_\xda\xec@HO\xde\x8a1\xc2g\x04\xd6\x9f:I\xed\xb0\x83\x14\r\t'\xeb\xff\xa5A\r\x94\xe3\xb2\xb0\xab\x01"""
