episodes,steps,rewards
0,200,-200.0
1,200,-200.0
2,200,-200.0
3,200,-200.0
4,200,-200.0
5,200,-200.0
6,200,-200.0
7,200,-200.0
8,200,-200.0
9,200,-200.0
10,200,-200.0
11,200,-200.0
12,200,-200.0
13,200,-200.0
14,200,-200.0
15,200,-200.0
16,200,-200.0
17,200,-200.0
18,200,-200.0
19,200,-200.0
20,200,-200.0
21,200,-200.0
22,200,-200.0
23,200,-200.0
24,200,-200.0
25,200,-200.0
26,200,-200.0
27,200,-200.0
28,200,-200.0
29,200,-200.0
30,200,-200.0
31,200,-200.0
32,200,-200.0
33,200,-200.0
34,200,-200.0
35,200,-200.0
36,200,-200.0
37,200,-200.0
38,200,-200.0
39,200,-200.0
40,200,-200.0
41,200,-200.0
42,200,-200.0
43,200,-200.0
44,200,-200.0
45,153,-153.0
46,200,-200.0
47,200,-200.0
48,200,-200.0
49,200,-200.0
50,142,-142.0
51,167,-167.0
52,200,-200.0
53,200,-200.0
54,200,-200.0
55,173,-173.0
56,200,-200.0
57,132,-132.0
58,127,-127.0
59,141,-141.0
60,132,-132.0
61,145,-145.0
62,156,-156.0
63,153,-153.0
64,160,-160.0
65,157,-157.0
66,184,-184.0
67,139,-139.0
68,155,-155.0
69,182,-182.0
70,200,-200.0
71,181,-181.0
72,141,-141.0
73,148,-148.0
74,145,-145.0
75,172,-172.0
76,158,-158.0
77,148,-148.0
78,156,-156.0
79,200,-200.0
80,200,-200.0
81,160,-160.0
82,156,-156.0
83,200,-200.0
84,172,-172.0
85,200,-200.0
86,200,-200.0
87,172,-172.0
88,200,-200.0
89,195,-195.0
90,171,-171.0
91,166,-166.0
92,200,-200.0
93,145,-145.0
94,182,-182.0
95,145,-145.0
96,147,-147.0
97,183,-183.0
98,138,-138.0
99,195,-195.0
100,159,-159.0
101,173,-173.0
102,200,-200.0
103,180,-180.0
104,158,-158.0
105,142,-142.0
106,149,-149.0
107,150,-150.0
108,180,-180.0
109,200,-200.0
110,94,-94.0
111,142,-142.0
112,193,-193.0
113,141,-141.0
114,151,-151.0
115,154,-154.0
116,129,-129.0
117,160,-160.0
118,177,-177.0
119,145,-145.0
120,153,-153.0
121,146,-146.0
122,151,-151.0
123,200,-200.0
124,117,-117.0
125,171,-171.0
126,148,-148.0
127,197,-197.0
128,181,-181.0
129,122,-122.0
130,140,-140.0
131,200,-200.0
132,142,-142.0
133,111,-111.0
134,124,-124.0
135,120,-120.0
136,166,-166.0
137,200,-200.0
138,139,-139.0
139,200,-200.0
140,200,-200.0
141,200,-200.0
142,120,-120.0
143,181,-181.0
144,153,-153.0
145,126,-126.0
146,89,-89.0
147,143,-143.0
148,150,-150.0
149,154,-154.0
150,155,-155.0
