episodes,steps,rewards
0,73,-85.89887156051812
1,57,-105.72964371832664
2,100,-218.90115293636904
3,94,-128.88321466242107
4,106,-136.06311017243226
5,71,-97.80433057792835
6,120,-143.63243026388585
7,125,-154.46892738791848
8,74,-70.721861237622
9,85,-145.48430401947627
10,67,-181.47823898596732
11,117,-436.17378606595014
12,112,-235.93413998170487
13,85,-173.5022187431758
14,118,-41.13066056377676
15,118,-456.79247472696863
16,84,-554.1635129699673
17,94,-287.93732969124585
18,278,-106.98484534172505
19,326,-134.655859820351
20,196,-192.24711177221167
21,252,-168.16619512396795
22,356,-95.13568218145022
23,260,-162.94937072145092
24,282,-221.76892426658185
25,622,-347.8471624831295
26,140,-126.39590519863877
27,138,-132.36338357051758
28,195,-223.44600302416484
29,374,-214.52145473192246
30,592,-187.62391560579786
31,336,-111.15099948332316
32,255,-206.6693936970173
33,304,-152.12685394353656
34,149,-79.54970900650227
35,101,-131.9367411113343
36,423,-223.59128309429298
37,182,-261.71964450425673
38,210,-167.72245327092298
39,1000,-141.393639968478
40,279,-196.69475998858147
41,349,-205.80416326088007
42,224,-194.21386715332557
43,1000,-58.55822882540553
44,1000,-96.50205987956035
45,1000,-124.67091014825219
46,1000,-68.66950000676624
47,1000,-89.35879287089318
48,1000,-45.86758465418235
49,1000,-49.72922760163403
50,1000,-70.0256051909393
51,1000,-90.89205440286348
52,1000,-68.57621318959646
53,1000,-20.745537869773106
54,1000,-40.593802513975355
55,1000,-40.99811903405563
56,1000,-68.70436511516833
57,1000,-83.16673739601964
58,1000,-64.33592088975011
59,1000,-104.4282671446425
60,789,-176.59651634633042
61,716,-136.69972368731234
62,961,-214.97587435905766
63,243,-625.0775383347775
64,853,-194.40974956348413
65,688,-175.4697896119941
66,449,-129.20299467283516
67,254,-115.27415256933135
68,1000,-129.82292902159008
69,271,-240.99098808972076
70,1000,-132.34141806976203
71,1000,-83.81983574906405
72,421,-335.60747099821424
73,1000,-93.02649962185826
74,780,-482.501550230733
75,580,-169.87568686365285
76,1000,-96.11196073302781
77,1000,-115.53590191988535
78,1000,-41.489800074792335
79,556,-169.4479842205522
80,1000,-142.65689023032
81,1000,-55.32215060802997
82,1000,-100.61384001923805
83,1000,-155.2699974687204
84,283,-226.24693008485764
85,1000,-95.61775304191693
86,1000,-104.47165923184967
87,1000,-57.06772238985819
88,1000,-32.311704113815665
89,1000,-61.778468265681724
90,1000,-60.49780951091914
91,1000,-91.70003571662477
92,464,-236.87069062552123
93,1000,-64.17833982943786
94,1000,-75.36759537458039
95,1000,-54.6707125059728
96,1000,-46.57357276787247
97,1000,-65.53977443931805
98,1000,-65.46126153809068
99,556,141.33095918815275
100,1000,-257.5735919340636
101,238,-66.90761431936178
102,1000,-14.121930127023315
103,1000,-124.48603975021848
104,697,175.10348687975946
105,1000,-91.99614128045125
106,904,113.49472584301031
107,908,126.49616514486824
108,406,-84.9041137189989
109,1000,-45.552959825983514
110,1000,-3.6958473750317484
111,1000,-60.72149892915601
112,662,-113.41951200057305
113,1000,-113.66085951383256
114,1000,-100.542377165627
115,1000,-74.87233490503176
116,1000,-61.04745400087013
117,819,-101.67080000317502
118,1000,-129.08221696437278
119,1000,-56.13843900390906
120,1000,-153.86956410990038
121,1000,-75.33527658978713
122,1000,-69.43247632013282
123,1000,-167.73414647405968
124,1000,-81.77656818000355
125,417,187.73985541833738
126,414,139.6002093189976
127,393,-62.99057936325388
128,1000,-72.73894648459613
129,225,-34.579156164379626
130,347,-28.152220290014654
131,355,-90.69355088114973
132,1000,-67.38566658011037
133,1000,-73.99387796911454
134,1000,-155.96645343963354
135,216,-83.87646821239485
136,460,110.62936819041167
137,1000,-164.5500302669254
138,1000,-85.21380997992863
139,1000,-106.03953035774336
140,1000,-69.8433325850218
141,1000,-125.62797970042378
142,1000,-134.99180213972767
143,1000,-50.17636771269262
144,1000,-180.7231468356885
145,1000,-53.09939827859275
146,1000,-95.17700720225753
147,1000,-35.51810433997705
148,185,-111.65834834459453
149,1000,-80.70033752484315
150,1000,-62.93391107929878
151,308,-103.99687461711507
152,1000,-64.56091904054934
153,1000,-71.46728608434566
154,1000,-5.109517802417098
155,1000,-28.470895713488357
156,1000,-9.188538294443752
157,1000,-45.3213278256802
158,1000,-42.93527094049444
159,1000,-17.996098389053333
160,1000,-60.488540841904694
161,1000,-109.96596356452203
162,1000,-104.60775634991144
163,1000,-26.66766354592409
164,1000,-26.58730918936488
165,247,-13.857098625811503
166,1000,-101.71649930546869
167,1000,-51.93029298867937
168,1000,-52.2226488802295
169,1000,-9.293625422545558
170,1000,-34.39925672211809
171,256,-65.51206745315372
172,325,201.3403318533421
173,484,-74.96239972791521
174,1000,-39.47519664426328
175,989,-308.0772063759367
176,1000,-21.826367032657892
177,1000,-54.24148670154243
178,1000,-42.14023918349302
179,1000,-140.26717517339003
180,1000,-82.49434911890103
181,898,-89.55736012501451
182,1000,-49.77829154806591
183,417,192.0762531159145
184,1000,-50.68497778837574
185,1000,-56.47044100180371
186,1000,-34.278249494548746
187,1000,-79.53382248481417
188,501,-258.9069042942391
189,1000,-75.07576676119862
190,1000,-96.77652615956491
191,1000,-65.98323917546902
192,1000,-122.21187213746646
193,1000,-31.151480240867862
194,577,-115.58321897058669
195,1000,-81.03499857323334
196,1000,18.19259922018248
197,1000,-40.46709616903203
198,1000,23.521293411953515
199,1000,-8.664540723971944
200,1000,-14.084041016577153
201,1000,-49.959636763211236
202,1000,-9.243377112078003
203,1000,-66.45288494360871
204,1000,-115.19125649546656
205,608,-194.51421919263473
206,1000,-112.90009251898886
207,1000,-50.262892366667906
208,510,-166.94100022621853
209,1000,-7.521418165573514
210,1000,-50.63541486533578
211,1000,-48.51494499034128
212,1000,-81.34724477993787
213,1000,-144.30378371305673
214,1000,-20.821207488055727
215,1000,-78.78090829888966
216,1000,-60.00515278336274
217,1000,116.48989591086878
218,1000,-55.20902045478415
219,1000,-78.66668447396272
220,1000,-5.424990496039201
221,1000,-13.062727936791813
222,1000,-118.06520522045462
223,1000,-20.87297376768096
224,1000,-10.771706112529895
225,572,-193.68308839096187
226,1000,-63.35486233219119
227,1000,-95.63324012618806
228,1000,-4.2876216034890895
229,1000,9.886003693746552
230,1000,-65.09744978863239
231,193,-425.3249623773577
232,556,-385.5007959658665
233,1000,-92.08359214949749
234,861,108.82595419331818
235,1000,-39.69080828815647
236,1000,9.032544131964427
237,322,210.10285498298123
238,407,193.92656249954712
239,1000,-29.102651120175103
240,1000,8.733637036403913
241,1000,-53.85574319873159
242,1000,-23.10181570604569
243,815,158.421931679148
244,1000,-52.14743204965666
245,1000,16.682737457028058
246,1000,-10.31357795908933
247,929,110.37945433608085
248,1000,-18.936232630803225
249,1000,-20.914587515740372
250,1000,-12.093566485553898
251,1000,-25.170500691164087
252,487,-33.66518483352448
253,289,238.60865257033026
254,339,-45.47514629196522
255,1000,-28.897111036262103
256,1000,-33.26665262162864
257,1000,2.473160253808138
258,1000,-24.881973331599635
259,1000,-24.70090843574816
260,1000,-53.37137709544978
261,1000,-48.23701509043213
262,1000,9.62309151794819
263,1000,47.829457666567116
264,1000,-35.29693970491656
265,189,-79.2886559912499
266,1000,-24.964287902735048
267,160,-92.32673397644902
268,155,-84.5038455100214
269,1000,76.0027855479082
270,934,130.6703710149425
271,367,218.21131978781028
272,773,136.12027235568775
273,367,272.61266439774727
274,691,197.4630681343445
275,601,244.05956772311137
276,547,214.9833674720623
277,1000,-17.951635519274618
278,1000,-21.575363501799995
279,337,236.4474469978841
280,321,-136.77246410940967
281,268,244.1914952801107
282,1000,-55.18875306413671
283,1000,-46.53263026599534
284,718,123.16671745034125
285,393,224.42236895145894
286,475,-155.68093796459107
287,906,174.3300691583593
288,1000,-14.178003066596503
289,500,216.37508515514406
290,256,241.0064674881184
291,482,264.7444031963186
292,358,229.992451028773
293,714,127.48354624190642
294,730,-164.1555330780883
295,340,219.3403626683308
296,339,249.654350826135
297,316,209.30403035763592
298,472,204.70507710563805
299,1000,-22.127517406546193
300,553,-286.2210453881752
