episodes,steps,rewards
0,200,-200.0
1,200,-200.0
2,200,-200.0
3,200,-200.0
4,200,-200.0
5,200,-200.0
6,200,-200.0
7,200,-200.0
8,200,-200.0
9,200,-200.0
10,200,-200.0
11,185,-185.0
12,200,-200.0
13,200,-200.0
14,200,-200.0
15,200,-200.0
16,200,-200.0
17,200,-200.0
18,200,-200.0
19,200,-200.0
20,200,-200.0
21,200,-200.0
22,200,-200.0
23,200,-200.0
24,200,-200.0
25,200,-200.0
26,200,-200.0
27,200,-200.0
28,200,-200.0
29,200,-200.0
30,200,-200.0
31,200,-200.0
32,200,-200.0
33,200,-200.0
34,200,-200.0
35,200,-200.0
36,200,-200.0
37,200,-200.0
38,200,-200.0
39,200,-200.0
40,200,-200.0
41,200,-200.0
42,200,-200.0
43,200,-200.0
44,200,-200.0
45,200,-200.0
46,200,-200.0
47,200,-200.0
48,200,-200.0
49,200,-200.0
50,200,-200.0
51,200,-200.0
52,200,-200.0
53,200,-200.0
54,200,-200.0
55,200,-200.0
56,200,-200.0
57,200,-200.0
58,184,-184.0
59,200,-200.0
60,200,-200.0
61,200,-200.0
62,200,-200.0
63,200,-200.0
64,200,-200.0
65,178,-178.0
66,200,-200.0
67,200,-200.0
68,200,-200.0
69,175,-175.0
70,200,-200.0
71,200,-200.0
72,200,-200.0
73,105,-105.0
74,200,-200.0
75,200,-200.0
76,200,-200.0
77,200,-200.0
78,200,-200.0
79,200,-200.0
80,200,-200.0
81,200,-200.0
82,193,-193.0
83,200,-200.0
84,173,-173.0
85,200,-200.0
86,200,-200.0
87,192,-192.0
88,200,-200.0
89,200,-200.0
90,200,-200.0
91,183,-183.0
92,200,-200.0
93,191,-191.0
94,125,-125.0
95,134,-134.0
96,200,-200.0
97,181,-181.0
98,188,-188.0
99,200,-200.0
100,200,-200.0
101,188,-188.0
102,200,-200.0
103,154,-154.0
104,200,-200.0
105,159,-159.0
106,167,-167.0
107,200,-200.0
108,182,-182.0
109,193,-193.0
110,164,-164.0
111,124,-124.0
112,171,-171.0
113,143,-143.0
114,184,-184.0
115,172,-172.0
116,200,-200.0
117,184,-184.0
118,164,-164.0
119,149,-149.0
120,161,-161.0
121,132,-132.0
122,167,-167.0
123,180,-180.0
124,199,-199.0
125,159,-159.0
126,152,-152.0
127,176,-176.0
128,200,-200.0
129,171,-171.0
130,179,-179.0
131,171,-171.0
132,169,-169.0
133,108,-108.0
134,200,-200.0
135,167,-167.0
136,177,-177.0
137,157,-157.0
138,182,-182.0
139,200,-200.0
140,153,-153.0
141,103,-103.0
142,162,-162.0
143,135,-135.0
144,92,-92.0
145,105,-105.0
146,171,-171.0
147,177,-177.0
148,148,-148.0
149,178,-178.0
150,167,-167.0
151,143,-143.0
152,153,-153.0
153,143,-143.0
154,170,-170.0
155,197,-197.0
156,193,-193.0
157,200,-200.0
158,153,-153.0
159,131,-131.0
160,170,-170.0
161,189,-189.0
162,121,-121.0
163,147,-147.0
164,146,-146.0
165,146,-146.0
166,145,-145.0
167,134,-134.0
168,157,-157.0
169,137,-137.0
170,142,-142.0
171,200,-200.0
172,147,-147.0
173,116,-116.0
174,190,-190.0
175,174,-174.0
176,144,-144.0
177,146,-146.0
178,144,-144.0
179,84,-84.0
180,185,-185.0
181,142,-142.0
182,200,-200.0
183,140,-140.0
184,188,-188.0
185,147,-147.0
186,149,-149.0
187,132,-132.0
188,125,-125.0
189,146,-146.0
190,118,-118.0
191,200,-200.0
192,200,-200.0
193,168,-168.0
194,155,-155.0
195,166,-166.0
196,175,-175.0
197,171,-171.0
198,146,-146.0
199,151,-151.0
200,157,-157.0
201,156,-156.0
202,179,-179.0
203,200,-200.0
204,161,-161.0
205,200,-200.0
206,166,-166.0
207,158,-158.0
208,163,-163.0
209,148,-148.0
210,151,-151.0
211,149,-149.0
212,146,-146.0
213,154,-154.0
214,159,-159.0
215,149,-149.0
216,116,-116.0
217,149,-149.0
218,116,-116.0
219,119,-119.0
220,147,-147.0
221,115,-115.0
222,114,-114.0
223,150,-150.0
224,146,-146.0
225,141,-141.0
226,155,-155.0
227,155,-155.0
228,157,-157.0
229,153,-153.0
230,170,-170.0
231,162,-162.0
232,161,-161.0
233,118,-118.0
234,124,-124.0
235,154,-154.0
236,169,-169.0
237,126,-126.0
238,129,-129.0
239,121,-121.0
240,185,-185.0
241,163,-163.0
242,200,-200.0
243,158,-158.0
244,122,-122.0
245,128,-128.0
246,155,-155.0
247,130,-130.0
248,152,-152.0
249,116,-116.0
250,117,-117.0
251,118,-118.0
252,120,-120.0
253,151,-151.0
254,154,-154.0
255,145,-145.0
256,155,-155.0
257,145,-145.0
258,143,-143.0
259,162,-162.0
260,169,-169.0
261,162,-162.0
262,158,-158.0
263,147,-147.0
264,151,-151.0
265,157,-157.0
266,200,-200.0
267,156,-156.0
268,90,-90.0
269,147,-147.0
270,150,-150.0
271,155,-155.0
272,168,-168.0
273,160,-160.0
274,124,-124.0
275,171,-171.0
276,152,-152.0
277,145,-145.0
278,169,-169.0
279,99,-99.0
280,158,-158.0
281,170,-170.0
282,145,-145.0
283,147,-147.0
284,143,-143.0
285,150,-150.0
286,140,-140.0
287,147,-147.0
288,175,-175.0
289,182,-182.0
290,154,-154.0
291,105,-105.0
292,149,-149.0
293,154,-154.0
294,150,-150.0
295,200,-200.0
296,156,-156.0
297,156,-156.0
298,166,-166.0
299,155,-155.0
300,150,-150.0
301,142,-142.0
302,152,-152.0
303,154,-154.0
304,145,-145.0
305,153,-153.0
306,101,-101.0
307,146,-146.0
308,143,-143.0
309,145,-145.0
310,162,-162.0
311,168,-168.0
312,149,-149.0
313,173,-173.0
314,158,-158.0
315,91,-91.0
316,112,-112.0
317,145,-145.0
318,166,-166.0
319,157,-157.0
320,148,-148.0
321,149,-149.0
322,147,-147.0
323,92,-92.0
324,139,-139.0
325,145,-145.0
326,154,-154.0
327,150,-150.0
328,157,-157.0
329,141,-141.0
330,140,-140.0
331,170,-170.0
332,89,-89.0
333,139,-139.0
334,144,-144.0
335,151,-151.0
336,147,-147.0
337,157,-157.0
338,150,-150.0
339,152,-152.0
340,193,-193.0
341,163,-163.0
342,142,-142.0
343,95,-95.0
344,141,-141.0
345,158,-158.0
346,135,-135.0
347,157,-157.0
348,165,-165.0
349,158,-158.0
350,161,-161.0
351,146,-146.0
352,89,-89.0
353,105,-105.0
354,157,-157.0
355,143,-143.0
356,84,-84.0
357,99,-99.0
358,142,-142.0
359,162,-162.0
360,89,-89.0
361,141,-141.0
362,143,-143.0
363,105,-105.0
364,149,-149.0
365,147,-147.0
366,88,-88.0
367,140,-140.0
368,168,-168.0
369,160,-160.0
370,146,-146.0
371,99,-99.0
372,142,-142.0
373,142,-142.0
374,171,-171.0
375,141,-141.0
376,116,-116.0
377,113,-113.0
378,112,-112.0
379,114,-114.0
380,94,-94.0
381,91,-91.0
382,143,-143.0
383,143,-143.0
384,148,-148.0
385,99,-99.0
386,176,-176.0
387,120,-120.0
388,167,-167.0
389,87,-87.0
390,119,-119.0
391,154,-154.0
392,104,-104.0
393,117,-117.0
394,88,-88.0
395,113,-113.0
396,93,-93.0
397,156,-156.0
398,182,-182.0
399,155,-155.0
400,154,-154.0
401,157,-157.0
402,145,-145.0
403,164,-164.0
404,158,-158.0
405,88,-88.0
406,90,-90.0
407,180,-180.0
408,133,-133.0
409,148,-148.0
410,142,-142.0
411,84,-84.0
412,144,-144.0
413,151,-151.0
414,143,-143.0
415,93,-93.0
416,162,-162.0
417,146,-146.0
418,84,-84.0
419,145,-145.0
420,93,-93.0
421,150,-150.0
422,110,-110.0
423,93,-93.0
424,99,-99.0
425,144,-144.0
426,95,-95.0
427,91,-91.0
428,154,-154.0
429,94,-94.0
430,200,-200.0
431,155,-155.0
432,148,-148.0
433,147,-147.0
434,160,-160.0
435,97,-97.0
436,91,-91.0
437,147,-147.0
438,87,-87.0
439,84,-84.0
440,144,-144.0
441,160,-160.0
442,169,-169.0
443,151,-151.0
444,152,-152.0
445,87,-87.0
446,152,-152.0
447,200,-200.0
448,143,-143.0
449,138,-138.0
450,147,-147.0
451,146,-146.0
452,147,-147.0
453,143,-143.0
454,147,-147.0
455,158,-158.0
456,167,-167.0
457,84,-84.0
458,144,-144.0
459,169,-169.0
460,142,-142.0
461,146,-146.0
462,145,-145.0
463,148,-148.0
464,90,-90.0
465,156,-156.0
466,89,-89.0
467,98,-98.0
468,145,-145.0
469,142,-142.0
470,96,-96.0
471,150,-150.0
472,143,-143.0
473,141,-141.0
474,144,-144.0
475,140,-140.0
476,143,-143.0
477,142,-142.0
478,147,-147.0
479,143,-143.0
480,148,-148.0
481,158,-158.0
482,152,-152.0
483,141,-141.0
484,87,-87.0
485,141,-141.0
486,145,-145.0
487,140,-140.0
488,86,-86.0
489,84,-84.0
490,186,-186.0
491,137,-137.0
492,141,-141.0
493,101,-101.0
494,146,-146.0
495,146,-146.0
496,136,-136.0
497,93,-93.0
498,93,-93.0
499,151,-151.0
500,92,-92.0
501,192,-192.0
502,168,-168.0
503,88,-88.0
504,87,-87.0
505,92,-92.0
506,138,-138.0
507,129,-129.0
508,92,-92.0
509,153,-153.0
510,86,-86.0
511,92,-92.0
512,174,-174.0
513,145,-145.0
514,144,-144.0
515,148,-148.0
516,137,-137.0
517,151,-151.0
518,94,-94.0
519,142,-142.0
520,97,-97.0
521,180,-180.0
522,132,-132.0
523,94,-94.0
524,116,-116.0
525,86,-86.0
526,144,-144.0
527,88,-88.0
528,149,-149.0
529,102,-102.0
530,87,-87.0
531,179,-179.0
532,168,-168.0
533,200,-200.0
534,87,-87.0
535,85,-85.0
536,163,-163.0
537,92,-92.0
538,114,-114.0
539,146,-146.0
540,87,-87.0
541,160,-160.0
542,87,-87.0
543,124,-124.0
544,147,-147.0
545,113,-113.0
546,97,-97.0
547,128,-128.0
548,140,-140.0
549,183,-183.0
550,133,-133.0
551,121,-121.0
552,84,-84.0
553,158,-158.0
554,154,-154.0
555,146,-146.0
556,85,-85.0
557,99,-99.0
558,170,-170.0
559,143,-143.0
560,90,-90.0
561,87,-87.0
562,85,-85.0
563,150,-150.0
564,131,-131.0
565,192,-192.0
566,188,-188.0
567,188,-188.0
568,152,-152.0
569,144,-144.0
570,152,-152.0
571,90,-90.0
572,138,-138.0
573,144,-144.0
574,146,-146.0
575,151,-151.0
576,148,-148.0
577,87,-87.0
578,91,-91.0
579,142,-142.0
580,159,-159.0
581,140,-140.0
582,148,-148.0
583,139,-139.0
584,94,-94.0
585,142,-142.0
586,143,-143.0
587,142,-142.0
588,136,-136.0
589,164,-164.0
590,137,-137.0
591,134,-134.0
592,135,-135.0
593,138,-138.0
594,92,-92.0
595,87,-87.0
596,140,-140.0
597,143,-143.0
598,92,-92.0
599,146,-146.0
600,128,-128.0
