episodes,steps,rewards
0,200,-200.0
1,200,-200.0
2,200,-200.0
3,200,-200.0
4,200,-200.0
5,200,-200.0
6,200,-200.0
7,200,-200.0
8,200,-200.0
9,200,-200.0
10,200,-200.0
11,200,-200.0
12,200,-200.0
13,200,-200.0
14,200,-200.0
15,200,-200.0
16,200,-200.0
17,200,-200.0
18,200,-200.0
19,200,-200.0
20,200,-200.0
21,200,-200.0
22,200,-200.0
23,200,-200.0
24,200,-200.0
25,200,-200.0
26,200,-200.0
27,200,-200.0
28,200,-200.0
29,200,-200.0
30,200,-200.0
31,200,-200.0
32,200,-200.0
33,200,-200.0
34,200,-200.0
35,200,-200.0
36,182,-182.0
37,200,-200.0
38,200,-200.0
39,157,-157.0
40,200,-200.0
41,198,-198.0
42,200,-200.0
43,200,-200.0
44,200,-200.0
45,200,-200.0
46,200,-200.0
47,200,-200.0
48,200,-200.0
49,200,-200.0
50,200,-200.0
51,200,-200.0
52,200,-200.0
53,200,-200.0
54,200,-200.0
55,200,-200.0
56,200,-200.0
57,200,-200.0
58,200,-200.0
59,200,-200.0
60,200,-200.0
61,200,-200.0
62,200,-200.0
63,200,-200.0
64,200,-200.0
65,184,-184.0
66,200,-200.0
67,141,-141.0
68,180,-180.0
69,142,-142.0
70,170,-170.0
71,169,-169.0
72,110,-110.0
73,150,-150.0
74,151,-151.0
75,124,-124.0
76,187,-187.0
77,101,-101.0
78,200,-200.0
79,160,-160.0
80,200,-200.0
81,164,-164.0
82,200,-200.0
83,152,-152.0
84,136,-136.0
85,163,-163.0
86,149,-149.0
87,118,-118.0
88,200,-200.0
89,121,-121.0
90,181,-181.0
91,180,-180.0
92,181,-181.0
93,128,-128.0
94,154,-154.0
95,158,-158.0
96,111,-111.0
97,117,-117.0
98,126,-126.0
99,186,-186.0
100,108,-108.0
101,106,-106.0
102,135,-135.0
103,148,-148.0
104,182,-182.0
105,153,-153.0
106,165,-165.0
107,153,-153.0
108,160,-160.0
109,122,-122.0
110,98,-98.0
111,100,-100.0
112,122,-122.0
113,150,-150.0
114,129,-129.0
115,145,-145.0
116,97,-97.0
117,187,-187.0
118,156,-156.0
119,102,-102.0
120,105,-105.0
121,143,-143.0
122,163,-163.0
123,89,-89.0
124,111,-111.0
125,95,-95.0
126,155,-155.0
127,153,-153.0
128,117,-117.0
129,185,-185.0
130,167,-167.0
131,169,-169.0
132,131,-131.0
133,200,-200.0
134,117,-117.0
135,118,-118.0
136,174,-174.0
137,156,-156.0
138,109,-109.0
139,94,-94.0
140,152,-152.0
141,95,-95.0
142,112,-112.0
143,140,-140.0
144,157,-157.0
145,140,-140.0
146,150,-150.0
147,167,-167.0
148,143,-143.0
149,147,-147.0
150,147,-147.0
151,152,-152.0
152,149,-149.0
153,90,-90.0
154,166,-166.0
155,142,-142.0
156,85,-85.0
157,141,-141.0
158,142,-142.0
159,178,-178.0
160,156,-156.0
161,166,-166.0
162,88,-88.0
163,153,-153.0
164,133,-133.0
165,160,-160.0
166,124,-124.0
167,157,-157.0
168,146,-146.0
169,172,-172.0
170,150,-150.0
171,109,-109.0
172,164,-164.0
173,182,-182.0
174,132,-132.0
175,153,-153.0
176,147,-147.0
177,116,-116.0
178,121,-121.0
179,138,-138.0
180,142,-142.0
181,107,-107.0
182,199,-199.0
183,139,-139.0
184,94,-94.0
185,149,-149.0
186,141,-141.0
187,152,-152.0
188,91,-91.0
189,157,-157.0
190,103,-103.0
191,152,-152.0
192,114,-114.0
193,150,-150.0
194,97,-97.0
195,200,-200.0
196,163,-163.0
197,94,-94.0
198,153,-153.0
199,156,-156.0
200,178,-178.0
201,177,-177.0
202,153,-153.0
203,154,-154.0
204,135,-135.0
205,190,-190.0
206,98,-98.0
207,153,-153.0
208,90,-90.0
209,119,-119.0
210,107,-107.0
211,154,-154.0
212,200,-200.0
213,85,-85.0
214,165,-165.0
215,153,-153.0
216,124,-124.0
217,94,-94.0
218,144,-144.0
219,93,-93.0
220,145,-145.0
221,113,-113.0
222,171,-171.0
223,96,-96.0
224,148,-148.0
225,111,-111.0
226,141,-141.0
227,176,-176.0
228,90,-90.0
229,130,-130.0
230,119,-119.0
231,144,-144.0
232,109,-109.0
233,96,-96.0
234,143,-143.0
235,118,-118.0
236,140,-140.0
237,106,-106.0
238,138,-138.0
239,109,-109.0
240,105,-105.0
241,104,-104.0
242,137,-137.0
243,145,-145.0
244,170,-170.0
245,140,-140.0
246,87,-87.0
247,185,-185.0
248,101,-101.0
249,106,-106.0
250,116,-116.0
251,106,-106.0
252,105,-105.0
253,110,-110.0
254,111,-111.0
255,144,-144.0
256,107,-107.0
257,143,-143.0
258,200,-200.0
259,153,-153.0
260,149,-149.0
261,89,-89.0
262,141,-141.0
263,89,-89.0
264,148,-148.0
265,149,-149.0
266,123,-123.0
267,122,-122.0
268,137,-137.0
269,141,-141.0
270,140,-140.0
271,144,-144.0
272,146,-146.0
273,92,-92.0
274,96,-96.0
275,89,-89.0
276,200,-200.0
277,89,-89.0
278,85,-85.0
279,109,-109.0
280,142,-142.0
281,142,-142.0
282,139,-139.0
283,139,-139.0
284,96,-96.0
285,140,-140.0
286,111,-111.0
287,150,-150.0
288,148,-148.0
289,122,-122.0
290,150,-150.0
291,146,-146.0
292,157,-157.0
293,140,-140.0
294,91,-91.0
295,148,-148.0
296,139,-139.0
297,95,-95.0
298,142,-142.0
299,139,-139.0
300,144,-144.0
301,99,-99.0
302,166,-166.0
303,90,-90.0
304,86,-86.0
305,101,-101.0
306,136,-136.0
307,99,-99.0
308,91,-91.0
309,200,-200.0
310,156,-156.0
311,151,-151.0
312,138,-138.0
313,89,-89.0
314,87,-87.0
315,89,-89.0
316,143,-143.0
317,89,-89.0
318,100,-100.0
319,88,-88.0
320,142,-142.0
321,152,-152.0
322,144,-144.0
323,143,-143.0
324,136,-136.0
325,86,-86.0
326,89,-89.0
327,158,-158.0
328,149,-149.0
329,138,-138.0
330,145,-145.0
331,94,-94.0
332,144,-144.0
333,87,-87.0
334,134,-134.0
335,90,-90.0
336,142,-142.0
337,89,-89.0
338,132,-132.0
339,160,-160.0
340,93,-93.0
341,136,-136.0
342,138,-138.0
343,140,-140.0
344,155,-155.0
345,88,-88.0
346,132,-132.0
347,92,-92.0
348,142,-142.0
349,117,-117.0
350,133,-133.0
