episodes,steps,rewards
0,104,-247.77524206362594
1,80,-71.8533167152939
2,90,-402.07449212942674
3,114,-310.6186648305479
4,74,-107.26869042830268
5,131,-261.18188142793565
6,95,-288.83017583180896
7,69,-92.47414365035485
8,81,-188.4034930005986
9,115,-43.45941759844413
10,81,-395.8817705079804
11,115,-180.8412225707298
12,113,-88.78516758699146
13,130,-227.1875274094601
14,126,-561.4388055006231
15,144,-51.584996256674486
16,91,-94.5865943148449
17,344,-79.99998095269049
18,139,-145.89187971383137
19,301,-147.88145261186745
20,403,-103.10114695310311
21,302,-188.283393377978
22,301,-151.6994759959701
23,121,-152.6294846976707
24,184,-72.68142162897693
25,238,-146.50748194263167
26,131,1.6536622630197684
27,138,-129.09613692250244
28,238,-177.89580056505338
29,221,-319.8911462182912
30,412,-176.01439360357352
31,1000,-34.878690541868565
32,1000,-38.4944369948594
33,975,-297.10617803212494
34,943,-219.83006403465572
35,1000,-93.12062214981981
36,1000,-84.01428913834513
37,1000,-53.51752884251961
38,406,-71.9387832435414
39,671,-378.44042098437967
40,195,-135.6066824108797
41,1000,-64.3421957900602
42,585,-72.73999694585397
43,1000,-44.257417119572274
44,349,-8.035172390349288
45,667,-69.28610632699493
46,1000,-64.89564930320168
47,1000,-78.06716514419972
48,1000,-100.70439178613002
49,1000,-79.40947324532479
50,1000,-38.64991727820192
51,1000,-27.42966577009596
52,1000,-39.7283221227254
53,1000,-46.87441051497127
54,1000,-28.530342388390086
55,1000,-51.234601937842584
56,1000,-75.31249634398151
57,1000,-95.7706557723672
58,1000,-57.00750826015214
59,1000,-97.32794495859164
60,1000,-26.043282610172017
61,1000,-82.2037278766999
62,1000,-56.657266062360364
63,1000,-48.386371908420166
64,1000,-5.515217328875298
65,1000,-5.265731725436064
66,1000,-53.517258481142775
67,1000,-12.900295089472246
68,1000,-58.0772340020758
69,1000,17.37819858482043
70,1000,-74.23779558193833
71,1000,-105.60927601801052
72,1000,-91.21921958617378
73,1000,-25.88421595884145
74,1000,-58.63042419130668
75,1000,-43.156158462187726
76,1000,-58.184829670291386
77,1000,-83.35588449219377
78,1000,-33.50451688964553
79,1000,-55.4936503858235
80,1000,-60.58606375203165
81,1000,-0.03457723410050484
82,1000,-73.95401049479611
83,1000,-0.7638502426489857
84,1000,-23.47833919696969
85,1000,-85.86608615794998
86,1000,12.69921960888747
87,1000,-55.72128210718575
88,197,-479.635903279729
89,171,-269.86927236687404
90,129,-89.16372284211633
91,106,-370.93330264148966
92,336,-289.79554889696664
93,166,-578.9906557449588
94,133,-409.9731680170119
95,1000,-50.89876560040041
96,1000,-82.55127292960256
97,1000,-144.97064316430277
98,1000,-49.128465312051404
99,1000,-29.398593446571123
100,1000,-41.130962678173496
101,1000,-42.679768248812636
102,1000,-71.69683530366798
103,1000,-16.912788870962345
104,1000,-35.3358400683816
105,1000,-44.553934263604035
106,1000,-63.66130367033058
107,1000,-15.237187990674347
108,1000,15.671141348034867
109,1000,-40.86388614179585
110,1000,-35.183411993117346
111,1000,-59.00368046330963
112,1000,-14.788077485013192
113,1000,-0.5648978238839051
114,1000,-80.19528545679094
115,1000,-6.544847344319867
116,1000,-67.01352213825396
117,1000,-19.890559098612933
118,1000,-84.85271535342078
119,1000,-17.76841031037765
120,1000,-18.842886844689776
121,1000,-36.26830323467974
122,1000,-60.703653343056956
123,1000,-55.63456148123953
124,1000,-13.040351139726182
125,1000,-54.717678533977804
126,574,-144.4296494861523
127,1000,-35.25622391125133
128,1000,-62.10568588075762
129,1000,-67.91348349739087
130,1000,-72.48928432057173
131,1000,-38.387663186895686
132,316,-32.67794476042111
133,266,-60.23327056497389
134,1000,-66.92626357783948
135,1000,-29.05679663171171
136,1000,-37.49009390000033
137,1000,-25.38981490955285
138,1000,-28.81559039234641
139,1000,-19.41141625602902
140,1000,-14.773449367626496
141,1000,-84.5037381464052
142,329,17.841344189814862
143,408,-15.063420213453824
144,1000,-16.6388400291041
145,1000,21.781023896835144
146,1000,-57.826659748075485
147,1000,-53.5063988772461
148,496,-309.8298866230945
149,1000,-165.04205078711166
150,1000,-86.78383215906854
151,1000,-37.16810352334445
152,1000,-61.93225452752025
153,1000,-32.21652430988291
154,1000,-58.00867381344879
155,1000,-33.344883524834586
156,1000,13.386080930590444
157,1000,-36.13310495743467
158,1000,-36.11620857932822
159,1000,-31.71184786383084
160,1000,-17.91365715814471
161,1000,-116.3407445039607
162,1000,-54.900772798755106
163,1000,-75.7250451393876
164,1000,-100.0322800767743
165,1000,-25.22149569729225
166,165,-51.8157302945116
167,1000,-43.14126854089102
168,1000,-28.16926037679439
169,1000,-25.952600442083828
170,1000,-73.47879427472165
171,906,115.13889502221949
172,1000,-27.45123109569355
173,1000,-34.19378145198712
174,1000,-41.6981463080404
175,300,-540.6681483747843
176,1000,-113.35173531457117
177,1000,-17.226374447029198
178,1000,-96.1290748681416
179,658,-128.10963298926902
180,593,-112.34311782908344
181,1000,-44.58051254063756
182,1000,-66.75568283748913
183,1000,-25.338966157752477
184,1000,-80.63569564467558
185,640,142.89624651322308
186,1000,-21.10070830883348
187,1000,-131.10758551001325
188,1000,-85.52127868252721
189,1000,-87.26414699834976
190,1000,-61.08478190526499
191,1000,-12.77646308259931
192,668,-167.62583200157377
193,1000,-48.05819188342617
194,1000,-40.537673517140355
195,609,-86.58434185201662
196,1000,-56.021150639879124
197,1000,42.45142587380336
198,1000,-11.696037392254029
199,1000,-78.64544254812583
200,1000,7.087022930489693
