episodes,steps,rewards
0,200,-200.0
1,200,-200.0
2,200,-200.0
3,200,-200.0
4,200,-200.0
5,200,-200.0
6,200,-200.0
7,148,-148.0
8,140,-140.0
9,200,-200.0
10,200,-200.0
11,189,-189.0
12,119,-119.0
13,125,-125.0
14,200,-200.0
15,190,-190.0
16,200,-200.0
17,200,-200.0
18,200,-200.0
19,200,-200.0
20,200,-200.0
21,200,-200.0
22,200,-200.0
23,200,-200.0
24,200,-200.0
25,200,-200.0
26,200,-200.0
27,127,-127.0
28,200,-200.0
29,200,-200.0
30,199,-199.0
31,200,-200.0
32,159,-159.0
33,200,-200.0
34,169,-169.0
35,117,-117.0
36,200,-200.0
37,200,-200.0
38,161,-161.0
39,182,-182.0
40,200,-200.0
41,200,-200.0
42,200,-200.0
43,142,-142.0
44,106,-106.0
45,197,-197.0
46,182,-182.0
47,171,-171.0
48,151,-151.0
49,200,-200.0
50,88,-88.0
51,163,-163.0
52,200,-200.0
53,200,-200.0
54,200,-200.0
55,158,-158.0
56,151,-151.0
57,188,-188.0
58,171,-171.0
59,159,-159.0
60,160,-160.0
61,156,-156.0
62,200,-200.0
63,145,-145.0
64,189,-189.0
65,199,-199.0
66,170,-170.0
67,168,-168.0
68,109,-109.0
69,143,-143.0
70,175,-175.0
71,153,-153.0
72,154,-154.0
73,156,-156.0
74,161,-161.0
75,148,-148.0
76,138,-138.0
77,139,-139.0
78,138,-138.0
79,153,-153.0
80,176,-176.0
81,139,-139.0
82,146,-146.0
83,170,-170.0
84,140,-140.0
85,172,-172.0
86,151,-151.0
87,145,-145.0
88,200,-200.0
89,200,-200.0
90,152,-152.0
91,169,-169.0
92,142,-142.0
93,200,-200.0
94,189,-189.0
95,157,-157.0
96,147,-147.0
97,144,-144.0
98,194,-194.0
99,139,-139.0
100,159,-159.0
101,135,-135.0
102,104,-104.0
103,107,-107.0
104,131,-131.0
105,141,-141.0
106,176,-176.0
107,85,-85.0
108,161,-161.0
109,136,-136.0
110,145,-145.0
111,167,-167.0
112,159,-159.0
113,157,-157.0
114,107,-107.0
115,132,-132.0
116,158,-158.0
117,110,-110.0
118,112,-112.0
119,132,-132.0
120,122,-122.0
121,156,-156.0
122,90,-90.0
123,106,-106.0
124,139,-139.0
125,150,-150.0
126,200,-200.0
127,163,-163.0
128,146,-146.0
129,140,-140.0
130,158,-158.0
131,117,-117.0
132,106,-106.0
133,90,-90.0
134,134,-134.0
135,118,-118.0
136,90,-90.0
137,145,-145.0
138,154,-154.0
139,137,-137.0
140,102,-102.0
141,155,-155.0
142,151,-151.0
143,154,-154.0
144,151,-151.0
145,139,-139.0
146,159,-159.0
147,112,-112.0
148,200,-200.0
149,164,-164.0
150,114,-114.0
151,162,-162.0
152,86,-86.0
153,86,-86.0
154,185,-185.0
155,105,-105.0
156,149,-149.0
157,142,-142.0
158,85,-85.0
159,141,-141.0
160,110,-110.0
161,169,-169.0
162,136,-136.0
163,107,-107.0
164,126,-126.0
165,154,-154.0
166,164,-164.0
167,154,-154.0
168,93,-93.0
169,156,-156.0
170,103,-103.0
171,107,-107.0
172,143,-143.0
173,96,-96.0
174,137,-137.0
175,106,-106.0
176,89,-89.0
177,158,-158.0
178,138,-138.0
179,90,-90.0
180,163,-163.0
181,138,-138.0
182,100,-100.0
183,168,-168.0
184,149,-149.0
185,101,-101.0
186,109,-109.0
187,152,-152.0
188,154,-154.0
189,140,-140.0
190,93,-93.0
191,150,-150.0
192,137,-137.0
193,162,-162.0
194,160,-160.0
195,104,-104.0
196,139,-139.0
197,97,-97.0
198,143,-143.0
199,168,-168.0
200,140,-140.0
201,156,-156.0
202,129,-129.0
203,85,-85.0
204,143,-143.0
205,146,-146.0
206,105,-105.0
207,87,-87.0
208,138,-138.0
209,89,-89.0
210,164,-164.0
211,115,-115.0
212,94,-94.0
213,148,-148.0
214,90,-90.0
215,174,-174.0
216,98,-98.0
217,137,-137.0
218,147,-147.0
219,148,-148.0
220,138,-138.0
221,150,-150.0
222,148,-148.0
223,179,-179.0
224,92,-92.0
225,114,-114.0
226,117,-117.0
227,142,-142.0
228,117,-117.0
229,106,-106.0
230,148,-148.0
231,144,-144.0
232,143,-143.0
233,139,-139.0
234,147,-147.0
235,90,-90.0
236,145,-145.0
237,146,-146.0
238,96,-96.0
239,110,-110.0
240,113,-113.0
241,142,-142.0
242,161,-161.0
243,94,-94.0
244,129,-129.0
245,87,-87.0
246,148,-148.0
247,192,-192.0
248,153,-153.0
249,129,-129.0
250,144,-144.0
