episodes,steps,rewards
0,80,-193.75036859184928
1,94,-342.4729067247572
2,65,-90.69677195765556
3,67,-70.86344020018936
4,74,-120.06911268629581
5,87,-123.77306816378271
6,85,-151.8045065541276
7,80,-295.3829744682327
8,110,-113.09018219611698
9,128,-386.85808451501396
10,108,-127.08665583954784
11,133,-275.2333331982227
12,178,-275.07149320459416
13,105,-260.8805806332597
14,847,-259.2573187081863
15,612,-301.817981190026
16,131,-174.276926933141
17,414,-138.13593632087944
18,146,-183.42580650698045
19,262,-308.4117014246016
20,1000,-202.45159289587588
21,127,-223.59510627296567
22,1000,-156.89861616163407
23,1000,-190.52833422443314
24,1000,-122.20313091617224
25,273,-245.40451224181376
26,1000,-100.77324557099834
27,115,-237.50654356094296
28,1000,-67.20153372148808
29,1000,-116.1014053461491
30,699,-132.39420179179623
31,1000,-171.21610885488522
32,1000,-113.58133588151529
33,1000,-14.043809284743169
34,1000,-20.620373073472255
35,874,-246.22979914393244
36,1000,-145.99938825934862
37,1000,-59.27358224263259
38,728,-206.32173291914123
39,1000,-74.33403378665804
40,1000,-96.76953675001155
41,1000,-137.8685096331355
42,1000,-102.38819819145095
43,1000,-93.09355655641652
44,1000,-117.13417294154152
45,1000,-91.32458507584847
46,1000,-106.83008291000785
47,1000,-134.28017841180647
48,1000,-88.8606794195497
49,1000,-81.89507035589283
50,1000,-29.218299683537378
