episodes,steps,rewards
0,95,-428.5682614779306
1,79,-137.9162707238786
2,56,-110.74895392820983
3,141,22.322124767381894
4,82,-104.03848258008627
5,123,-353.4503911981403
6,124,-325.5387312210747
7,86,-132.54491596800665
8,59,-96.56038316718396
9,99,-321.63816771753335
10,107,-94.16032503156033
11,125,-192.96198101200736
12,72,-127.39683139869852
13,89,-697.6997831723036
14,155,-164.3709624753266
15,102,-137.89639256466646
16,148,-51.462045612339566
17,115,-30.621643111422202
18,83,-78.57636332701252
19,155,-132.39622408156893
20,250,-121.30980930041969
21,363,-321.40889363634506
22,133,-211.1662209472961
23,137,-39.54377768692724
24,191,-105.74656930477457
25,215,-210.39582285843096
26,130,-622.252059589823
27,149,-70.40012464845134
28,439,-1181.5851809741714
29,533,-1237.299993861059
30,295,-6.737161439340284
31,1000,-217.36781575965236
32,1000,-181.86584539524762
33,1000,-116.36760012962392
34,1000,-128.85377955878576
35,1000,-131.98158115045777
36,181,-165.73716890760124
37,758,-199.80438053048962
38,221,-469.91213131269154
39,266,10.546319739482811
40,917,-148.945892911169
41,783,-146.63908940327877
42,922,-250.0656356726116
43,1000,-58.7620156631034
44,1000,-134.35588748656357
45,685,155.98443652205663
46,1000,-68.05871512027635
47,670,-118.28082268292098
48,458,-110.95856870648775
49,929,-95.3222231150074
50,876,-219.4004221672843
51,837,-146.64240174981506
52,1000,-177.3638610833525
53,1000,-89.01221166874588
54,788,-126.90352557825595
55,72,-344.98575895732176
56,1000,-61.46006738624607
57,1000,-67.6543021834208
58,1000,-78.0474860663799
59,419,-179.70880002064317
60,168,-137.6114490726282
61,84,-192.27385965195353
62,1000,-96.19280918370691
63,335,-608.7615107490925
64,1000,-137.08625218461586
65,1000,-89.47539065720848
66,950,127.13419794855557
67,1000,-26.718974371266658
68,249,-146.1245348535364
69,360,-182.33526695072902
70,651,-255.141408004267
71,174,-153.9503646767584
72,330,-257.7189876426621
73,1000,-82.62396474359632
74,1000,-55.51706221205156
75,221,-70.57629597625855
76,1000,-59.54292708333295
77,175,-107.05720495740576
78,245,-534.9442492565709
79,981,-349.50120247826953
80,720,-116.85522581313684
81,920,-171.5732353191489
82,94,-89.77891858475816
83,1000,-84.81272450070715
84,1000,-220.7783662953367
85,1000,-132.44059184606485
86,1000,-112.27716978702993
87,1000,-32.47740936527026
88,1000,-110.10403838859234
89,1000,-64.6383451190692
90,388,-38.189565390868836
91,720,-200.67580898106425
92,63,-169.89456647663124
93,122,-127.1248123334152
94,80,-187.86297317143578
95,58,-196.38974870329832
96,57,-132.42003088928936
97,71,-41.59826327579161
98,197,-114.71684865702208
99,1000,-16.975737533039197
100,1000,-2.2344376688608096
101,228,-42.75332415795988
102,222,-124.64127712353941
103,1000,-42.00386250690358
104,128,-95.51918771465557
105,329,-272.16278812649807
106,1000,-80.87970166105738
107,683,-531.6737709991437
108,178,-473.26566033341373
109,171,-360.83131088142585
110,162,-125.42941254762236
111,1000,-47.08199069553065
112,854,-329.74758230361135
113,1000,-137.14428552746702
114,1000,-359.04073785840956
115,82,-259.59606537347867
116,86,-771.4906658392698
117,55,-390.3621580750406
118,51,-368.027906773499
119,56,-470.2546674786994
120,58,-513.5323585574741
121,80,-746.3452343663008
122,75,-317.7816003328576
123,61,-542.9907106290173
124,58,-515.113566371861
125,76,-685.9925753059206
126,70,-704.9941798642398
127,85,-503.55429769732996
128,72,-638.442394852892
129,98,-702.7137279965954
130,127,-729.7715388232632
131,119,-724.6447719619055
132,153,-378.88694822017544
133,170,-782.0651075290223
134,90,-396.5827428247593
135,119,-649.1169258432534
136,149,-629.6808206632206
137,172,-691.5174108814315
138,222,-357.1452884270583
139,230,-519.4649967967999
140,174,-401.9046255568982
141,357,-471.23004126617025
142,1000,-264.1093939049674
143,1000,-529.8504502630282
144,130,-688.9503577404274
145,280,-153.46453958505586
146,1000,-83.71296038032666
147,1000,-233.34268184619032
148,349,-346.236730785739
149,1000,-157.85883828861702
150,286,-234.18074758269728
151,1000,-148.65343196522227
152,1000,-127.42899929661404
153,1000,-66.21709351319194
154,948,-133.7668573262668
155,332,-76.23988762261578
156,1000,-89.92941138281812
157,319,-25.87824152823255
158,1000,-60.586704108632894
159,1000,-93.33564641424279
160,908,-372.3999238095375
161,1000,-218.66160031714185
162,1000,-44.36858314961913
163,1000,-51.45099940437525
164,1000,-92.9849196302922
165,659,-242.00038258361045
166,1000,-39.85704310453331
167,544,-143.71121452918266
168,973,-226.3644983501842
169,1000,-47.82355246497251
170,1000,-52.1322105708873
171,1000,-72.44400796440604
172,762,-84.91267081159299
173,695,-197.78413374591963
174,242,-111.92325102950315
175,154,-196.4751404495093
176,1000,-57.366412804905195
177,709,-297.2296450298285
178,357,-162.84467671781607
179,1000,-28.208495904530768
180,1000,-25.603960287008828
181,1000,-61.45407828995671
182,524,-194.20878215777435
183,1000,-68.44915000371988
184,632,-150.5354665948893
185,119,-135.37912386492803
186,1000,-278.85624314689136
187,1000,-112.66434519455193
188,392,-239.20284844512676
189,479,-954.720356465029
190,1000,-118.50244171529981
191,896,-564.4964734892769
192,173,-177.33624157839301
193,283,-359.26256215785065
194,1000,-141.35873551496653
195,852,-182.67420695616877
196,1000,-123.46145634672357
197,1000,-84.17793533997975
198,1000,-117.8784473679283
199,1000,-63.38386418603962
200,1000,-144.05740661126976
201,163,-122.54671241083442
202,1000,24.00593048895314
203,1000,-138.41562779816513
204,952,-194.42378191488802
205,1000,-99.27264904849892
206,1000,-25.21700986674316
207,1000,-9.310626852008832
208,1000,0.23125218439999912
209,1000,-74.69905841053203
210,724,-512.4831000307213
211,1000,-22.917949036515022
212,1000,-140.8743662321084
213,588,-282.63112227589613
214,1000,-42.80471605084174
215,1000,-134.33884103345486
216,1000,-79.35723186829179
217,808,119.93299027917888
218,1000,-61.24109406671266
219,1000,-72.95066933149522
220,1000,-90.30088984589608
221,1000,-228.50076776124533
222,387,-353.9984593735569
223,1000,-63.25677419376243
224,950,-193.7289848176138
225,1000,-45.99476104548967
226,1000,-63.38132799673852
227,1000,-99.03644182828337
228,1000,-37.364633607039124
229,1000,-113.60624785345745
230,1000,-56.21193707684467
231,1000,-97.97425629361143
232,1000,-42.79391153994775
233,1000,-114.46789281175057
234,1000,-213.5820405258751
235,722,-259.7650550464748
236,1000,-164.69134434113602
237,1000,-49.242379582457026
238,1000,-103.75768046988432
239,494,-39.11744868937317
240,97,12.891929145083452
241,246,-139.59358307915784
242,303,-236.12893795909696
243,231,-164.12980447939216
244,282,-394.506429155117
245,1000,-25.90470938917794
246,176,-243.2824201774323
247,255,-1124.2194998843956
248,477,-1022.8231037663676
249,300,-489.14419598584453
250,321,-692.9959133299838
251,237,-380.04903606559805
252,277,-1432.1239357907518
253,271,-1548.266510372353
254,537,-635.6261625328269
255,351,-337.2639182210438
256,1000,-149.83131783859594
257,1000,-337.21094043029603
258,884,-240.80522846865094
259,1000,-85.51592460956515
260,469,-444.7311940677845
261,237,-354.61447782266424
262,271,-461.7261381461078
263,206,-187.19968000451377
264,221,-1213.8453008286156
265,693,-767.1946189030942
266,1000,-216.37251337637343
267,730,-682.4824305223784
268,478,-349.987025845899
269,258,-141.89218554606225
270,78,-239.2055661679477
271,106,-119.18670971100882
272,697,-502.1275957086093
273,1000,-176.93025368989456
274,415,-976.4423341137135
275,161,-555.4430370242229
276,1000,-123.81800651884582
277,1000,-99.44198520499326
278,1000,-207.47350089453462
279,1000,-75.31664263810214
280,1000,-84.6385132571536
281,1000,-201.0891329171079
282,805,-291.44678181394215
283,1000,-79.94446753721701
284,1000,-100.45158039625642
285,477,-92.35339419506344
286,1000,-53.453809111341855
287,835,-225.84776944228798
288,555,-141.2503756884404
289,1000,-82.83662235286917
290,1000,1.8926878311486437
291,319,-32.92697210530933
292,75,-543.346914080018
293,155,4.730583868843851
294,91,-17.132910396778954
295,57,-430.3407917072456
296,59,-493.67312089908864
297,63,-547.0912520268229
298,57,-349.3576960343288
299,71,-591.0530923150056
300,92,-663.5836819769822
301,58,-524.3109546456678
302,69,-568.5736958916132
303,62,-534.5901034017123
304,57,-361.9982441853992
305,80,-644.1296032507903
306,112,-285.43802419245094
307,417,-351.69383770689194
308,904,-644.2765392635025
309,197,-346.996547208523
310,384,-155.57572666687778
311,178,-514.3049156638455
312,431,-493.921420306283
313,150,-597.6857388442527
314,123,-293.33022590705673
315,217,-905.2168638839668
316,1000,-49.59850642906565
317,1000,-509.7411423373685
318,153,-208.16116748381097
319,190,-227.97001919254046
320,309,-2976.7828507571035
321,152,-196.45843232465285
322,144,-303.772065770964
323,152,-823.1693973385347
324,107,-258.0276352354191
325,165,-361.24924659160604
326,205,-341.46716884714533
327,187,-338.82742231841166
328,269,-365.11003103058374
329,147,-347.1513847046828
330,335,-413.55573848135646
331,259,-221.06401443314553
332,270,-174.3732987900841
333,1000,-145.26260517030673
334,1000,-160.3777286178872
335,1000,-176.51854270589493
336,428,-804.2103239282382
337,155,-782.9855450752353
338,79,-544.5238287619451
339,76,-574.3249582925006
340,88,-447.28096290138177
341,129,-372.8963388141265
342,198,-637.8049936992145
343,155,-1011.7052846885599
344,294,-2929.744108905783
345,303,-2912.6911231929153
346,235,-642.9717177642293
347,952,-340.06995258030486
348,110,-247.84477879660264
349,127,-343.2739639458965
350,294,-321.0401629566991
