episodes,steps,rewards
0,200,-200.0
1,200,-200.0
2,200,-200.0
3,200,-200.0
4,200,-200.0
5,200,-200.0
6,200,-200.0
7,181,-181.0
8,200,-200.0
9,200,-200.0
10,139,-139.0
11,200,-200.0
12,200,-200.0
13,200,-200.0
14,200,-200.0
15,200,-200.0
16,200,-200.0
17,200,-200.0
18,121,-121.0
19,200,-200.0
20,200,-200.0
21,200,-200.0
22,200,-200.0
23,200,-200.0
24,200,-200.0
25,200,-200.0
26,112,-112.0
27,200,-200.0
28,200,-200.0
29,200,-200.0
30,121,-121.0
31,195,-195.0
32,200,-200.0
33,200,-200.0
34,116,-116.0
35,200,-200.0
36,200,-200.0
37,169,-169.0
38,171,-171.0
39,183,-183.0
40,158,-158.0
41,190,-190.0
42,172,-172.0
43,200,-200.0
44,200,-200.0
45,200,-200.0
46,200,-200.0
47,153,-153.0
48,103,-103.0
49,200,-200.0
50,200,-200.0
51,200,-200.0
52,200,-200.0
53,200,-200.0
54,181,-181.0
55,181,-181.0
56,200,-200.0
57,200,-200.0
58,200,-200.0
59,152,-152.0
60,200,-200.0
61,200,-200.0
62,200,-200.0
63,200,-200.0
64,95,-95.0
65,200,-200.0
66,154,-154.0
67,147,-147.0
68,200,-200.0
69,200,-200.0
70,200,-200.0
71,200,-200.0
72,200,-200.0
73,200,-200.0
74,200,-200.0
75,200,-200.0
76,172,-172.0
77,200,-200.0
78,192,-192.0
79,195,-195.0
80,127,-127.0
81,200,-200.0
82,141,-141.0
83,200,-200.0
84,200,-200.0
85,200,-200.0
86,185,-185.0
87,112,-112.0
88,200,-200.0
89,133,-133.0
90,109,-109.0
91,200,-200.0
92,200,-200.0
93,200,-200.0
94,136,-136.0
95,122,-122.0
96,200,-200.0
97,180,-180.0
98,200,-200.0
99,200,-200.0
100,168,-168.0
101,156,-156.0
102,94,-94.0
103,96,-96.0
104,155,-155.0
105,200,-200.0
106,181,-181.0
107,185,-185.0
108,200,-200.0
109,200,-200.0
110,200,-200.0
111,112,-112.0
112,162,-162.0
113,89,-89.0
114,200,-200.0
115,179,-179.0
116,200,-200.0
117,152,-152.0
118,184,-184.0
119,176,-176.0
120,200,-200.0
121,200,-200.0
122,200,-200.0
123,200,-200.0
124,192,-192.0
125,200,-200.0
126,200,-200.0
127,200,-200.0
128,200,-200.0
129,160,-160.0
130,139,-139.0
131,120,-120.0
132,200,-200.0
133,182,-182.0
134,158,-158.0
135,109,-109.0
136,200,-200.0
137,91,-91.0
138,90,-90.0
139,200,-200.0
140,200,-200.0
141,169,-169.0
142,200,-200.0
143,135,-135.0
144,163,-163.0
145,200,-200.0
146,113,-113.0
147,116,-116.0
148,144,-144.0
149,200,-200.0
150,194,-194.0
