episodes,steps,rewards
0,200,-200.0
1,200,-200.0
2,200,-200.0
3,200,-200.0
4,200,-200.0
5,200,-200.0
6,200,-200.0
7,200,-200.0
8,200,-200.0
9,200,-200.0
10,200,-200.0
11,200,-200.0
12,200,-200.0
13,200,-200.0
14,200,-200.0
15,200,-200.0
16,200,-200.0
17,200,-200.0
18,200,-200.0
19,200,-200.0
20,200,-200.0
21,200,-200.0
22,200,-200.0
23,200,-200.0
24,200,-200.0
25,200,-200.0
26,200,-200.0
27,200,-200.0
28,200,-200.0
29,200,-200.0
30,200,-200.0
31,200,-200.0
32,200,-200.0
33,200,-200.0
34,200,-200.0
35,200,-200.0
36,200,-200.0
37,200,-200.0
38,164,-164.0
39,200,-200.0
40,200,-200.0
41,169,-169.0
42,200,-200.0
43,200,-200.0
44,200,-200.0
45,200,-200.0
46,200,-200.0
47,200,-200.0
48,192,-192.0
49,137,-137.0
50,200,-200.0
51,200,-200.0
52,200,-200.0
53,200,-200.0
54,200,-200.0
55,151,-151.0
56,200,-200.0
57,200,-200.0
58,200,-200.0
59,174,-174.0
60,200,-200.0
61,200,-200.0
62,176,-176.0
63,200,-200.0
64,200,-200.0
65,170,-170.0
66,200,-200.0
67,162,-162.0
68,200,-200.0
69,174,-174.0
70,200,-200.0
71,200,-200.0
72,200,-200.0
73,200,-200.0
74,200,-200.0
75,200,-200.0
76,200,-200.0
77,200,-200.0
78,200,-200.0
79,200,-200.0
80,200,-200.0
81,200,-200.0
82,200,-200.0
83,90,-90.0
84,200,-200.0
85,110,-110.0
86,200,-200.0
87,141,-141.0
88,200,-200.0
89,200,-200.0
90,200,-200.0
91,200,-200.0
92,200,-200.0
93,181,-181.0
94,200,-200.0
95,200,-200.0
96,200,-200.0
97,200,-200.0
98,200,-200.0
99,200,-200.0
100,200,-200.0
