episodes,steps,rewards
0,200,-200.0
1,200,-200.0
2,200,-200.0
3,200,-200.0
4,200,-200.0
5,200,-200.0
6,200,-200.0
7,200,-200.0
8,195,-195.0
9,200,-200.0
10,200,-200.0
11,200,-200.0
12,200,-200.0
13,195,-195.0
14,131,-131.0
15,188,-188.0
16,127,-127.0
17,174,-174.0
18,163,-163.0
19,200,-200.0
20,200,-200.0
21,200,-200.0
22,200,-200.0
23,200,-200.0
24,200,-200.0
25,200,-200.0
26,200,-200.0
27,200,-200.0
28,200,-200.0
29,200,-200.0
30,200,-200.0
31,200,-200.0
32,200,-200.0
33,200,-200.0
34,184,-184.0
35,200,-200.0
36,172,-172.0
37,200,-200.0
38,147,-147.0
39,200,-200.0
40,200,-200.0
41,200,-200.0
42,154,-154.0
43,157,-157.0
44,97,-97.0
45,200,-200.0
46,171,-171.0
47,178,-178.0
48,193,-193.0
49,179,-179.0
50,200,-200.0
51,200,-200.0
52,183,-183.0
53,200,-200.0
54,184,-184.0
55,177,-177.0
56,174,-174.0
57,179,-179.0
58,200,-200.0
59,138,-138.0
60,125,-125.0
61,200,-200.0
62,200,-200.0
63,161,-161.0
64,176,-176.0
65,182,-182.0
66,159,-159.0
67,200,-200.0
68,94,-94.0
69,101,-101.0
70,200,-200.0
71,163,-163.0
72,200,-200.0
73,123,-123.0
74,155,-155.0
75,120,-120.0
76,200,-200.0
77,187,-187.0
78,99,-99.0
79,200,-200.0
80,150,-150.0
81,165,-165.0
82,170,-170.0
83,178,-178.0
84,124,-124.0
85,171,-171.0
86,150,-150.0
87,145,-145.0
88,200,-200.0
89,153,-153.0
90,158,-158.0
91,160,-160.0
92,177,-177.0
93,174,-174.0
94,200,-200.0
95,148,-148.0
96,101,-101.0
97,155,-155.0
98,197,-197.0
99,109,-109.0
100,200,-200.0
101,182,-182.0
102,99,-99.0
103,154,-154.0
104,117,-117.0
105,136,-136.0
106,162,-162.0
107,139,-139.0
108,111,-111.0
109,185,-185.0
110,167,-167.0
111,90,-90.0
112,177,-177.0
113,122,-122.0
114,157,-157.0
115,118,-118.0
116,182,-182.0
117,163,-163.0
118,165,-165.0
119,148,-148.0
120,84,-84.0
121,167,-167.0
122,87,-87.0
123,97,-97.0
124,93,-93.0
125,130,-130.0
126,113,-113.0
127,137,-137.0
128,169,-169.0
129,117,-117.0
130,161,-161.0
131,140,-140.0
132,93,-93.0
133,116,-116.0
134,137,-137.0
135,135,-135.0
136,100,-100.0
137,158,-158.0
138,174,-174.0
139,178,-178.0
140,118,-118.0
141,102,-102.0
142,155,-155.0
143,139,-139.0
144,98,-98.0
145,92,-92.0
146,133,-133.0
147,197,-197.0
148,125,-125.0
149,117,-117.0
150,153,-153.0
151,184,-184.0
152,196,-196.0
153,149,-149.0
154,108,-108.0
155,108,-108.0
156,152,-152.0
157,162,-162.0
158,178,-178.0
159,110,-110.0
160,145,-145.0
161,148,-148.0
162,98,-98.0
163,187,-187.0
164,153,-153.0
165,105,-105.0
166,165,-165.0
167,183,-183.0
168,131,-131.0
169,136,-136.0
170,180,-180.0
171,124,-124.0
172,112,-112.0
173,145,-145.0
174,90,-90.0
175,184,-184.0
176,118,-118.0
177,143,-143.0
178,139,-139.0
179,135,-135.0
180,137,-137.0
181,138,-138.0
182,88,-88.0
183,156,-156.0
184,179,-179.0
185,97,-97.0
186,116,-116.0
187,155,-155.0
188,139,-139.0
189,147,-147.0
190,124,-124.0
191,142,-142.0
192,179,-179.0
193,86,-86.0
194,110,-110.0
195,149,-149.0
196,140,-140.0
197,153,-153.0
198,99,-99.0
199,100,-100.0
200,89,-89.0
201,94,-94.0
202,145,-145.0
203,179,-179.0
204,110,-110.0
205,150,-150.0
206,109,-109.0
207,147,-147.0
208,142,-142.0
209,159,-159.0
210,143,-143.0
211,145,-145.0
212,145,-145.0
213,147,-147.0
214,118,-118.0
215,139,-139.0
216,127,-127.0
217,141,-141.0
218,165,-165.0
219,168,-168.0
220,150,-150.0
221,147,-147.0
222,154,-154.0
223,161,-161.0
224,149,-149.0
225,94,-94.0
226,91,-91.0
227,151,-151.0
228,105,-105.0
229,179,-179.0
230,154,-154.0
231,151,-151.0
232,121,-121.0
233,96,-96.0
234,106,-106.0
235,157,-157.0
236,87,-87.0
237,92,-92.0
238,88,-88.0
239,85,-85.0
240,149,-149.0
241,86,-86.0
242,100,-100.0
243,172,-172.0
244,153,-153.0
245,89,-89.0
246,156,-156.0
247,148,-148.0
248,109,-109.0
249,147,-147.0
250,160,-160.0
251,154,-154.0
252,149,-149.0
253,158,-158.0
254,171,-171.0
255,153,-153.0
256,153,-153.0
257,153,-153.0
258,155,-155.0
259,91,-91.0
260,105,-105.0
261,151,-151.0
262,181,-181.0
263,115,-115.0
264,89,-89.0
265,89,-89.0
266,114,-114.0
267,116,-116.0
268,119,-119.0
269,98,-98.0
270,84,-84.0
271,86,-86.0
272,84,-84.0
273,154,-154.0
274,153,-153.0
275,93,-93.0
276,116,-116.0
277,110,-110.0
278,166,-166.0
279,158,-158.0
280,150,-150.0
281,151,-151.0
282,110,-110.0
283,110,-110.0
284,87,-87.0
285,110,-110.0
286,110,-110.0
287,106,-106.0
288,87,-87.0
289,84,-84.0
290,84,-84.0
291,111,-111.0
292,104,-104.0
293,148,-148.0
294,84,-84.0
295,151,-151.0
296,168,-168.0
297,112,-112.0
298,102,-102.0
299,158,-158.0
300,151,-151.0
301,109,-109.0
302,106,-106.0
303,111,-111.0
304,89,-89.0
305,109,-109.0
306,111,-111.0
307,101,-101.0
308,86,-86.0
309,108,-108.0
310,92,-92.0
311,108,-108.0
312,123,-123.0
313,154,-154.0
314,200,-200.0
315,104,-104.0
316,187,-187.0
317,142,-142.0
318,145,-145.0
319,144,-144.0
320,155,-155.0
321,143,-143.0
322,89,-89.0
323,147,-147.0
324,140,-140.0
325,144,-144.0
326,85,-85.0
327,85,-85.0
328,165,-165.0
329,95,-95.0
330,106,-106.0
331,166,-166.0
332,152,-152.0
333,109,-109.0
334,86,-86.0
335,106,-106.0
336,93,-93.0
337,139,-139.0
338,138,-138.0
339,98,-98.0
340,108,-108.0
341,156,-156.0
342,134,-134.0
343,112,-112.0
344,149,-149.0
345,108,-108.0
346,111,-111.0
347,109,-109.0
348,138,-138.0
349,87,-87.0
350,93,-93.0
