{
    "model_info": "common8x16",
    "episodes": [
        10,
        9,
        71,
        14,
        18,
        19,
        12,
        8,
        9,
        9,
        9,
        10,
        11,
        10,
        12,
        9,
        11,
        12,
        9,
        10,
        10,
        10,
        10,
        9,
        10,
        8,
        10,
        9,
        11,
        10,
        9,
        8,
        8,
        9,
        9,
        9,
        9,
        9,
        9,
        10,
        10,
        9,
        10,
        9,
        10,
        10,
        10,
        9,
        8,
        10,
        10,
        9,
        9,
        10,
        10,
        9,
        9,
        8,
        9,
        9,
        9,
        10,
        9,
        10,
        10,
        10,
        9,
        9,
        11,
        10,
        10,
        8,
        9,
        11,
        9,
        9,
        10,
        9,
        9,
        10,
        9,
        10,
        10,
        10,
        8,
        10,
        10,
        9,
        9,
        8,
        8,
        9,
        9,
        9,
        9,
        9,
        10,
        10,
        10,
        11,
        10,
        9,
        9,
        10,
        10,
        10,
        10,
        8,
        10,
        10,
        10,
        10,
        8,
        10,
        9,
        9,
        10,
        8,
        9,
        9,
        9,
        10,
        9,
        9,
        8,
        9,
        9,
        10,
        10,
        11,
        8,
        10,
        8,
        8,
        10,
        10,
        9,
        8,
        10,
        9,
        9,
        9,
        9,
        9,
        9,
        10,
        11,
        9,
        9,
        11,
        9,
        10,
        8,
        9,
        9,
        10,
        9,
        10,
        9,
        10,
        8,
        8,
        10,
        10,
        10,
        9,
        8,
        9,
        8,
        10,
        10,
        10,
        10,
        9,
        9,
        10,
        9,
        9,
        8,
        10,
        9,
        9,
        9,
        9,
        9,
        10,
        10,
        10,
        9,
        10,
        10,
        9,
        10,
        9,
        10,
        10,
        9,
        9,
        9,
        10,
        10,
        10,
        8,
        10,
        9,
        9,
        10,
        10,
        10,
        10,
        9,
        10,
        8,
        9,
        9,
        11,
        10,
        8,
        9,
        10,
        10,
        10,
        9,
        8,
        10,
        8,
        10,
        11,
        8,
        9,
        9,
        10,
        10,
        8,
        9,
        10,
        8,
        10,
        10,
        10,
        9,
        8,
        10,
        10,
        9,
        10,
        10,
        10,
        9,
        11,
        8,
        10,
        9,
        11,
        9,
        11,
        10,
        9,
        9,
        10,
        10,
        10,
        8,
        10,
        9,
        9,
        9,
        9,
        11,
        10,
        9,
        8,
        10,
        8,
        10,
        10,
        9,
        10,
        10,
        10,
        10,
        10,
        10,
        11,
        9,
        10,
        10,
        9,
        10,
        11,
        9,
        10,
        9,
        9,
        10,
        9,
        9,
        10,
        9,
        10,
        10,
        9,
        9,
        10,
        10,
        10,
        10,
        9,
        9,
        9,
        10,
        8,
        9,
        9,
        10,
        10,
        9,
        9,
        9,
        9,
        9,
        10,
        10,
        10,
        9,
        9,
        8,
        10,
        10,
        10,
        10,
        10,
        10,
        8,
        9,
        10,
        10,
        10,
        9,
        9,
        10,
        10,
        9,
        11,
        9,
        9,
        10,
        10,
        9,
        10,
        9,
        9,
        8,
        9,
        10,
        9,
        10,
        8,
        10,
        9,
        10,
        9,
        10,
        9,
        10,
        10,
        10,
        11,
        8,
        9,
        10,
        8,
        10,
        10,
        9,
        10,
        11,
        9,
        10,
        8,
        10,
        9,
        9,
        10,
        10,
        10,
        10,
        10,
        10,
        9,
        10,
        9,
        10,
        9,
        8,
        10,
        10,
        11,
        10,
        8,
        10,
        10,
        9,
        10,
        11,
        9,
        10,
        10,
        10,
        10,
        10,
        10,
        11,
        9,
        9,
        9,
        10,
        8,
        11,
        8,
        10,
        10,
        10,
        9,
        10,
        8,
        9,
        9,
        8,
        9,
        9,
        9,
        9,
        9,
        10,
        10,
        10,
        10,
        10,
        10,
        8,
        8,
        9,
        9,
        9,
        10,
        10,
        10,
        10,
        9,
        10,
        10,
        10,
        9,
        10,
        10,
        9,
        9,
        10,
        9,
        10,
        9,
        10,
        9,
        9,
        8,
        9,
        10,
        9,
        9,
        10,
        9,
        8,
        9,
        10,
        10,
        9,
        10,
        10,
        10,
        9,
        10,
        9,
        9,
        8,
        8,
        9,
        10,
        9,
        9,
        9,
        11,
        9,
        11,
        9,
        10,
        10,
        9,
        9,
        10,
        9,
        9,
        10,
        8,
        9,
        10,
        8,
        9,
        8,
        8,
        9,
        9,
        10,
        10,
        9,
        10,
        10,
        10,
        9,
        10,
        11,
        10,
        8,
        9,
        10,
        10,
        9,
        8,
        9,
        10,
        10,
        9,
        9,
        10,
        9,
        9,
        8,
        10,
        10,
        10,
        9,
        11,
        8,
        10,
        9,
        9,
        10,
        8,
        9,
        9,
        9,
        8,
        10,
        10,
        9,
        10,
        10,
        10,
        10,
        10,
        8,
        10,
        10,
        9,
        9,
        10,
        10,
        10,
        10,
        8,
        10,
        9,
        11,
        8,
        9,
        8,
        9,
        8,
        8,
        9,
        10,
        9,
        9,
        9,
        10,
        9,
        9,
        10,
        9,
        10,
        8,
        8,
        9,
        9,
        9,
        9,
        9,
        10,
        9,
        9,
        10,
        8,
        11,
        9,
        9,
        9,
        10,
        9,
        10,
        9,
        8,
        10,
        9,
        10,
        9,
        9,
        10,
        9,
        9,
        10,
        9,
        11,
        10,
        10,
        10,
        9,
        8,
        9,
        8,
        10,
        9,
        10,
        9,
        8,
        10,
        12,
        10,
        10,
        10,
        10,
        10,
        10,
        8,
        9,
        10,
        9,
        9,
        11,
        9,
        9,
        9,
        8,
        10,
        10,
        11,
        9,
        10,
        10,
        11,
        11,
        10,
        9,
        10,
        10,
        11,
        10,
        9,
        9,
        8,
        10,
        10,
        10,
        8,
        9,
        10,
        10,
        10,
        10,
        9,
        10,
        10,
        10,
        10,
        8,
        10,
        8,
        10,
        9,
        10,
        9,
        10,
        9,
        9,
        10,
        10,
        9,
        11,
        10,
        10,
        9,
        9,
        10,
        10,
        9,
        9,
        9,
        10,
        11,
        9,
        10,
        8,
        9,
        9,
        9,
        10,
        11,
        8,
        10,
        9,
        9,
        9,
        9,
        9,
        13,
        10,
        9,
        11,
        9,
        9,
        10,
        11,
        10,
        10,
        9,
        13,
        10,
        9,
        9,
        9,
        11,
        11,
        10,
        9,
        8,
        11,
        10,
        13,
        9,
        13,
        32,
        10,
        24,
        20,
        19,
        13,
        9,
        12,
        11,
        10,
        10,
        13,
        13,
        17,
        28,
        36,
        16,
        23,
        22,
        21,
        11,
        11,
        10,
        18,
        10,
        26,
        12,
        8,
        13,
        10,
        13,
        10,
        10,
        10,
        8,
        10,
        10,
        9,
        15,
        26,
        14,
        11,
        12,
        10,
        9,
        9,
        13,
        13,
        9,
        16,
        12,
        9,
        10,
        11,
        11,
        13,
        13,
        32,
        14,
        31,
        21,
        35,
        17,
        24,
        30,
        49,
        19,
        12,
        24,
        17,
        19,
        11,
        11,
        11,
        14,
        18,
        20,
        17,
        12,
        10,
        20,
        10,
        19,
        37,
        23,
        38,
        31,
        12,
        25,
        78,
        18,
        9,
        24,
        28,
        14,
        19,
        39,
        23,
        33,
        37,
        36,
        44,
        37,
        40,
        62,
        32,
        22,
        56,
        87,
        57,
        67,
        50,
        44,
        98,
        29,
        21,
        74,
        45,
        25,
        70,
        55,
        10,
        74,
        15,
        29,
        28,
        18,
        56,
        180,
        45,
        113,
        53,
        71,
        61,
        54,
        26,
        21,
        86,
        62,
        55,
        45,
        33,
        22,
        50,
        27,
        24,
        31,
        73,
        18,
        20,
        14,
        37,
        80,
        48,
        47,
        45,
        49,
        45,
        21,
        63,
        71,
        74,
        53,
        49,
        89,
        108,
        52,
        72,
        80,
        35,
        21,
        39,
        38,
        44,
        33,
        43,
        55,
        49,
        40,
        25,
        31,
        38,
        55,
        25,
        35,
        44,
        64,
        33,
        42,
        69,
        75,
        67,
        96,
        106,
        76,
        47,
        105,
        12,
        58,
        20,
        50,
        14,
        38,
        39,
        13,
        31,
        22,
        65,
        13,
        32,
        44,
        67,
        52,
        91,
        77,
        65,
        47,
        53,
        48,
        85,
        39,
        63,
        40,
        28,
        58,
        72,
        22,
        18,
        16,
        123,
        22,
        81,
        21,
        71,
        64,
        71,
        68,
        82,
        136,
        109,
        188,
        101,
        107,
        172,
        79,
        51,
        107,
        78,
        25,
        140,
        20,
        119,
        127,
        95,
        87,
        82,
        83,
        78,
        112,
        103,
        101,
        98,
        59,
        62,
        90,
        61,
        52,
        65,
        63,
        97,
        53,
        56,
        111,
        73,
        154,
        60,
        56,
        53,
        59,
        74,
        120,
        109,
        87,
        137,
        86,
        118,
        86,
        103,
        85,
        97,
        64,
        79,
        66,
        75,
        117,
        113,
        194,
        128,
        94,
        62,
        70,
        53,
        43,
        41,
        49,
        11,
        41,
        10,
        43,
        46,
        39,
        50,
        28,
        14,
        27,
        14,
        11,
        38,
        43,
        13,
        33,
        48,
        38,
        16,
        41,
        43,
        53,
        37,
        42,
        30,
        29,
        29,
        14,
        10,
        10,
        40,
        56,
        60,
        55,
        57,
        41,
        52,
        14,
        60,
        85,
        81,
        64,
        59,
        57,
        66,
        82,
        81,
        113,
        89,
        132,
        99,
        159,
        162,
        26,
        168,
        201,
        253,
        292,
        42,
        108,
        336,
        42,
        71,
        86,
        79,
        57,
        86,
        30,
        137,
        74,
        123,
        96,
        500,
        347,
        159,
        244,
        176,
        178,
        183,
        166,
        130,
        108,
        139,
        116,
        121,
        130,
        119,
        159,
        124,
        125,
        135,
        102,
        100,
        101,
        130,
        114,
        106,
        182,
        97,
        151,
        84,
        88,
        166,
        165,
        98,
        206,
        112,
        14,
        237,
        84,
        79,
        124,
        89,
        119,
        96,
        131,
        81,
        118,
        142,
        123,
        143,
        135,
        114,
        153,
        162,
        141,
        151,
        118,
        115,
        137,
        87,
        123,
        137,
        161,
        184,
        73,
        97,
        103,
        115,
        139,
        119,
        162,
        153,
        148,
        148,
        107,
        172,
        110,
        156,
        168,
        170,
        142,
        186,
        189,
        250,
        224,
        235,
        317,
        403,
        500,
        500,
        500,
        500,
        500,
        500,
        500,
        500,
        500,
        98,
        500,
        33,
        500,
        500,
        500,
        500,
        456,
        500,
        500,
        500,
        500,
        32,
        477,
        134,
        500,
        114,
        500,
        110,
        500,
        500,
        500,
        500,
        35,
        94,
        500,
        109,
        93,
        105,
        99,
        128,
        14,
        163,
        500,
        184,
        82,
        118,
        120,
        500,
        167,
        109,
        94,
        231,
        122,
        105,
        28,
        133,
        111,
        114,
        82,
        87,
        83,
        82,
        93,
        95,
        86,
        125,
        75,
        75,
        94,
        91,
        84,
        129,
        96,
        86,
        90,
        88,
        148,
        81,
        115,
        139,
        110,
        169,
        391,
        142,
        119,
        251,
        109,
        104,
        139,
        117,
        111,
        125,
        125,
        139,
        140,
        500,
        207,
        159,
        500,
        500,
        500,
        500,
        500,
        500,
        500,
        500,
        500,
        500,
        500,
        500,
        500,
        500,
        11,
        14,
        66,
        500,
        11,
        17,
        15,
        10,
        14,
        13,
        16,
        16,
        13,
        13,
        16,
        21,
        26,
        17,
        12,
        14,
        18,
        14,
        22,
        18,
        16,
        23,
        12,
        20,
        15,
        19,
        21,
        23,
        25,
        23,
        17,
        36,
        56,
        121,
        101,
        99,
        247,
        93,
        92,
        92,
        247,
        264,
        183,
        427,
        391,
        100,
        500,
        378,
        359,
        101,
        15,
        500,
        500,
        416,
        394,
        87,
        500,
        500,
        200,
        71,
        14,
        22,
        152,
        92,
        142,
        145,
        137,
        144,
        141,
        148,
        151,
        155,
        160,
        15,
        18,
        198,
        177,
        20,
        189,
        188,
        220,
        199,
        209,
        177,
        189,
        183,
        163,
        163,
        163,
        160,
        155,
        156,
        17,
        146,
        18,
        13,
        17,
        18,
        149,
        149,
        15,
        18,
        148,
        147,
        18,
        155,
        152,
        150,
        140,
        145,
        156,
        150,
        142,
        157,
        150,
        161,
        170,
        158,
        178,
        157,
        163,
        164,
        171,
        172,
        172,
        163,
        157,
        159,
        161,
        187,
        177,
        188,
        175,
        185,
        184,
        200,
        217,
        229,
        213,
        215,
        239,
        242,
        251,
        221,
        253,
        229,
        233,
        242,
        228,
        213,
        236,
        244,
        285,
        280,
        282,
        263,
        256,
        222,
        293,
        264,
        342,
        283,
        282,
        282,
        323,
        290,
        304,
        258,
        253,
        246,
        281,
        281,
        276,
        233,
        236,
        205,
        208,
        266,
        277,
        337,
        434,
        246,
        256,
        269,
        253,
        240,
        208,
        211,
        201,
        229,
        262,
        256,
        263,
        362,
        441,
        500,
        500,
        500,
        449,
        373,
        355,
        500,
        500,
        500,
        500,
        500,
        500,
        500,
        500,
        500,
        500,
        500,
        500,
        500,
        500,
        500,
        500,
        500,
        500,
        500,
        500,
        500,
        500,
        500,
        500,
        500,
        500,
        500,
        500,
        500,
        500,
        500,
        500,
        500,
        500,
        500,
        500,
        500,
        500,
        500,
        500,
        500,
        500,
        500,
        500,
        500,
        500,
        500,
        500,
        500,
        500,
        500,
        500,
        500,
        500,
        500,
        500,
        500,
        500,
        500,
        500,
        500,
        500,
        500,
        500,
        500,
        500,
        500,
        500,
        500,
        500,
        500,
        500,
        500,
        500,
        500,
        500,
        500,
        500,
        500,
        500,
        500,
        232,
        248,
        194,
        243,
        148,
        243,
        97,
        86,
        91,
        73,
        75,
        17,
        32,
        27,
        54,
        48,
        29,
        20,
        34,
        29,
        26,
        24,
        38,
        38,
        20,
        26,
        27,
        32,
        43,
        25,
        26,
        45,
        70,
        50,
        14,
        23,
        25,
        42,
        75,
        55,
        52,
        70,
        83,
        36,
        14,
        49,
        70,
        55,
        37,
        69,
        72,
        60,
        64,
        60,
        90,
        54,
        90,
        42,
        82,
        45,
        70,
        39,
        37,
        60,
        34,
        34,
        50,
        50,
        46,
        40,
        62,
        45,
        57,
        42,
        83,
        35,
        46,
        67,
        47,
        86,
        44,
        50,
        43,
        60,
        68,
        51,
        42,
        49,
        70,
        43,
        56,
        45,
        44,
        35,
        51,
        35,
        155,
        39,
        36,
        38,
        83,
        500,
        61,
        49,
        41,
        61,
        500,
        54,
        48,
        43,
        39,
        62,
        48,
        61,
        85,
        85,
        53,
        63,
        46,
        52,
        42,
        53,
        49,
        91,
        45,
        35,
        32,
        49,
        173,
        50,
        37,
        42,
        40,
        500,
        500,
        45,
        43,
        58,
        68,
        27,
        56,
        500,
        500,
        500,
        118,
        88,
        500,
        62,
        57,
        500,
        72,
        67,
        500,
        26,
        100,
        46,
        37,
        57,
        55,
        500,
        57,
        42,
        62,
        43,
        40,
        41,
        56,
        149,
        37,
        82,
        51,
        57,
        31,
        38,
        61,
        39,
        29,
        57,
        40,
        48,
        37,
        42,
        500,
        108,
        86,
        34,
        52,
        116,
        500,
        500,
        117,
        38,
        48,
        500,
        51,
        53,
        500,
        39,
        41,
        48,
        66,
        51,
        500,
        500,
        94,
        47,
        53,
        94,
        90,
        500,
        50,
        500,
        500,
        500,
        56,
        61,
        87,
        41,
        500,
        500,
        500,
        500,
        89,
        106,
        68,
        59,
        137,
        46,
        51,
        500,
        500,
        500,
        106,
        67,
        95,
        52,
        500,
        47,
        63,
        52,
        92,
        43,
        47,
        47,
        500,
        126,
        53,
        103,
        500,
        39,
        500,
        93,
        500,
        164,
        66,
        47,
        58,
        84,
        49,
        44,
        79,
        41,
        76,
        166,
        66,
        45,
        70,
        55,
        58,
        40,
        44,
        77,
        65,
        51,
        49,
        42,
        84,
        55,
        48,
        46,
        37,
        40,
        34,
        53,
        62,
        52,
        65,
        47,
        70,
        85,
        54,
        67,
        46,
        46,
        46,
        51,
        38,
        78,
        66,
        39,
        51,
        93,
        53,
        32,
        71,
        35,
        96,
        39,
        35,
        44,
        43,
        46,
        60,
        46,
        56,
        41,
        31,
        43,
        52,
        60,
        53,
        45,
        69,
        61,
        51,
        79,
        58,
        37,
        82,
        43,
        33,
        36,
        46,
        38,
        31,
        51,
        45,
        66,
        56,
        75,
        48,
        40,
        44,
        34,
        51,
        71,
        107,
        500,
        65,
        44,
        39,
        46,
        34,
        37,
        86,
        54,
        37,
        41,
        61,
        44,
        40,
        58,
        65,
        36,
        39,
        72,
        31,
        50,
        58,
        43,
        43,
        57,
        30,
        31,
        36,
        46,
        58,
        41,
        46,
        39,
        29,
        34,
        55,
        31,
        61,
        43,
        52,
        47,
        54,
        67,
        46,
        46,
        48,
        30,
        32,
        43,
        61,
        58,
        30,
        33,
        32,
        25,
        39,
        46,
        43,
        30,
        51,
        34,
        56,
        41,
        48,
        41,
        34,
        69,
        48,
        47,
        29,
        33,
        79,
        86,
        46,
        55,
        58,
        38,
        22,
        60,
        46,
        34,
        39,
        40,
        47,
        51,
        62,
        48,
        41,
        86,
        30,
        78,
        30,
        35,
        82,
        71,
        93,
        86,
        25,
        29,
        34,
        33,
        17,
        39,
        55,
        22,
        31,
        34,
        50,
        25,
        39,
        16,
        24,
        43,
        42,
        28,
        37,
        53,
        26,
        34,
        69,
        29,
        38,
        44,
        51,
        35,
        42,
        31,
        49,
        50,
        52,
        55,
        56,
        80,
        57,
        41,
        62,
        53,
        59,
        500,
        77,
        46,
        115,
        57,
        275,
        43,
        38,
        32,
        64,
        60,
        34,
        34,
        31,
        130,
        96,
        40,
        38,
        55,
        54,
        39,
        67,
        36,
        156,
        62,
        62,
        34,
        26,
        63,
        37,
        120,
        60,
        38,
        68,
        58,
        231,
        500,
        56,
        51,
        93,
        500,
        62,
        500,
        83,
        500,
        102,
        46,
        500,
        500,
        50,
        146,
        84,
        500,
        93,
        500,
        76,
        500,
        500,
        500,
        500,
        500,
        500,
        38,
        38,
        61,
        69,
        71,
        500,
        49,
        65,
        152,
        131,
        42,
        45,
        149,
        37,
        47,
        15,
        33,
        41,
        41,
        57,
        31,
        25,
        10,
        34,
        68,
        60,
        32,
        43,
        38,
        42,
        48,
        28,
        43,
        37,
        48,
        38,
        35,
        49,
        13,
        32,
        93,
        52,
        42,
        61,
        95,
        48,
        62,
        43,
        500,
        26,
        121,
        180,
        500,
        113,
        196,
        53,
        500,
        73,
        60,
        500,
        161,
        116,
        500,
        500,
        70,
        500,
        500,
        79,
        235,
        81,
        500,
        54,
        319,
        57,
        500,
        224,
        49,
        101,
        39,
        500,
        500,
        500,
        154,
        59,
        208,
        75,
        135,
        189,
        51,
        121,
        74,
        47,
        53,
        68,
        57,
        500,
        93,
        170,
        53,
        96,
        80,
        81,
        51,
        44,
        44,
        89,
        80,
        58,
        88,
        93,
        72,
        64,
        68,
        53,
        57,
        81,
        68,
        66,
        76,
        165,
        88,
        71,
        64,
        55,
        68,
        85,
        60,
        53,
        91,
        131,
        133,
        79,
        41,
        61,
        79,
        208,
        65,
        52,
        54,
        60,
        52,
        69,
        74,
        46,
        86,
        77,
        500,
        62,
        71,
        61,
        87,
        500,
        107,
        78,
        500,
        500,
        500,
        500,
        104,
        500,
        144,
        69,
        83,
        500,
        68,
        74,
        88,
        99,
        74,
        143,
        96,
        121,
        101,
        135,
        90,
        96,
        119,
        97,
        84,
        101,
        102,
        129,
        80,
        104,
        231,
        162,
        151,
        108,
        117,
        118,
        143,
        104,
        142,
        122,
        155,
        139,
        166,
        500,
        168,
        154,
        236,
        128,
        161,
        107,
        119,
        114,
        132,
        95,
        141,
        111,
        107,
        212,
        142,
        157,
        132,
        162,
        369,
        123,
        135,
        182,
        172,
        255,
        148,
        247,
        231,
        500,
        500,
        292,
        500,
        500,
        500,
        500,
        500,
        500,
        500,
        500,
        500,
        500,
        500,
        500,
        500,
        500,
        500,
        500,
        500,
        500,
        500,
        500,
        500,
        500,
        500,
        500,
        500,
        500,
        500,
        500,
        500,
        500,
        500,
        500,
        500,
        500,
        500,
        500,
        500,
        500,
        500,
        500,
        500,
        500,
        500,
        500,
        500,
        500,
        500,
        500,
        500,
        500,
        500,
        500,
        500,
        500,
        500,
        500,
        500,
        500,
        500,
        500,
        234,
        171,
        500,
        172,
        77,
        500,
        116,
        240,
        399,
        312,
        500,
        500,
        500,
        500,
        500,
        500,
        500,
        500,
        500,
        500,
        500,
        500,
        500,
        500,
        500,
        500,
        500,
        500,
        500,
        500,
        500,
        500,
        500,
        500,
        500,
        500,
        500
    ],
    "durations": [
        1.347986,
        0.002985,
        0.020999,
        0.005001,
        0.006001,
        0.006,
        0.004,
        0.003,
        0.002999,
        0.003001,
        0.003,
        0.002999,
        0.004001,
        0.002999,
        0.004003,
        0.003,
        0.002997,
        0.003,
        0.002999,
        0.003,
        0.004001,
        0.004001,
        0.003001,
        0.002997,
        0.003002,
        0.002998,
        0.003001,
        0.002999,
        0.004001,
        0.002999,
        0.003,
        0.003001,
        0.002002,
        0.003,
        0.003,
        0.002997,
        0.003001,
        0.002999,
        0.003,
        0.003,
        0.004001,
        0.002997,
        0.003,
        0.003002,
        0.003999,
        0.003,
        0.003001,
        0.001998,
        0.001999,
        0.004001,
        0.003001,
        0.002999,
        0.002999,
        0.003,
        0.004001,
        0.003,
        0.003014,
        0.002,
        0.002998,
        0.003001,
        0.002999,
        0.003,
        0.003,
        0.002999,
        0.003002,
        0.003,
        0.002997,
        0.003003,
        0.002998,
        0.003999,
        0.003001,
        0.002999,
        0.003,
        0.003006,
        0.002995,
        0.001999,
        0.002995,
        0.003002,
        0.002999,
        0.003,
        0.003,
        0.003001,
        0.002999,
        0.002999,
        0.002001,
        0.002001,
        0.003,
        0.003,
        0.003,
        0.002,
        0.002,
        0.003001,
        0.003002,
        0.002996,
        0.003,
        0.003,
        0.003,
        0.003001,
        0.002999,
        0.004001,
        0.002999,
        0.003003,
        0.002997,
        0.003001,
        0.003001,
        0.002997,
        0.003001,
        0.002,
        0.003002,
        0.002999,
        0.003001,
        0.002999,
        0.003001,
        0.003,
        0.002001,
        0.001999,
        0.003,
        0.002001,
        0.002999,
        0.003,
        0.003001,
        0.003,
        0.002998,
        0.003001,
        0.001999,
        0.003001,
        0.002999,
        0.004001,
        0.002999,
        0.003003,
        0.002,
        0.003,
        0.003,
        0.003009,
        0.002992,
        0.003999,
        0.003001,
        0.002999,
        0.003001,
        0.003,
        0.003999,
        0.004999,
        0.002976,
        0.003,
        0.003003,
        0.003997,
        0.004,
        0.003,
        0.003001,
        0.002999,
        0.004001,
        0.002999,
        0.003,
        0.003,
        0.002001,
        0.003,
        0.003,
        0.002999,
        0.003002,
        0.002999,
        0.003002,
        0.002997,
        0.003,
        0.003,
        0.003,
        0.003,
        0.003,
        0.003,
        0.003,
        0.003,
        0.003,
        0.003,
        0.002997,
        0.002,
        0.001999,
        0.002,
        0.002998,
        0.004002,
        0.004,
        0.003,
        0.003002,
        0.002002,
        0.003,
        0.001999,
        0.002003,
        0.002999,
        0.003001,
        0.002999,
        0.003,
        0.003,
        0.002999,
        0.003002,
        0.003001,
        0.002998,
        0.003,
        0.003003,
        0.002996,
        0.002998,
        0.003002,
        0.002998,
        0.003,
        0.004989,
        0.002999,
        0.003997,
        0.003,
        0.002,
        0.003,
        0.004001,
        0.002999,
        0.003,
        0.003001,
        0.002996,
        0.001998,
        0.003,
        0.002999,
        0.004001,
        0.003001,
        0.002999,
        0.002,
        0.002999,
        0.003001,
        0.003,
        0.002999,
        0.002677,
        0.003999,
        0.002999,
        0.003,
        0.003,
        0.003001,
        0.003,
        0.002999,
        0.003,
        0.003001,
        0.003,
        0.002999,
        0.003001,
        0.003003,
        0.002985,
        0.003002,
        0.002997,
        0.001999,
        0.002,
        0.002999,
        0.003002,
        0.002001,
        0.003999,
        0.003001,
        0.002999,
        0.003001,
        0.003002,
        0.002001,
        0.001999,
        0.001999,
        0.003999,
        0.002002,
        0.003,
        0.003,
        0.003001,
        0.002999,
        0.003001,
        0.003,
        0.002998,
        0.003,
        0.003,
        0.003,
        0.003,
        0.003,
        0.003004,
        0.002997,
        0.002999,
        0.003002,
        0.002999,
        0.003001,
        0.002001,
        0.002998,
        0.003004,
        0.002997,
        0.003,
        0.002999,
        0.002001,
        0.003002,
        0.002999,
        0.003,
        0.003,
        0.003001,
        0.003001,
        0.002997,
        0.002,
        0.003004,
        0.003,
        0.003001,
        0.002999,
        0.002999,
        0.003001,
        0.003,
        0.002999,
        0.003001,
        0.002999,
        0.003001,
        0.003,
        0.002999,
        0.003,
        0.003003,
        0.002997,
        0.003001,
        0.003,
        0.004002,
        0.003,
        0.002998,
        0.001999,
        0.002998,
        0.002002,
        0.002,
        0.001999,
        0.003,
        0.002002,
        0.001999,
        0.001999,
        0.001999,
        0.002,
        0.003001,
        0.002998,
        0.003001,
        0.002999,
        0.003001,
        0.001998,
        0.001999,
        0.003003,
        0.002998,
        0.003001,
        0.002998,
        0.003003,
        0.003,
        0.002,
        0.002002,
        0.003,
        0.003002,
        0.003999,
        0.002998,
        0.003004,
        0.002997,
        0.004001,
        0.002998,
        0.003,
        0.003,
        0.003,
        0.003,
        0.003001,
        0.001999,
        0.002998,
        0.002,
        0.003,
        0.002002,
        0.002,
        0.003,
        0.003001,
        0.002998,
        0.003002,
        0.002999,
        0.003002,
        0.003,
        0.003,
        0.002998,
        0.002999,
        0.003002,
        0.003,
        0.002999,
        0.004001,
        0.001999,
        0.002,
        0.002,
        0.002001,
        0.003999,
        0.002999,
        0.003,
        0.003002,
        0.003,
        0.003001,
        0.002998,
        0.002002,
        0.002,
        0.002002,
        0.003002,
        0.005,
        0.00399,
        0.003,
        0.003999,
        0.003003,
        0.003,
        0.002001,
        0.002998,
        0.002001,
        0.001998,
        0.002002,
        0.002001,
        0.002999,
        0.004002,
        0.002998,
        0.002999,
        0.003001,
        0.003002,
        0.004001,
        0.002987,
        0.003999,
        0.003999,
        0.003002,
        0.003003,
        0.002998,
        0.004998,
        0.004003,
        0.003011,
        0.002999,
        0.003,
        0.001999,
        0.002,
        0.002001,
        0.002997,
        0.003002,
        0.002998,
        0.002999,
        0.003,
        0.003001,
        0.003002,
        0.002998,
        0.003,
        0.002,
        0.003,
        0.003003,
        0.002997,
        0.002999,
        0.003002,
        0.002,
        0.001998,
        0.001998,
        0.002997,
        0.003,
        0.003,
        0.002999,
        0.003004,
        0.002996,
        0.002999,
        0.002001,
        0.003,
        0.002999,
        0.003003,
        0.002998,
        0.003,
        0.003,
        0.003001,
        0.002998,
        0.003002,
        0.003,
        0.002999,
        0.003001,
        0.003001,
        0.003,
        0.003,
        0.002996,
        0.003002,
        0.002999,
        0.003001,
        0.002003,
        0.002997,
        0.001999,
        0.002002,
        0.002001,
        0.004,
        0.004,
        0.003,
        0.003004,
        0.002996,
        0.001997,
        0.002,
        0.003002,
        0.003998,
        0.002998,
        0.003002,
        0.003,
        0.003002,
        0.002998,
        0.001998,
        0.003,
        0.002001,
        0.002,
        0.002002,
        0.003,
        0.002998,
        0.003001,
        0.003,
        0.002998,
        0.003003,
        0.002999,
        0.002998,
        0.003004,
        0.002002,
        0.001999,
        0.003,
        0.002998,
        0.003002,
        0.002999,
        0.003,
        0.003004,
        0.002999,
        0.002999,
        0.002997,
        0.003003,
        0.001999,
        0.003001,
        0.002002,
        0.002,
        0.003,
        0.002997,
        0.002,
        0.003001,
        0.002998,
        0.003003,
        0.002998,
        0.003001,
        0.002998,
        0.003003,
        0.003998,
        0.003001,
        0.001998,
        0.002002,
        0.001998,
        0.002999,
        0.001999,
        0.002,
        0.003,
        0.003,
        0.002998,
        0.003,
        0.003,
        0.002998,
        0.002001,
        0.001999,
        0.002,
        0.002999,
        0.003008,
        0.002991,
        0.001998,
        0.003,
        0.003003,
        0.002997,
        0.002999,
        0.002999,
        0.004004,
        0.002997,
        0.003,
        0.002999,
        0.003004,
        0.002001,
        0.003,
        0.003001,
        0.003001,
        0.002998,
        0.003,
        0.002999,
        0.002999,
        0.003004,
        0.001996,
        0.002999,
        0.002999,
        0.003,
        0.002001,
        0.003001,
        0.002998,
        0.003,
        0.003,
        0.003001,
        0.003,
        0.003,
        0.003,
        0.001996,
        0.003,
        0.003,
        0.003001,
        0.002002,
        0.002998,
        0.002999,
        0.003001,
        0.002999,
        0.003001,
        0.002996,
        0.004004,
        0.003997,
        0.003999,
        0.002985,
        0.002999,
        0.003001,
        0.003002,
        0.002997,
        0.003002,
        0.003001,
        0.001998,
        0.001999,
        0.003001,
        0.002998,
        0.002,
        0.002,
        0.001999,
        0.004983,
        0.004013,
        0.002988,
        0.003999,
        0.003001,
        0.003,
        0.003001,
        0.003,
        0.004001,
        0.001998,
        0.002983,
        0.004002,
        0.004001,
        0.002983,
        0.003,
        0.003,
        0.003,
        0.004,
        0.004,
        0.003,
        0.003,
        0.003,
        0.003002,
        0.003,
        0.003,
        0.002999,
        0.003,
        0.003002,
        0.003004,
        0.002994,
        0.003004,
        0.002995,
        0.003001,
        0.005002,
        0.004999,
        0.003,
        0.004001,
        0.003999,
        0.003,
        0.003,
        0.002999,
        0.004009,
        0.002998,
        0.002999,
        0.003002,
        0.002999,
        0.005001,
        0.004,
        0.002999,
        0.003004,
        0.002997,
        0.003999,
        0.003,
        0.003001,
        0.003,
        0.004999,
        0.004001,
        0.003004,
        0.003997,
        0.003001,
        0.003998,
        0.003002,
        0.006005,
        0.005994,
        0.004,
        0.003998,
        0.003003,
        0.003,
        0.003991,
        0.005001,
        0.002998,
        0.003001,
        0.003993,
        0.003999,
        0.003003,
        0.002997,
        0.005002,
        0.003001,
        0.003998,
        0.003,
        0.003,
        0.005,
        0.002999,
        0.003001,
        0.002,
        0.004002,
        0.003998,
        0.003,
        0.002999,
        0.003002,
        0.003999,
        0.004001,
        0.004999,
        0.003002,
        0.004001,
        0.004001,
        0.002997,
        0.003003,
        0.003005,
        0.003995,
        0.003003,
        0.002999,
        0.002001,
        0.003,
        0.003,
        0.003001,
        0.003,
        0.003,
        0.003,
        0.004,
        0.004,
        0.003988,
        0.004997,
        0.003999,
        0.003999,
        0.003001,
        0.003,
        0.003,
        0.003001,
        0.004001,
        0.003991,
        0.003999,
        0.003999,
        0.003,
        0.003,
        0.004001,
        0.001998,
        0.002002,
        0.002999,
        0.004002,
        0.004001,
        0.002999,
        0.002,
        0.003,
        0.004001,
        0.002999,
        0.003001,
        0.003001,
        0.003,
        0.005002,
        0.002999,
        0.003003,
        0.003,
        0.003998,
        0.003999,
        0.004003,
        0.002996,
        0.004,
        0.01,
        0.003002,
        0.008999,
        0.008003,
        0.007997,
        0.005002,
        0.005,
        0.004999,
        0.003,
        0.003002,
        0.002998,
        0.005999,
        0.005003,
        0.004999,
        0.007997,
        0.01,
        0.005001,
        0.006999,
        0.007,
        0.005999,
        0.003999,
        0.003001,
        0.003,
        0.005001,
        0.003,
        0.008999,
        0.004001,
        0.002998,
        0.004002,
        0.003001,
        0.003999,
        0.002999,
        0.001999,
        0.003001,
        0.003001,
        0.003,
        0.002998,
        0.003,
        0.005001,
        0.006999,
        0.004001,
        0.003,
        0.004,
        0.003,
        0.003,
        0.003,
        0.004001,
        0.003999,
        0.003001,
        0.005,
        0.002999,
        0.003,
        0.004984,
        0.005001,
        0.005001,
        0.003999,
        0.005,
        0.011,
        0.004,
        0.007999,
        0.006001,
        0.011999,
        0.005997,
        0.007,
        0.009002,
        0.013999,
        0.005001,
        0.002999,
        0.010001,
        0.004998,
        0.006001,
        0.003,
        0.003,
        0.002999,
        0.004,
        0.004999,
        0.006,
        0.005,
        0.004,
        0.003001,
        0.004999,
        0.003001,
        0.006998,
        0.010003,
        0.006997,
        0.014999,
        0.009002,
        0.003001,
        0.007,
        0.022002,
        0.007999,
        0.004003,
        0.006995,
        0.010003,
        0.004996,
        0.006002,
        0.010998,
        0.006988,
        0.008999,
        0.013001,
        0.009997,
        0.011986,
        0.011622,
        0.011983,
        0.018004,
        0.010999,
        0.007377,
        0.017001,
        0.028006,
        0.020976,
        0.020002,
        0.014002,
        0.014998,
        0.029003,
        0.008999,
        0.006999,
        0.024001,
        0.013346,
        0.007,
        0.02,
        0.018003,
        0.002996,
        0.023002,
        0.004997,
        0.012001,
        0.008,
        0.007004,
        0.016985,
        0.053999,
        0.013003,
        0.030984,
        0.017003,
        0.022,
        0.018003,
        0.018999,
        0.008001,
        0.006996,
        0.025001,
        0.017999,
        0.016004,
        0.011984,
        0.009,
        0.006999,
        0.023002,
        0.017001,
        0.008997,
        0.00899,
        0.020998,
        0.005,
        0.006001,
        0.005002,
        0.010991,
        0.024001,
        0.016,
        0.013,
        0.013,
        0.013999,
        0.012002,
        0.005,
        0.017003,
        0.018985,
        0.021999,
        0.016002,
        0.014999,
        0.026001,
        0.045001,
        0.020999,
        0.029,
        0.032001,
        0.013,
        0.008001,
        0.014002,
        0.013998,
        0.015,
        0.011001,
        0.013,
        0.017999,
        0.017,
        0.014,
        0.009001,
        0.010999,
        0.010999,
        0.016,
        0.008,
        0.012,
        0.018002,
        0.024998,
        0.012001,
        0.017,
        0.064002,
        0.064998,
        0.029002,
        0.033997,
        0.034998,
        0.03,
        0.019,
        0.038999,
        0.004,
        0.02,
        0.006001,
        0.013999,
        0.004001,
        0.009999,
        0.011001,
        0.003,
        0.008001,
        0.006,
        0.02,
        0.005001,
        0.012999,
        0.016001,
        0.022001,
        0.017,
        0.026997,
        0.026999,
        0.019,
        0.014999,
        0.017999,
        0.015006,
        0.033996,
        0.014,
        0.020999,
        0.011,
        0.007,
        0.015999,
        0.020002,
        0.006003,
        0.005001,
        0.004998,
        0.033025,
        0.005987,
        0.020999,
        0.005984,
        0.018984,
        0.017964,
        0.019999,
        0.018998,
        0.023003,
        0.036001,
        0.031002,
        0.049998,
        0.027,
        0.029003,
        0.044997,
        0.022001,
        0.014999,
        0.029001,
        0.020998,
        0.006999,
        0.039012,
        0.005999,
        0.031996,
        0.035986,
        0.025999,
        0.024999,
        0.022002,
        0.022001,
        0.020998,
        0.031,
        0.028004,
        0.028,
        0.026999,
        0.016001,
        0.016997,
        0.023999,
        0.017002,
        0.014001,
        0.018998,
        0.018016,
        0.024984,
        0.015001,
        0.016999,
        0.034999,
        0.02,
        0.039998,
        0.017003,
        0.014998,
        0.015,
        0.016001,
        0.019003,
        0.031999,
        0.031997,
        0.023002,
        0.036,
        0.023,
        0.03,
        0.022002,
        0.026001,
        0.022001,
        0.024998,
        0.018001,
        0.021,
        0.018,
        0.020003,
        0.029996,
        0.030004,
        0.049999,
        0.031999,
        0.025001,
        0.017482,
        0.019011,
        0.014,
        0.012104,
        0.012002,
        0.012999,
        0.003002,
        0.010997,
        0.003002,
        0.010996,
        0.012002,
        0.010999,
        0.014002,
        0.006999,
        0.003999,
        0.007001,
        0.003999,
        0.003001,
        0.009999,
        0.012,
        0.004,
        0.011003,
        0.012997,
        0.010002,
        0.004996,
        0.011004,
        0.010984,
        0.013986,
        0.010001,
        0.011999,
        0.010001,
        0.008997,
        0.008,
        0.004002,
        0.003001,
        0.002999,
        0.011002,
        0.015,
        0.016002,
        0.014997,
        0.015999,
        0.012001,
        0.013999,
        0.004001,
        0.015985,
        0.022,
        0.024,
        0.019003,
        0.016997,
        0.017001,
        0.02,
        0.024002,
        0.022997,
        0.031003,
        0.024997,
        0.034987,
        0.027001,
        0.043002,
        0.043991,
        0.008005,
        0.044985,
        0.054002,
        0.069983,
        0.082005,
        0.010996,
        0.029,
        0.088003,
        0.011998,
        0.019029,
        0.024,
        0.022002,
        0.016,
        0.026004,
        0.010963,
        0.036002,
        0.019998,
        0.032003,
        0.024996,
        0.142003,
        0.092999,
        0.041999,
        0.066002,
        0.045999,
        0.046999,
        0.046001,
        0.041,
        0.033004,
        0.027996,
        0.036,
        0.029998,
        0.032,
        0.034998,
        0.033002,
        0.040001,
        0.031998,
        0.036001,
        0.035997,
        0.030001,
        0.030004,
        0.027,
        0.033991,
        0.029999,
        0.032003,
        0.060999,
        0.029003,
        0.040999,
        0.022984,
        0.026997,
        0.046,
        0.048,
        0.027,
        0.066,
        0.030991,
        0.004999,
        0.064,
        0.027001,
        0.022998,
        0.033003,
        0.022998,
        0.033998,
        0.029008,
        0.03801,
        0.024983,
        0.030002,
        0.041997,
        0.032016,
        0.039986,
        0.032982,
        0.029985,
        0.040016,
        0.040985,
        0.039,
        0.043002,
        0.038997,
        0.038,
        0.041999,
        0.024,
        0.032002,
        0.034001,
        0.047012,
        0.055988,
        0.021997,
        0.034,
        0.034999,
        0.035993,
        0.042003,
        0.035,
        0.046997,
        0.041002,
        0.038001,
        0.037998,
        0.028,
        0.044999,
        0.029985,
        0.039998,
        0.042984,
        0.051004,
        0.046002,
        0.055984,
        0.051,
        0.066002,
        0.068001,
        0.063,
        0.082999,
        0.108003,
        0.133001,
        0.132995,
        0.139002,
        0.141998,
        0.136999,
        0.130998,
        0.134999,
        0.133001,
        0.132913,
        0.025,
        0.131001,
        0.008999,
        0.132003,
        0.139002,
        0.132328,
        0.131,
        0.119003,
        0.132,
        0.132001,
        0.135,
        0.134002,
        0.008988,
        0.127998,
        0.035,
        0.131985,
        0.028999,
        0.135,
        0.028999,
        0.134,
        0.133999,
        0.136003,
        0.143001,
        0.010001,
        0.024983,
        0.146001,
        0.034003,
        0.025998,
        0.029002,
        0.029001,
        0.036985,
        0.005002,
        0.047997,
        0.147001,
        0.051999,
        0.023004,
        0.033997,
        0.035002,
        0.133001,
        0.044999,
        0.033001,
        0.025001,
        0.060998,
        0.033004,
        0.027996,
        0.009001,
        0.035002,
        0.029997,
        0.031,
        0.022,
        0.023004,
        0.023105,
        0.022003,
        0.024998,
        0.025001,
        0.023,
        0.034,
        0.021001,
        0.021001,
        0.025302,
        0.024625,
        0.021998,
        0.035003,
        0.024997,
        0.024,
        0.024003,
        0.022997,
        0.037001,
        0.021,
        0.029,
        0.035,
        0.028999,
        0.041996,
        0.101,
        0.041998,
        0.033002,
        0.068998,
        0.030001,
        0.027999,
        0.036996,
        0.031002,
        0.030001,
        0.033999,
        0.032998,
        0.036,
        0.036999,
        0.134985,
        0.056002,
        0.041001,
        0.140997,
        0.146995,
        0.145002,
        0.141,
        0.138002,
        0.131999,
        0.15,
        0.139,
        0.133001,
        0.132999,
        0.133997,
        0.151004,
        0.132998,
        0.138002,
        0.003989,
        0.004001,
        0.017,
        0.137999,
        0.003,
        0.004996,
        0.004001,
        0.003,
        0.004002,
        0.003997,
        0.005,
        0.004999,
        0.004,
        0.004002,
        0.004998,
        0.006,
        0.008002,
        0.005002,
        0.002997,
        0.004,
        0.005996,
        0.004004,
        0.007005,
        0.005992,
        0.004001,
        0.005998,
        0.003001,
        0.004998,
        0.003996,
        0.006,
        0.006003,
        0.006996,
        0.007003,
        0.007998,
        0.005016,
        0.009989,
        0.014999,
        0.033,
        0.026996,
        0.026001,
        0.067001,
        0.026998,
        0.024999,
        0.025002,
        0.069001,
        0.069983,
        0.049001,
        0.120001,
        0.105003,
        0.032998,
        0.151999,
        0.135999,
        0.09999,
        0.029003,
        0.008,
        0.147986,
        0.138986,
        0.111997,
        0.103984,
        0.026004,
        0.140997,
        0.137003,
        0.053999,
        0.019002,
        0.003997,
        0.005998,
        0.039,
        0.025998,
        0.038996,
        0.04,
        0.037001,
        0.042002,
        0.041985,
        0.041998,
        0.040996,
        0.043001,
        0.042,
        0.005,
        0.007004,
        0.056974,
        0.053995,
        0.008,
        0.049999,
        0.053983,
        0.063003,
        0.052001,
        0.053997,
        0.043983,
        0.048,
        0.046999,
        0.042003,
        0.043,
        0.040998,
        0.042003,
        0.041999,
        0.042999,
        0.005,
        0.036999,
        0.006001,
        0.003999,
        0.005001,
        0.004998,
        0.037001,
        0.043999,
        0.005002,
        0.005003,
        0.039236,
        0.038002,
        0.004999,
        0.040002,
        0.041001,
        0.038001,
        0.046999,
        0.045,
        0.050989,
        0.048996,
        0.055002,
        0.072999,
        0.045998,
        0.057999,
        0.056,
        0.05,
        0.052,
        0.048001,
        0.045998,
        0.050001,
        0.068,
        0.075001,
        0.054997,
        0.048,
        0.047999,
        0.048001,
        0.047,
        0.055,
        0.054999,
        0.056001,
        0.051001,
        0.059999,
        0.057,
        0.062,
        0.065,
        0.073,
        0.072998,
        0.057,
        0.067015,
        0.087985,
        0.083001,
        0.064999,
        0.077,
        0.066999,
        0.072999,
        0.071999,
        0.069999,
        0.064002,
        0.071998,
        0.075001,
        0.087999,
        0.095,
        0.099998,
        0.087006,
        0.087,
        0.076995,
        0.087,
        0.079001,
        0.120011,
        0.088987,
        0.089,
        0.091001,
        0.112001,
        0.094,
        0.093997,
        0.08,
        0.081001,
        0.086,
        0.09,
        0.081996,
        0.080999,
        0.070999,
        0.076001,
        0.067,
        0.060001,
        0.080999,
        0.073003,
        0.088996,
        0.118003,
        0.061984,
        0.065997,
        0.067999,
        0.065003,
        0.061,
        0.053002,
        0.054066,
        0.051001,
        0.058001,
        0.067998,
        0.077002,
        0.088998,
        0.098988,
        0.114985,
        0.133991,
        0.137996,
        0.178985,
        0.156,
        0.104004,
        0.096995,
        0.147999,
        0.15,
        0.138008,
        0.135999,
        0.134999,
        0.130002,
        0.130001,
        0.128003,
        0.130999,
        0.134999,
        0.134001,
        0.131998,
        0.128996,
        0.132998,
        0.133984,
        0.132005,
        0.130982,
        0.132987,
        0.131,
        0.132,
        0.132983,
        0.140003,
        0.146004,
        0.143985,
        0.138998,
        0.140006,
        0.139008,
        0.136985,
        0.145005,
        0.131997,
        0.129995,
        0.130001,
        0.130999,
        0.133003,
        0.133997,
        0.133001,
        0.13197,
        0.131002,
        0.134,
        0.131002,
        0.130985,
        0.131001,
        0.13,
        0.132,
        0.133001,
        0.136984,
        0.131999,
        0.135003,
        0.132998,
        0.134,
        0.136002,
        0.130001,
        0.134998,
        0.136,
        0.144,
        0.139001,
        0.137001,
        0.131986,
        0.144998,
        0.135,
        0.128999,
        0.131999,
        0.130997,
        0.136,
        0.131003,
        0.135996,
        0.133,
        0.129998,
        0.132002,
        0.129999,
        0.132,
        0.135003,
        0.129999,
        0.132002,
        0.133001,
        0.131001,
        0.131,
        0.132995,
        0.135002,
        0.130002,
        0.130982,
        0.059002,
        0.063,
        0.049,
        0.062002,
        0.036998,
        0.061002,
        0.024984,
        0.023001,
        0.023999,
        0.019,
        0.019999,
        0.005,
        0.007998,
        0.007001,
        0.013998,
        0.013,
        0.008002,
        0.005999,
        0.009,
        0.008001,
        0.006999,
        0.005986,
        0.010001,
        0.009998,
        0.005999,
        0.007001,
        0.007999,
        0.008,
        0.010986,
        0.006999,
        0.006999,
        0.011999,
        0.019001,
        0.014,
        0.005001,
        0.006,
        0.007002,
        0.010339,
        0.018999,
        0.014001,
        0.012998,
        0.020002,
        0.021998,
        0.012,
        0.005002,
        0.01413,
        0.018003,
        0.014996,
        0.010002,
        0.018,
        0.020002,
        0.015997,
        0.017003,
        0.016,
        0.023999,
        0.013999,
        0.025002,
        0.010984,
        0.021,
        0.011999,
        0.018003,
        0.009999,
        0.009999,
        0.017,
        0.010016,
        0.008984,
        0.013,
        0.013,
        0.012002,
        0.01,
        0.015544,
        0.011002,
        0.015014,
        0.010986,
        0.020325,
        0.008997,
        0.011986,
        0.017,
        0.012998,
        0.023003,
        0.011999,
        0.013999,
        0.011001,
        0.015997,
        0.018002,
        0.014002,
        0.011,
        0.012997,
        0.017001,
        0.011002,
        0.014001,
        0.012001,
        0.012,
        0.008999,
        0.014,
        0.008998,
        0.04,
        0.010998,
        0.009999,
        0.009998,
        0.020985,
        0.130999,
        0.016986,
        0.013001,
        0.012001,
        0.015998,
        0.130999,
        0.013985,
        0.013002,
        0.011997,
        0.010001,
        0.016001,
        0.014,
        0.015998,
        0.022002,
        0.022,
        0.014002,
        0.018998,
        0.013002,
        0.014,
        0.010998,
        0.015,
        0.013002,
        0.022996,
        0.011984,
        0.009002,
        0.009,
        0.013001,
        0.044,
        0.014,
        0.009999,
        0.012002,
        0.01,
        0.129996,
        0.132004,
        0.012002,
        0.011998,
        0.015002,
        0.017001,
        0.007,
        0.014986,
        0.136001,
        0.133001,
        0.136001,
        0.030002,
        0.023001,
        0.134997,
        0.016002,
        0.014998,
        0.137,
        0.019998,
        0.018003,
        0.135,
        0.008,
        0.026997,
        0.013001,
        0.010999,
        0.016005,
        0.016001,
        0.132001,
        0.015,
        0.010999,
        0.017002,
        0.011,
        0.010002,
        0.010002,
        0.013984,
        0.038,
        0.010001,
        0.022999,
        0.013998,
        0.015,
        0.008,
        0.009999,
        0.017999,
        0.010001,
        0.007998,
        0.014999,
        0.010999,
        0.015004,
        0.009998,
        0.013001,
        0.132001,
        0.027999,
        0.022999,
        0.008999,
        0.014,
        0.030002,
        0.132997,
        0.137,
        0.031998,
        0.01,
        0.012999,
        0.130999,
        0.014003,
        0.013996,
        0.133002,
        0.010999,
        0.011,
        0.013001,
        0.017001,
        0.013999,
        0.139002,
        0.133999,
        0.025999,
        0.012003,
        0.014998,
        0.024,
        0.022999,
        0.143999,
        0.012999,
        0.143984,
        0.137002,
        0.139,
        0.015982,
        0.015984,
        0.021998,
        0.011002,
        0.136999,
        0.135003,
        0.133998,
        0.130001,
        0.022997,
        0.027002,
        0.018001,
        0.015001,
        0.034987,
        0.012996,
        0.014003,
        0.130997,
        0.131001,
        0.130999,
        0.027,
        0.016983,
        0.025017,
        0.013986,
        0.131997,
        0.013001,
        0.016,
        0.012999,
        0.024001,
        0.010999,
        0.013003,
        0.012998,
        0.135,
        0.032001,
        0.013999,
        0.025999,
        0.130983,
        0.011004,
        0.133996,
        0.024002,
        0.130001,
        0.040996,
        0.018,
        0.013002,
        0.015,
        0.022998,
        0.014002,
        0.012,
        0.020002,
        0.010987,
        0.019997,
        0.041002,
        0.016998,
        0.012001,
        0.017987,
        0.014001,
        0.015001,
        0.010998,
        0.012003,
        0.022,
        0.016995,
        0.012983,
        0.013002,
        0.011003,
        0.021998,
        0.014999,
        0.011999,
        0.012003,
        0.009996,
        0.011004,
        0.010002,
        0.014996,
        0.016002,
        0.013996,
        0.017001,
        0.013335,
        0.017998,
        0.022003,
        0.013987,
        0.016996,
        0.012002,
        0.011998,
        0.012003,
        0.012997,
        0.01,
        0.022004,
        0.021995,
        0.011,
        0.015,
        0.023999,
        0.013998,
        0.008997,
        0.019,
        0.010001,
        0.027006,
        0.011995,
        0.009996,
        0.012004,
        0.010998,
        0.013003,
        0.015999,
        0.011999,
        0.013998,
        0.009998,
        0.007998,
        0.012003,
        0.013998,
        0.015002,
        0.013998,
        0.012,
        0.017997,
        0.016001,
        0.013,
        0.019999,
        0.016002,
        0.010001,
        0.021001,
        0.010999,
        0.009,
        0.009999,
        0.012002,
        0.010001,
        0.008999,
        0.014001,
        0.012001,
        0.016997,
        0.015002,
        0.018998,
        0.011999,
        0.009983,
        0.011004,
        0.009999,
        0.015,
        0.018,
        0.026998,
        0.135002,
        0.018,
        0.011998,
        0.011,
        0.012998,
        0.009001,
        0.011,
        0.022999,
        0.015,
        0.01,
        0.012001,
        0.017,
        0.011999,
        0.010998,
        0.015002,
        0.018,
        0.010003,
        0.010999,
        0.020999,
        0.010004,
        0.017983,
        0.019,
        0.014002,
        0.013999,
        0.018001,
        0.012999,
        0.009,
        0.010001,
        0.012003,
        0.015999,
        0.011,
        0.011998,
        0.01,
        0.007999,
        0.008,
        0.014999,
        0.009,
        0.016003,
        0.011998,
        0.014,
        0.013002,
        0.015,
        0.017999,
        0.012999,
        0.012001,
        0.013002,
        0.007997,
        0.011004,
        0.011989,
        0.016998,
        0.017016,
        0.011002,
        0.010996,
        0.012001,
        0.007988,
        0.013,
        0.012,
        0.011,
        0.008,
        0.013001,
        0.012998,
        0.016001,
        0.011,
        0.013001,
        0.012,
        0.010003,
        0.018999,
        0.013,
        0.013002,
        0.008999,
        0.009001,
        0.022999,
        0.027002,
        0.013997,
        0.016001,
        0.016998,
        0.011005,
        0.006998,
        0.015998,
        0.013017,
        0.008987,
        0.011,
        0.010984,
        0.014001,
        0.013999,
        0.016001,
        0.013999,
        0.012001,
        0.023998,
        0.009,
        0.022003,
        0.008996,
        0.010003,
        0.020997,
        0.019003,
        0.024001,
        0.024002,
        0.007,
        0.008,
        0.008998,
        0.009002,
        0.005,
        0.011001,
        0.014,
        0.005998,
        0.007999,
        0.008,
        0.013002,
        0.006998,
        0.009998,
        0.005001,
        0.005999,
        0.010998,
        0.010999,
        0.008998,
        0.010002,
        0.014999,
        0.008,
        0.008998,
        0.017999,
        0.008001,
        0.009999,
        0.013002,
        0.013999,
        0.010002,
        0.013013,
        0.009979,
        0.011983,
        0.012986,
        0.013984,
        0.014999,
        0.015002,
        0.020999,
        0.015003,
        0.010983,
        0.016001,
        0.014,
        0.01598,
        0.132,
        0.021998,
        0.013001,
        0.03,
        0.015999,
        0.070001,
        0.011998,
        0.009984,
        0.009001,
        0.016998,
        0.018002,
        0.01,
        0.009001,
        0.009,
        0.033001,
        0.025998,
        0.011001,
        0.010999,
        0.015002,
        0.013998,
        0.009997,
        0.017999,
        0.009986,
        0.040999,
        0.019002,
        0.017,
        0.009998,
        0.008004,
        0.015998,
        0.010001,
        0.030999,
        0.016002,
        0.01,
        0.017002,
        0.015,
        0.058001,
        0.134,
        0.016002,
        0.012995,
        0.022985,
        0.132002,
        0.015999,
        0.145999,
        0.023999,
        0.131998,
        0.027003,
        0.012001,
        0.175001,
        0.167999,
        0.015003,
        0.042,
        0.021997,
        0.139003,
        0.023999,
        0.205996,
        0.025001,
        0.156,
        0.154002,
        0.140001,
        0.137995,
        0.141003,
        0.138999,
        0.011001,
        0.009999,
        0.015,
        0.018016,
        0.017986,
        0.136983,
        0.013002,
        0.016998,
        0.040002,
        0.033997,
        0.011001,
        0.012,
        0.041996,
        0.011001,
        0.012999,
        0.003996,
        0.009999,
        0.011982,
        0.011999,
        0.017985,
        0.009,
        0.008001,
        0.002998,
        0.009002,
        0.017996,
        0.016006,
        0.009001,
        0.012,
        0.009998,
        0.012003,
        0.014001,
        0.008,
        0.010982,
        0.010002,
        0.011998,
        0.010001,
        0.010001,
        0.012997,
        0.004001,
        0.038002,
        0.050999,
        0.015002,
        0.011,
        0.017986,
        0.023998,
        0.012,
        0.016,
        0.019001,
        0.194998,
        0.010001,
        0.037999,
        0.055003,
        0.206396,
        0.031998,
        0.053,
        0.014999,
        0.149002,
        0.022,
        0.018,
        0.142001,
        0.042998,
        0.035,
        0.137996,
        0.149,
        0.026001,
        0.145999,
        0.134001,
        0.019984,
        0.058999,
        0.022001,
        0.136001,
        0.016987,
        0.087,
        0.016986,
        0.139999,
        0.056002,
        0.013997,
        0.026,
        0.011016,
        0.177984,
        0.155999,
        0.132999,
        0.040002,
        0.016,
        0.052,
        0.023997,
        0.038005,
        0.053995,
        0.014003,
        0.030984,
        0.023004,
        0.01899,
        0.015,
        0.024001,
        0.019999,
        0.154999,
        0.025,
        0.048001,
        0.019,
        0.027002,
        0.023984,
        0.022002,
        0.017001,
        0.011004,
        0.010999,
        0.026535,
        0.023978,
        0.020002,
        0.022998,
        0.024004,
        0.019983,
        0.017003,
        0.018,
        0.015001,
        0.017997,
        0.023005,
        0.02198,
        0.019999,
        0.019999,
        0.046003,
        0.022984,
        0.021002,
        0.018001,
        0.019986,
        0.021014,
        0.023985,
        0.016997,
        0.014002,
        0.025002,
        0.039003,
        0.040995,
        0.025004,
        0.011983,
        0.018002,
        0.024016,
        0.057984,
        0.017999,
        0.017001,
        0.017001,
        0.018998,
        0.014,
        0.018001,
        0.01912,
        0.015985,
        0.077004,
        0.042995,
        0.148003,
        0.017999,
        0.021001,
        0.018998,
        0.023,
        0.144999,
        0.030002,
        0.021001,
        0.209001,
        0.158998,
        0.162002,
        0.143997,
        0.025004,
        0.148985,
        0.037998,
        0.021003,
        0.021983,
        0.138001,
        0.020998,
        0.019999,
        0.021999,
        0.024984,
        0.019999,
        0.037001,
        0.026999,
        0.037017,
        0.033986,
        0.035998,
        0.028002,
        0.028001,
        0.030999,
        0.028,
        0.023003,
        0.028986,
        0.028998,
        0.035001,
        0.022001,
        0.030999,
        0.074,
        0.043001,
        0.043006,
        0.029994,
        0.030001,
        0.031,
        0.040004,
        0.035984,
        0.049,
        0.034,
        0.042,
        0.036996,
        0.048,
        0.206001,
        0.051998,
        0.045009,
        0.065002,
        0.038998,
        0.044001,
        0.028003,
        0.032002,
        0.031001,
        0.036001,
        0.023985,
        0.049001,
        0.037995,
        0.031992,
        0.055,
        0.041001,
        0.042001,
        0.033998,
        0.046003,
        0.101997,
        0.034001,
        0.034999,
        0.04991,
        0.046004,
        0.068985,
        0.041003,
        0.068999,
        0.061,
        0.141988,
        0.148999,
        0.083999,
        0.144002,
        0.149999,
        0.148002,
        0.152002,
        0.149998,
        0.140983,
        0.148,
        0.14,
        0.137997,
        0.144001,
        0.146006,
        0.151987,
        0.151998,
        0.139,
        0.136999,
        0.133984,
        0.135001,
        0.136998,
        0.13702,
        0.145981,
        0.133988,
        0.137003,
        0.141002,
        0.139998,
        0.136999,
        0.136999,
        0.151,
        0.131002,
        0.136002,
        0.138001,
        0.133996,
        0.139997,
        0.141998,
        0.136999,
        0.144001,
        0.144001,
        0.138999,
        0.137,
        0.136001,
        0.131998,
        0.134984,
        0.136002,
        0.137998,
        0.137999,
        0.137001,
        0.134999,
        0.136001,
        0.137,
        0.137998,
        0.135,
        0.141998,
        0.141998,
        0.136003,
        0.134984,
        0.132002,
        0.131,
        0.137996,
        0.131,
        0.133,
        0.134001,
        0.059001,
        0.043003,
        0.130984,
        0.043001,
        0.019999,
        0.132003,
        0.029999,
        0.060997,
        0.105001,
        0.080002,
        0.139998,
        0.145,
        0.137999,
        0.139,
        0.137003,
        0.139999,
        0.143,
        0.151001,
        0.140998,
        0.134001,
        0.134998,
        0.133999,
        0.134001,
        0.138999,
        0.131998,
        0.134001,
        0.150985,
        0.168,
        0.152,
        0.147999,
        0.136,
        0.142007,
        0.136992,
        0.132999,
        0.135002,
        0.139998,
        0.152
    ]
}