episodes,steps,rewards
0,200,-200.0
1,200,-200.0
2,200,-200.0
3,200,-200.0
4,200,-200.0
5,200,-200.0
6,200,-200.0
7,200,-200.0
8,200,-200.0
9,200,-200.0
10,200,-200.0
11,200,-200.0
12,200,-200.0
13,200,-200.0
14,200,-200.0
15,200,-200.0
16,200,-200.0
17,200,-200.0
18,200,-200.0
19,200,-200.0
20,200,-200.0
21,200,-200.0
22,200,-200.0
23,200,-200.0
24,200,-200.0
25,200,-200.0
26,200,-200.0
27,200,-200.0
28,200,-200.0
29,200,-200.0
30,200,-200.0
31,200,-200.0
32,200,-200.0
33,200,-200.0
34,200,-200.0
35,200,-200.0
36,200,-200.0
37,200,-200.0
38,200,-200.0
39,200,-200.0
40,200,-200.0
41,200,-200.0
42,200,-200.0
43,200,-200.0
44,200,-200.0
45,200,-200.0
46,200,-200.0
47,200,-200.0
48,200,-200.0
49,200,-200.0
50,200,-200.0
51,200,-200.0
52,200,-200.0
53,200,-200.0
54,200,-200.0
55,200,-200.0
56,200,-200.0
57,200,-200.0
58,200,-200.0
59,200,-200.0
60,200,-200.0
61,200,-200.0
62,200,-200.0
63,200,-200.0
64,200,-200.0
65,200,-200.0
66,200,-200.0
67,200,-200.0
68,200,-200.0
69,200,-200.0
70,200,-200.0
71,200,-200.0
72,200,-200.0
73,200,-200.0
74,200,-200.0
75,200,-200.0
76,200,-200.0
77,200,-200.0
78,200,-200.0
79,200,-200.0
80,200,-200.0
81,200,-200.0
82,200,-200.0
83,200,-200.0
84,200,-200.0
85,200,-200.0
86,200,-200.0
87,200,-200.0
88,200,-200.0
89,200,-200.0
90,200,-200.0
91,200,-200.0
92,200,-200.0
93,200,-200.0
94,200,-200.0
95,200,-200.0
96,200,-200.0
97,200,-200.0
98,200,-200.0
99,200,-200.0
100,200,-200.0
101,200,-200.0
102,200,-200.0
103,200,-200.0
104,200,-200.0
105,200,-200.0
106,200,-200.0
107,200,-200.0
108,200,-200.0
109,200,-200.0
110,200,-200.0
111,200,-200.0
112,200,-200.0
113,200,-200.0
114,200,-200.0
115,200,-200.0
116,200,-200.0
117,200,-200.0
118,200,-200.0
119,200,-200.0
120,200,-200.0
121,200,-200.0
122,200,-200.0
123,200,-200.0
124,200,-200.0
125,200,-200.0
126,200,-200.0
127,200,-200.0
128,200,-200.0
129,200,-200.0
130,200,-200.0
131,200,-200.0
132,200,-200.0
133,200,-200.0
134,200,-200.0
135,200,-200.0
136,200,-200.0
137,200,-200.0
138,200,-200.0
139,200,-200.0
140,200,-200.0
141,200,-200.0
142,200,-200.0
143,200,-200.0
144,200,-200.0
145,200,-200.0
146,200,-200.0
147,200,-200.0
148,200,-200.0
149,200,-200.0
150,200,-200.0
151,200,-200.0
152,149,-149.0
153,200,-200.0
154,200,-200.0
155,200,-200.0
156,200,-200.0
157,200,-200.0
158,200,-200.0
159,200,-200.0
160,200,-200.0
161,200,-200.0
162,200,-200.0
163,200,-200.0
164,200,-200.0
165,200,-200.0
166,200,-200.0
167,200,-200.0
168,185,-185.0
169,200,-200.0
170,200,-200.0
171,200,-200.0
172,200,-200.0
173,200,-200.0
174,200,-200.0
175,200,-200.0
176,200,-200.0
177,200,-200.0
178,200,-200.0
179,200,-200.0
180,200,-200.0
181,200,-200.0
182,198,-198.0
183,172,-172.0
184,200,-200.0
185,117,-117.0
186,126,-126.0
187,200,-200.0
188,200,-200.0
189,200,-200.0
190,190,-190.0
191,200,-200.0
192,200,-200.0
193,181,-181.0
194,127,-127.0
195,200,-200.0
196,200,-200.0
197,178,-178.0
198,200,-200.0
199,150,-150.0
200,200,-200.0
201,200,-200.0
202,127,-127.0
203,200,-200.0
204,200,-200.0
205,200,-200.0
206,182,-182.0
207,193,-193.0
208,147,-147.0
209,200,-200.0
210,178,-178.0
211,200,-200.0
212,200,-200.0
213,200,-200.0
214,200,-200.0
215,200,-200.0
216,180,-180.0
217,200,-200.0
218,200,-200.0
219,200,-200.0
220,114,-114.0
221,200,-200.0
222,200,-200.0
223,169,-169.0
224,200,-200.0
225,200,-200.0
226,200,-200.0
227,198,-198.0
228,172,-172.0
229,166,-166.0
230,174,-174.0
231,163,-163.0
232,199,-199.0
233,200,-200.0
234,200,-200.0
235,200,-200.0
236,186,-186.0
237,185,-185.0
238,200,-200.0
239,200,-200.0
240,200,-200.0
241,163,-163.0
242,166,-166.0
243,152,-152.0
244,193,-193.0
245,183,-183.0
246,187,-187.0
247,183,-183.0
248,170,-170.0
249,151,-151.0
250,156,-156.0
251,156,-156.0
252,155,-155.0
253,190,-190.0
254,181,-181.0
255,199,-199.0
256,184,-184.0
257,175,-175.0
258,200,-200.0
259,171,-171.0
260,200,-200.0
261,194,-194.0
262,200,-200.0
263,192,-192.0
264,168,-168.0
265,195,-195.0
266,150,-150.0
267,193,-193.0
268,200,-200.0
269,199,-199.0
270,160,-160.0
271,158,-158.0
272,200,-200.0
273,149,-149.0
274,200,-200.0
275,200,-200.0
276,112,-112.0
277,163,-163.0
278,198,-198.0
279,200,-200.0
280,167,-167.0
281,175,-175.0
282,183,-183.0
283,169,-169.0
284,156,-156.0
285,118,-118.0
286,176,-176.0
287,161,-161.0
288,200,-200.0
289,114,-114.0
290,110,-110.0
291,114,-114.0
292,115,-115.0
293,111,-111.0
294,120,-120.0
295,116,-116.0
296,117,-117.0
297,166,-166.0
298,159,-159.0
299,145,-145.0
300,124,-124.0
301,108,-108.0
302,111,-111.0
303,108,-108.0
304,136,-136.0
305,89,-89.0
306,142,-142.0
307,127,-127.0
308,141,-141.0
309,109,-109.0
310,158,-158.0
311,107,-107.0
312,144,-144.0
313,143,-143.0
314,162,-162.0
315,170,-170.0
316,140,-140.0
317,156,-156.0
318,143,-143.0
319,160,-160.0
320,169,-169.0
321,169,-169.0
322,162,-162.0
323,137,-137.0
324,156,-156.0
325,169,-169.0
326,149,-149.0
327,170,-170.0
328,148,-148.0
329,158,-158.0
330,156,-156.0
331,152,-152.0
332,152,-152.0
333,145,-145.0
334,129,-129.0
335,149,-149.0
336,151,-151.0
337,155,-155.0
338,168,-168.0
339,189,-189.0
340,194,-194.0
341,146,-146.0
342,162,-162.0
343,130,-130.0
344,164,-164.0
345,133,-133.0
346,152,-152.0
347,146,-146.0
348,166,-166.0
349,139,-139.0
350,197,-197.0
351,200,-200.0
352,185,-185.0
353,200,-200.0
354,158,-158.0
355,189,-189.0
356,189,-189.0
357,98,-98.0
358,164,-164.0
359,160,-160.0
360,200,-200.0
361,97,-97.0
362,157,-157.0
363,165,-165.0
364,150,-150.0
365,200,-200.0
366,166,-166.0
367,158,-158.0
368,200,-200.0
369,153,-153.0
370,171,-171.0
371,177,-177.0
372,195,-195.0
373,167,-167.0
374,168,-168.0
375,165,-165.0
376,165,-165.0
377,194,-194.0
378,160,-160.0
379,102,-102.0
380,190,-190.0
381,165,-165.0
382,180,-180.0
383,157,-157.0
384,177,-177.0
385,179,-179.0
386,177,-177.0
387,162,-162.0
388,167,-167.0
389,168,-168.0
390,161,-161.0
391,188,-188.0
392,160,-160.0
393,173,-173.0
394,176,-176.0
395,179,-179.0
396,169,-169.0
397,169,-169.0
398,200,-200.0
399,155,-155.0
400,165,-165.0
401,169,-169.0
402,178,-178.0
403,152,-152.0
404,158,-158.0
405,154,-154.0
406,163,-163.0
407,159,-159.0
408,162,-162.0
409,159,-159.0
410,159,-159.0
411,179,-179.0
412,189,-189.0
413,167,-167.0
414,159,-159.0
415,172,-172.0
416,200,-200.0
417,179,-179.0
418,184,-184.0
419,200,-200.0
420,142,-142.0
421,168,-168.0
422,158,-158.0
423,155,-155.0
424,149,-149.0
425,176,-176.0
426,170,-170.0
427,169,-169.0
428,164,-164.0
429,157,-157.0
430,173,-173.0
431,151,-151.0
432,153,-153.0
433,169,-169.0
434,171,-171.0
435,135,-135.0
436,171,-171.0
437,157,-157.0
438,100,-100.0
439,148,-148.0
440,174,-174.0
441,168,-168.0
442,153,-153.0
443,177,-177.0
444,143,-143.0
445,161,-161.0
446,162,-162.0
447,177,-177.0
448,157,-157.0
449,123,-123.0
450,159,-159.0
451,154,-154.0
452,155,-155.0
453,167,-167.0
454,154,-154.0
455,154,-154.0
456,144,-144.0
457,153,-153.0
458,125,-125.0
459,157,-157.0
460,92,-92.0
461,141,-141.0
462,135,-135.0
463,94,-94.0
464,140,-140.0
465,147,-147.0
466,144,-144.0
467,155,-155.0
468,139,-139.0
469,113,-113.0
470,159,-159.0
471,155,-155.0
472,143,-143.0
473,146,-146.0
474,170,-170.0
475,141,-141.0
476,141,-141.0
477,139,-139.0
478,173,-173.0
479,163,-163.0
480,167,-167.0
481,185,-185.0
482,162,-162.0
483,163,-163.0
484,166,-166.0
485,140,-140.0
486,157,-157.0
487,156,-156.0
488,136,-136.0
489,170,-170.0
490,164,-164.0
491,200,-200.0
492,172,-172.0
493,167,-167.0
494,150,-150.0
495,146,-146.0
496,157,-157.0
497,180,-180.0
498,172,-172.0
499,172,-172.0
500,164,-164.0
501,156,-156.0
502,136,-136.0
503,146,-146.0
504,142,-142.0
505,124,-124.0
506,157,-157.0
507,165,-165.0
508,159,-159.0
509,159,-159.0
510,165,-165.0
511,174,-174.0
512,150,-150.0
513,156,-156.0
514,138,-138.0
515,148,-148.0
516,200,-200.0
517,154,-154.0
518,148,-148.0
519,142,-142.0
520,159,-159.0
521,200,-200.0
522,138,-138.0
523,137,-137.0
524,173,-173.0
525,156,-156.0
526,176,-176.0
527,144,-144.0
528,164,-164.0
529,163,-163.0
530,159,-159.0
531,150,-150.0
532,152,-152.0
533,151,-151.0
534,161,-161.0
535,173,-173.0
536,166,-166.0
537,170,-170.0
538,148,-148.0
539,148,-148.0
540,151,-151.0
541,139,-139.0
542,153,-153.0
543,157,-157.0
544,170,-170.0
545,174,-174.0
546,181,-181.0
547,169,-169.0
548,200,-200.0
549,171,-171.0
550,167,-167.0
551,143,-143.0
552,148,-148.0
553,164,-164.0
554,155,-155.0
555,140,-140.0
556,155,-155.0
557,165,-165.0
558,117,-117.0
559,130,-130.0
560,142,-142.0
561,169,-169.0
562,126,-126.0
563,154,-154.0
564,131,-131.0
565,175,-175.0
566,200,-200.0
567,162,-162.0
568,121,-121.0
569,200,-200.0
570,160,-160.0
571,200,-200.0
572,171,-171.0
573,148,-148.0
574,158,-158.0
575,162,-162.0
576,156,-156.0
577,157,-157.0
578,179,-179.0
579,142,-142.0
580,164,-164.0
581,143,-143.0
582,179,-179.0
583,200,-200.0
584,200,-200.0
585,156,-156.0
586,162,-162.0
587,158,-158.0
588,167,-167.0
589,157,-157.0
590,200,-200.0
591,186,-186.0
592,164,-164.0
593,179,-179.0
594,155,-155.0
595,155,-155.0
596,170,-170.0
597,146,-146.0
598,161,-161.0
599,149,-149.0
600,170,-170.0
601,143,-143.0
602,141,-141.0
603,156,-156.0
604,140,-140.0
605,152,-152.0
606,136,-136.0
607,139,-139.0
608,135,-135.0
609,148,-148.0
610,143,-143.0
611,171,-171.0
612,147,-147.0
613,148,-148.0
614,162,-162.0
615,146,-146.0
616,141,-141.0
617,154,-154.0
618,157,-157.0
619,174,-174.0
620,157,-157.0
621,164,-164.0
622,166,-166.0
623,148,-148.0
624,143,-143.0
625,164,-164.0
626,200,-200.0
627,149,-149.0
628,149,-149.0
629,156,-156.0
630,179,-179.0
631,150,-150.0
632,172,-172.0
633,138,-138.0
634,151,-151.0
635,145,-145.0
636,200,-200.0
637,158,-158.0
638,150,-150.0
639,159,-159.0
640,174,-174.0
641,158,-158.0
642,174,-174.0
643,150,-150.0
644,200,-200.0
645,172,-172.0
646,163,-163.0
647,158,-158.0
648,175,-175.0
649,188,-188.0
650,200,-200.0
651,168,-168.0
652,172,-172.0
653,200,-200.0
654,156,-156.0
655,147,-147.0
656,150,-150.0
657,156,-156.0
658,152,-152.0
659,153,-153.0
660,196,-196.0
661,155,-155.0
662,161,-161.0
663,151,-151.0
664,176,-176.0
665,151,-151.0
666,152,-152.0
667,156,-156.0
668,141,-141.0
669,153,-153.0
670,147,-147.0
671,146,-146.0
672,155,-155.0
673,114,-114.0
674,160,-160.0
675,134,-134.0
676,200,-200.0
677,118,-118.0
678,115,-115.0
679,160,-160.0
680,155,-155.0
681,127,-127.0
682,136,-136.0
683,118,-118.0
684,148,-148.0
685,146,-146.0
686,157,-157.0
687,116,-116.0
688,154,-154.0
689,120,-120.0
690,157,-157.0
691,155,-155.0
692,153,-153.0
693,166,-166.0
694,200,-200.0
695,117,-117.0
696,128,-128.0
697,118,-118.0
698,122,-122.0
699,119,-119.0
700,120,-120.0
701,182,-182.0
702,200,-200.0
703,130,-130.0
704,200,-200.0
705,200,-200.0
706,172,-172.0
707,173,-173.0
708,154,-154.0
709,162,-162.0
710,166,-166.0
711,161,-161.0
712,164,-164.0
713,146,-146.0
714,153,-153.0
715,177,-177.0
716,162,-162.0
717,167,-167.0
718,165,-165.0
719,154,-154.0
720,151,-151.0
721,146,-146.0
722,144,-144.0
723,141,-141.0
724,145,-145.0
725,156,-156.0
726,155,-155.0
727,200,-200.0
728,161,-161.0
729,165,-165.0
730,200,-200.0
731,200,-200.0
732,200,-200.0
733,169,-169.0
734,168,-168.0
735,172,-172.0
736,164,-164.0
737,175,-175.0
738,142,-142.0
739,156,-156.0
740,162,-162.0
741,161,-161.0
742,165,-165.0
743,159,-159.0
744,163,-163.0
745,151,-151.0
746,157,-157.0
747,155,-155.0
748,159,-159.0
749,146,-146.0
750,156,-156.0
751,171,-171.0
752,200,-200.0
753,167,-167.0
754,156,-156.0
755,175,-175.0
756,161,-161.0
757,173,-173.0
758,168,-168.0
759,177,-177.0
760,174,-174.0
761,200,-200.0
762,174,-174.0
763,200,-200.0
764,200,-200.0
765,200,-200.0
766,186,-186.0
767,200,-200.0
768,100,-100.0
769,167,-167.0
770,103,-103.0
771,200,-200.0
772,174,-174.0
773,200,-200.0
774,107,-107.0
775,183,-183.0
776,169,-169.0
777,200,-200.0
778,200,-200.0
779,169,-169.0
780,200,-200.0
781,156,-156.0
782,165,-165.0
783,108,-108.0
784,164,-164.0
785,99,-99.0
786,172,-172.0
787,200,-200.0
788,200,-200.0
789,195,-195.0
790,191,-191.0
791,200,-200.0
792,168,-168.0
793,165,-165.0
794,159,-159.0
795,154,-154.0
796,171,-171.0
797,200,-200.0
798,137,-137.0
799,102,-102.0
800,93,-93.0
801,199,-199.0
802,158,-158.0
803,171,-171.0
804,163,-163.0
805,140,-140.0
806,122,-122.0
807,161,-161.0
808,154,-154.0
809,161,-161.0
810,158,-158.0
811,169,-169.0
812,156,-156.0
813,172,-172.0
814,157,-157.0
815,155,-155.0
816,168,-168.0
817,163,-163.0
818,161,-161.0
819,160,-160.0
820,159,-159.0
821,175,-175.0
822,158,-158.0
823,162,-162.0
824,159,-159.0
825,147,-147.0
826,153,-153.0
827,162,-162.0
828,151,-151.0
829,147,-147.0
830,151,-151.0
831,157,-157.0
832,172,-172.0
833,149,-149.0
834,200,-200.0
835,155,-155.0
836,160,-160.0
837,163,-163.0
838,200,-200.0
839,200,-200.0
840,200,-200.0
841,200,-200.0
842,141,-141.0
843,140,-140.0
844,200,-200.0
845,200,-200.0
846,200,-200.0
847,200,-200.0
848,134,-134.0
849,200,-200.0
850,134,-134.0
851,200,-200.0
852,131,-131.0
853,142,-142.0
854,142,-142.0
855,124,-124.0
856,126,-126.0
857,117,-117.0
858,121,-121.0
859,200,-200.0
860,126,-126.0
861,170,-170.0
862,123,-123.0
863,126,-126.0
864,133,-133.0
865,167,-167.0
866,200,-200.0
867,119,-119.0
868,127,-127.0
869,145,-145.0
870,132,-132.0
871,135,-135.0
872,149,-149.0
873,200,-200.0
874,126,-126.0
875,129,-129.0
876,124,-124.0
877,128,-128.0
878,200,-200.0
879,200,-200.0
880,127,-127.0
881,128,-128.0
882,200,-200.0
883,143,-143.0
884,140,-140.0
885,200,-200.0
886,200,-200.0
887,200,-200.0
888,200,-200.0
889,200,-200.0
890,200,-200.0
891,200,-200.0
892,200,-200.0
893,128,-128.0
894,129,-129.0
895,200,-200.0
896,121,-121.0
897,146,-146.0
898,131,-131.0
899,200,-200.0
900,145,-145.0
901,147,-147.0
902,140,-140.0
903,133,-133.0
904,128,-128.0
905,200,-200.0
906,128,-128.0
907,200,-200.0
908,134,-134.0
909,139,-139.0
910,134,-134.0
911,200,-200.0
912,145,-145.0
913,124,-124.0
914,191,-191.0
915,136,-136.0
916,123,-123.0
917,136,-136.0
918,121,-121.0
919,175,-175.0
920,133,-133.0
921,125,-125.0
922,170,-170.0
923,174,-174.0
924,186,-186.0
925,163,-163.0
926,166,-166.0
927,165,-165.0
928,189,-189.0
929,196,-196.0
930,174,-174.0
931,162,-162.0
932,159,-159.0
933,156,-156.0
934,93,-93.0
935,156,-156.0
936,163,-163.0
937,110,-110.0
938,165,-165.0
939,94,-94.0
940,158,-158.0
941,154,-154.0
942,171,-171.0
943,88,-88.0
944,176,-176.0
945,153,-153.0
946,94,-94.0
947,161,-161.0
948,156,-156.0
949,162,-162.0
950,153,-153.0
951,149,-149.0
952,154,-154.0
953,140,-140.0
954,150,-150.0
955,150,-150.0
956,154,-154.0
957,132,-132.0
958,147,-147.0
959,152,-152.0
960,146,-146.0
961,137,-137.0
962,146,-146.0
963,147,-147.0
964,200,-200.0
965,143,-143.0
966,147,-147.0
967,193,-193.0
968,199,-199.0
969,200,-200.0
970,138,-138.0
971,141,-141.0
972,181,-181.0
973,151,-151.0
974,145,-145.0
975,179,-179.0
976,173,-173.0
977,146,-146.0
978,145,-145.0
979,110,-110.0
980,101,-101.0
981,141,-141.0
982,155,-155.0
983,103,-103.0
984,115,-115.0
985,146,-146.0
986,91,-91.0
987,169,-169.0
988,109,-109.0
989,164,-164.0
990,112,-112.0
991,110,-110.0
992,106,-106.0
993,185,-185.0
994,164,-164.0
995,109,-109.0
996,174,-174.0
997,100,-100.0
998,115,-115.0
999,107,-107.0
1000,113,-113.0
1001,106,-106.0
1002,112,-112.0
1003,105,-105.0
1004,103,-103.0
1005,122,-122.0
1006,109,-109.0
1007,116,-116.0
1008,108,-108.0
1009,107,-107.0
1010,107,-107.0
1011,107,-107.0
1012,107,-107.0
1013,182,-182.0
1014,124,-124.0
1015,109,-109.0
1016,184,-184.0
1017,142,-142.0
1018,115,-115.0
1019,124,-124.0
1020,111,-111.0
1021,116,-116.0
1022,123,-123.0
1023,118,-118.0
1024,114,-114.0
1025,118,-118.0
1026,116,-116.0
1027,120,-120.0
1028,121,-121.0
1029,117,-117.0
1030,115,-115.0
1031,124,-124.0
1032,113,-113.0
1033,120,-120.0
1034,121,-121.0
1035,129,-129.0
1036,135,-135.0
1037,117,-117.0
1038,117,-117.0
1039,145,-145.0
1040,112,-112.0
1041,127,-127.0
1042,151,-151.0
1043,144,-144.0
1044,156,-156.0
1045,144,-144.0
1046,149,-149.0
1047,142,-142.0
1048,140,-140.0
1049,140,-140.0
1050,145,-145.0
1051,151,-151.0
1052,145,-145.0
1053,141,-141.0
1054,102,-102.0
1055,178,-178.0
1056,170,-170.0
1057,161,-161.0
1058,159,-159.0
1059,151,-151.0
1060,169,-169.0
1061,86,-86.0
1062,156,-156.0
1063,158,-158.0
1064,92,-92.0
1065,155,-155.0
1066,90,-90.0
1067,153,-153.0
1068,114,-114.0
1069,187,-187.0
1070,152,-152.0
1071,168,-168.0
1072,85,-85.0
1073,103,-103.0
1074,150,-150.0
1075,134,-134.0
1076,167,-167.0
1077,111,-111.0
1078,140,-140.0
1079,102,-102.0
1080,85,-85.0
1081,105,-105.0
1082,151,-151.0
1083,145,-145.0
1084,146,-146.0
1085,146,-146.0
1086,148,-148.0
1087,106,-106.0
1088,152,-152.0
1089,146,-146.0
1090,147,-147.0
1091,154,-154.0
1092,154,-154.0
1093,154,-154.0
1094,150,-150.0
1095,161,-161.0
1096,164,-164.0
1097,152,-152.0
1098,200,-200.0
1099,159,-159.0
1100,148,-148.0
1101,149,-149.0
1102,150,-150.0
1103,154,-154.0
1104,150,-150.0
1105,153,-153.0
1106,154,-154.0
1107,156,-156.0
1108,167,-167.0
1109,200,-200.0
1110,89,-89.0
1111,200,-200.0
1112,200,-200.0
1113,99,-99.0
1114,88,-88.0
1115,200,-200.0
1116,88,-88.0
1117,175,-175.0
1118,164,-164.0
1119,157,-157.0
1120,163,-163.0
1121,200,-200.0
1122,200,-200.0
1123,174,-174.0
1124,179,-179.0
1125,153,-153.0
1126,178,-178.0
1127,167,-167.0
1128,90,-90.0
1129,173,-173.0
1130,85,-85.0
1131,200,-200.0
1132,200,-200.0
1133,200,-200.0
1134,86,-86.0
1135,200,-200.0
1136,200,-200.0
1137,200,-200.0
1138,200,-200.0
1139,172,-172.0
1140,200,-200.0
1141,200,-200.0
1142,163,-163.0
1143,159,-159.0
1144,183,-183.0
1145,200,-200.0
1146,93,-93.0
1147,200,-200.0
1148,182,-182.0
1149,200,-200.0
1150,200,-200.0
1151,200,-200.0
1152,200,-200.0
1153,200,-200.0
1154,152,-152.0
1155,200,-200.0
1156,200,-200.0
1157,156,-156.0
1158,200,-200.0
1159,200,-200.0
1160,167,-167.0
1161,161,-161.0
1162,200,-200.0
1163,160,-160.0
1164,152,-152.0
1165,200,-200.0
1166,155,-155.0
1167,200,-200.0
1168,200,-200.0
1169,200,-200.0
1170,200,-200.0
1171,143,-143.0
1172,136,-136.0
1173,200,-200.0
1174,141,-141.0
1175,200,-200.0
1176,119,-119.0
1177,200,-200.0
1178,200,-200.0
1179,176,-176.0
1180,152,-152.0
1181,146,-146.0
1182,149,-149.0
1183,200,-200.0
1184,151,-151.0
1185,154,-154.0
1186,161,-161.0
1187,200,-200.0
1188,147,-147.0
1189,155,-155.0
1190,200,-200.0
1191,152,-152.0
1192,164,-164.0
1193,160,-160.0
1194,162,-162.0
1195,164,-164.0
1196,153,-153.0
1197,153,-153.0
1198,155,-155.0
1199,164,-164.0
1200,183,-183.0
1201,200,-200.0
1202,168,-168.0
1203,166,-166.0
1204,174,-174.0
1205,164,-164.0
1206,158,-158.0
1207,200,-200.0
1208,200,-200.0
1209,200,-200.0
1210,176,-176.0
1211,165,-165.0
1212,184,-184.0
1213,188,-188.0
1214,156,-156.0
1215,175,-175.0
1216,168,-168.0
1217,172,-172.0
1218,159,-159.0
1219,157,-157.0
1220,171,-171.0
1221,159,-159.0
1222,96,-96.0
1223,163,-163.0
1224,150,-150.0
1225,90,-90.0
1226,93,-93.0
1227,168,-168.0
1228,94,-94.0
1229,153,-153.0
1230,116,-116.0
1231,172,-172.0
1232,153,-153.0
1233,196,-196.0
1234,150,-150.0
1235,159,-159.0
1236,153,-153.0
1237,89,-89.0
1238,147,-147.0
1239,166,-166.0
1240,157,-157.0
1241,153,-153.0
1242,83,-83.0
1243,172,-172.0
1244,175,-175.0
1245,157,-157.0
1246,89,-89.0
1247,166,-166.0
1248,179,-179.0
1249,165,-165.0
1250,92,-92.0
1251,154,-154.0
1252,155,-155.0
1253,167,-167.0
1254,155,-155.0
1255,153,-153.0
1256,200,-200.0
1257,168,-168.0
1258,158,-158.0
1259,148,-148.0
1260,159,-159.0
1261,152,-152.0
1262,154,-154.0
1263,187,-187.0
1264,154,-154.0
1265,155,-155.0
1266,147,-147.0
1267,155,-155.0
1268,154,-154.0
1269,164,-164.0
1270,200,-200.0
1271,148,-148.0
1272,158,-158.0
1273,139,-139.0
1274,149,-149.0
1275,105,-105.0
1276,149,-149.0
1277,153,-153.0
1278,156,-156.0
1279,200,-200.0
1280,165,-165.0
1281,141,-141.0
1282,155,-155.0
1283,150,-150.0
1284,150,-150.0
1285,86,-86.0
1286,145,-145.0
1287,142,-142.0
1288,151,-151.0
1289,200,-200.0
1290,152,-152.0
1291,96,-96.0
1292,154,-154.0
1293,170,-170.0
1294,154,-154.0
1295,146,-146.0
1296,163,-163.0
1297,161,-161.0
1298,200,-200.0
1299,87,-87.0
1300,160,-160.0
1301,103,-103.0
1302,150,-150.0
1303,159,-159.0
1304,157,-157.0
1305,157,-157.0
1306,175,-175.0
1307,189,-189.0
1308,101,-101.0
1309,156,-156.0
1310,100,-100.0
1311,89,-89.0
1312,163,-163.0
1313,168,-168.0
1314,98,-98.0
1315,160,-160.0
1316,86,-86.0
1317,200,-200.0
1318,101,-101.0
1319,154,-154.0
1320,155,-155.0
1321,111,-111.0
1322,84,-84.0
1323,168,-168.0
1324,160,-160.0
1325,200,-200.0
1326,172,-172.0
1327,200,-200.0
1328,173,-173.0
1329,166,-166.0
1330,95,-95.0
1331,200,-200.0
1332,155,-155.0
1333,167,-167.0
1334,157,-157.0
1335,88,-88.0
1336,160,-160.0
1337,161,-161.0
1338,170,-170.0
1339,164,-164.0
1340,200,-200.0
1341,162,-162.0
1342,160,-160.0
1343,200,-200.0
1344,156,-156.0
1345,175,-175.0
1346,166,-166.0
1347,200,-200.0
1348,153,-153.0
1349,169,-169.0
1350,90,-90.0
1351,200,-200.0
1352,156,-156.0
1353,200,-200.0
1354,200,-200.0
1355,200,-200.0
1356,200,-200.0
1357,92,-92.0
1358,200,-200.0
1359,166,-166.0
1360,167,-167.0
1361,200,-200.0
1362,157,-157.0
1363,163,-163.0
1364,161,-161.0
1365,167,-167.0
1366,158,-158.0
1367,173,-173.0
1368,157,-157.0
1369,87,-87.0
1370,162,-162.0
1371,168,-168.0
1372,155,-155.0
1373,152,-152.0
1374,130,-130.0
1375,157,-157.0
1376,163,-163.0
1377,166,-166.0
1378,165,-165.0
1379,151,-151.0
1380,94,-94.0
1381,91,-91.0
1382,156,-156.0
1383,156,-156.0
1384,96,-96.0
1385,154,-154.0
1386,159,-159.0
1387,147,-147.0
1388,153,-153.0
1389,152,-152.0
1390,92,-92.0
1391,166,-166.0
1392,157,-157.0
1393,158,-158.0
1394,165,-165.0
1395,158,-158.0
1396,168,-168.0
1397,161,-161.0
1398,161,-161.0
1399,161,-161.0
1400,165,-165.0
1401,83,-83.0
1402,158,-158.0
1403,111,-111.0
1404,160,-160.0
1405,90,-90.0
1406,94,-94.0
1407,112,-112.0
1408,93,-93.0
1409,100,-100.0
1410,96,-96.0
1411,107,-107.0
1412,110,-110.0
1413,87,-87.0
1414,200,-200.0
1415,150,-150.0
1416,155,-155.0
1417,153,-153.0
1418,149,-149.0
1419,196,-196.0
1420,121,-121.0
1421,173,-173.0
1422,161,-161.0
1423,183,-183.0
1424,123,-123.0
1425,88,-88.0
1426,171,-171.0
1427,118,-118.0
1428,163,-163.0
1429,168,-168.0
1430,168,-168.0
1431,190,-190.0
1432,121,-121.0
1433,91,-91.0
1434,111,-111.0
1435,166,-166.0
1436,93,-93.0
1437,96,-96.0
1438,177,-177.0
1439,85,-85.0
1440,94,-94.0
1441,105,-105.0
1442,167,-167.0
1443,109,-109.0
1444,108,-108.0
1445,164,-164.0
1446,87,-87.0
1447,109,-109.0
1448,109,-109.0
1449,89,-89.0
1450,104,-104.0
1451,83,-83.0
1452,157,-157.0
1453,108,-108.0
1454,128,-128.0
1455,106,-106.0
1456,123,-123.0
1457,106,-106.0
1458,114,-114.0
1459,85,-85.0
1460,105,-105.0
1461,87,-87.0
1462,117,-117.0
1463,107,-107.0
1464,111,-111.0
1465,109,-109.0
1466,113,-113.0
1467,108,-108.0
1468,98,-98.0
1469,112,-112.0
1470,109,-109.0
1471,114,-114.0
1472,109,-109.0
1473,109,-109.0
1474,108,-108.0
1475,108,-108.0
1476,118,-118.0
1477,184,-184.0
1478,111,-111.0
1479,108,-108.0
1480,112,-112.0
1481,194,-194.0
1482,111,-111.0
1483,106,-106.0
1484,111,-111.0
1485,108,-108.0
1486,108,-108.0
1487,107,-107.0
1488,118,-118.0
1489,106,-106.0
1490,109,-109.0
1491,106,-106.0
1492,121,-121.0
1493,111,-111.0
1494,110,-110.0
1495,161,-161.0
1496,106,-106.0
1497,108,-108.0
1498,109,-109.0
1499,169,-169.0
1500,112,-112.0
1501,106,-106.0
1502,162,-162.0
1503,160,-160.0
1504,169,-169.0
1505,167,-167.0
1506,105,-105.0
1507,106,-106.0
1508,170,-170.0
1509,173,-173.0
1510,157,-157.0
1511,111,-111.0
1512,118,-118.0
1513,100,-100.0
1514,158,-158.0
1515,158,-158.0
1516,154,-154.0
1517,107,-107.0
1518,159,-159.0
1519,191,-191.0
1520,182,-182.0
1521,165,-165.0
1522,108,-108.0
1523,164,-164.0
1524,91,-91.0
1525,93,-93.0
1526,171,-171.0
1527,161,-161.0
1528,108,-108.0
1529,104,-104.0
1530,167,-167.0
1531,198,-198.0
1532,171,-171.0
1533,138,-138.0
1534,108,-108.0
1535,91,-91.0
1536,97,-97.0
1537,88,-88.0
1538,165,-165.0
1539,116,-116.0
1540,99,-99.0
1541,89,-89.0
1542,110,-110.0
1543,146,-146.0
1544,200,-200.0
1545,200,-200.0
1546,200,-200.0
1547,200,-200.0
1548,200,-200.0
1549,200,-200.0
1550,200,-200.0
1551,200,-200.0
1552,200,-200.0
1553,119,-119.0
1554,200,-200.0
1555,200,-200.0
1556,129,-129.0
1557,200,-200.0
1558,114,-114.0
1559,97,-97.0
1560,133,-133.0
1561,109,-109.0
1562,114,-114.0
1563,110,-110.0
1564,85,-85.0
1565,107,-107.0
1566,147,-147.0
1567,162,-162.0
1568,153,-153.0
1569,171,-171.0
1570,158,-158.0
1571,150,-150.0
1572,112,-112.0
1573,89,-89.0
1574,158,-158.0
1575,154,-154.0
1576,155,-155.0
1577,188,-188.0
1578,165,-165.0
1579,186,-186.0
1580,154,-154.0
1581,112,-112.0
1582,159,-159.0
1583,88,-88.0
1584,117,-117.0
1585,88,-88.0
1586,113,-113.0
1587,171,-171.0
1588,171,-171.0
1589,98,-98.0
1590,165,-165.0
1591,166,-166.0
1592,194,-194.0
1593,196,-196.0
1594,156,-156.0
1595,119,-119.0
1596,162,-162.0
1597,88,-88.0
1598,161,-161.0
1599,94,-94.0
1600,91,-91.0
1601,162,-162.0
1602,114,-114.0
1603,166,-166.0
1604,89,-89.0
1605,86,-86.0
1606,170,-170.0
1607,107,-107.0
1608,135,-135.0
1609,99,-99.0
1610,159,-159.0
1611,109,-109.0
1612,158,-158.0
1613,200,-200.0
1614,106,-106.0
1615,111,-111.0
1616,150,-150.0
1617,107,-107.0
1618,180,-180.0
1619,147,-147.0
1620,177,-177.0
1621,187,-187.0
1622,165,-165.0
1623,156,-156.0
1624,158,-158.0
1625,165,-165.0
1626,167,-167.0
1627,200,-200.0
1628,97,-97.0
1629,154,-154.0
1630,151,-151.0
1631,96,-96.0
1632,121,-121.0
1633,153,-153.0
1634,151,-151.0
1635,156,-156.0
1636,161,-161.0
1637,154,-154.0
1638,155,-155.0
1639,157,-157.0
1640,158,-158.0
1641,156,-156.0
1642,152,-152.0
1643,157,-157.0
1644,88,-88.0
1645,180,-180.0
1646,180,-180.0
1647,125,-125.0
1648,109,-109.0
1649,96,-96.0
1650,89,-89.0
1651,86,-86.0
1652,168,-168.0
1653,151,-151.0
1654,96,-96.0
1655,97,-97.0
1656,145,-145.0
1657,152,-152.0
1658,164,-164.0
1659,89,-89.0
1660,171,-171.0
1661,162,-162.0
1662,174,-174.0
1663,168,-168.0
1664,168,-168.0
1665,86,-86.0
1666,91,-91.0
1667,167,-167.0
1668,153,-153.0
1669,168,-168.0
1670,156,-156.0
1671,161,-161.0
1672,160,-160.0
1673,118,-118.0
1674,95,-95.0
1675,160,-160.0
1676,153,-153.0
1677,109,-109.0
1678,169,-169.0
1679,168,-168.0
1680,165,-165.0
1681,160,-160.0
1682,180,-180.0
1683,180,-180.0
1684,188,-188.0
1685,84,-84.0
1686,171,-171.0
1687,157,-157.0
1688,152,-152.0
1689,176,-176.0
1690,161,-161.0
1691,117,-117.0
1692,169,-169.0
1693,174,-174.0
1694,164,-164.0
1695,90,-90.0
1696,142,-142.0
1697,172,-172.0
1698,97,-97.0
1699,157,-157.0
1700,163,-163.0
1701,166,-166.0
1702,165,-165.0
1703,168,-168.0
1704,157,-157.0
1705,200,-200.0
1706,149,-149.0
1707,128,-128.0
1708,159,-159.0
1709,159,-159.0
1710,185,-185.0
1711,154,-154.0
1712,193,-193.0
1713,151,-151.0
1714,164,-164.0
1715,153,-153.0
1716,86,-86.0
1717,151,-151.0
1718,87,-87.0
1719,154,-154.0
1720,154,-154.0
1721,148,-148.0
1722,151,-151.0
1723,148,-148.0
1724,161,-161.0
1725,151,-151.0
1726,134,-134.0
1727,151,-151.0
1728,180,-180.0
1729,90,-90.0
1730,99,-99.0
1731,158,-158.0
1732,95,-95.0
1733,158,-158.0
1734,88,-88.0
1735,157,-157.0
1736,147,-147.0
1737,155,-155.0
1738,115,-115.0
1739,189,-189.0
1740,152,-152.0
1741,156,-156.0
1742,168,-168.0
1743,149,-149.0
1744,149,-149.0
1745,150,-150.0
1746,145,-145.0
1747,118,-118.0
1748,87,-87.0
1749,155,-155.0
1750,200,-200.0
1751,93,-93.0
1752,160,-160.0
1753,172,-172.0
1754,152,-152.0
1755,148,-148.0
1756,88,-88.0
1757,155,-155.0
1758,200,-200.0
1759,161,-161.0
1760,94,-94.0
1761,149,-149.0
1762,154,-154.0
1763,200,-200.0
1764,200,-200.0
1765,84,-84.0
1766,165,-165.0
1767,87,-87.0
1768,108,-108.0
1769,85,-85.0
1770,200,-200.0
1771,90,-90.0
1772,200,-200.0
1773,170,-170.0
1774,98,-98.0
1775,200,-200.0
1776,173,-173.0
1777,164,-164.0
1778,120,-120.0
1779,175,-175.0
1780,123,-123.0
1781,165,-165.0
1782,176,-176.0
1783,173,-173.0
1784,120,-120.0
1785,93,-93.0
1786,121,-121.0
1787,86,-86.0
1788,92,-92.0
1789,157,-157.0
1790,116,-116.0
1791,166,-166.0
1792,123,-123.0
1793,159,-159.0
1794,124,-124.0
1795,109,-109.0
1796,107,-107.0
1797,135,-135.0
1798,125,-125.0
1799,128,-128.0
1800,134,-134.0
1801,130,-130.0
1802,126,-126.0
1803,132,-132.0
1804,120,-120.0
1805,123,-123.0
1806,123,-123.0
1807,190,-190.0
1808,115,-115.0
1809,130,-130.0
1810,128,-128.0
1811,162,-162.0
1812,200,-200.0
1813,149,-149.0
1814,146,-146.0
1815,140,-140.0
1816,158,-158.0
1817,148,-148.0
1818,185,-185.0
1819,200,-200.0
1820,148,-148.0
1821,145,-145.0
1822,152,-152.0
1823,164,-164.0
1824,150,-150.0
1825,157,-157.0
1826,160,-160.0
1827,153,-153.0
1828,147,-147.0
1829,146,-146.0
1830,151,-151.0
1831,148,-148.0
1832,147,-147.0
1833,155,-155.0
1834,154,-154.0
1835,142,-142.0
1836,146,-146.0
1837,145,-145.0
1838,143,-143.0
1839,146,-146.0
1840,142,-142.0
1841,141,-141.0
1842,140,-140.0
1843,147,-147.0
1844,141,-141.0
1845,142,-142.0
1846,92,-92.0
1847,138,-138.0
1848,143,-143.0
1849,140,-140.0
1850,143,-143.0
1851,143,-143.0
1852,146,-146.0
1853,139,-139.0
1854,148,-148.0
1855,123,-123.0
1856,137,-137.0
1857,146,-146.0
1858,151,-151.0
1859,148,-148.0
1860,142,-142.0
1861,147,-147.0
1862,88,-88.0
1863,152,-152.0
1864,158,-158.0
1865,149,-149.0
1866,84,-84.0
1867,150,-150.0
1868,147,-147.0
1869,162,-162.0
1870,176,-176.0
1871,87,-87.0
1872,87,-87.0
1873,191,-191.0
1874,151,-151.0
1875,146,-146.0
1876,141,-141.0
1877,144,-144.0
1878,170,-170.0
1879,152,-152.0
1880,155,-155.0
1881,184,-184.0
1882,162,-162.0
1883,155,-155.0
1884,92,-92.0
1885,85,-85.0
1886,148,-148.0
1887,154,-154.0
1888,143,-143.0
1889,158,-158.0
1890,152,-152.0
1891,163,-163.0
1892,200,-200.0
1893,142,-142.0
1894,200,-200.0
1895,149,-149.0
1896,162,-162.0
1897,200,-200.0
1898,174,-174.0
1899,98,-98.0
1900,161,-161.0
1901,200,-200.0
1902,164,-164.0
1903,158,-158.0
1904,161,-161.0
1905,155,-155.0
1906,173,-173.0
1907,166,-166.0
1908,188,-188.0
1909,164,-164.0
1910,156,-156.0
1911,160,-160.0
1912,157,-157.0
1913,165,-165.0
1914,155,-155.0
1915,165,-165.0
1916,162,-162.0
1917,160,-160.0
1918,163,-163.0
1919,176,-176.0
1920,171,-171.0
1921,190,-190.0
1922,116,-116.0
1923,98,-98.0
1924,111,-111.0
1925,200,-200.0
1926,188,-188.0
1927,173,-173.0
1928,159,-159.0
1929,99,-99.0
1930,178,-178.0
1931,174,-174.0
1932,155,-155.0
1933,103,-103.0
1934,174,-174.0
1935,98,-98.0
1936,155,-155.0
1937,160,-160.0
1938,99,-99.0
1939,165,-165.0
1940,165,-165.0
1941,200,-200.0
1942,99,-99.0
1943,167,-167.0
1944,182,-182.0
1945,180,-180.0
1946,152,-152.0
1947,161,-161.0
1948,136,-136.0
1949,200,-200.0
1950,127,-127.0
1951,200,-200.0
1952,200,-200.0
1953,182,-182.0
1954,138,-138.0
1955,138,-138.0
1956,126,-126.0
1957,200,-200.0
1958,145,-145.0
1959,174,-174.0
1960,182,-182.0
1961,163,-163.0
1962,119,-119.0
1963,133,-133.0
1964,135,-135.0
1965,180,-180.0
1966,126,-126.0
1967,124,-124.0
1968,173,-173.0
1969,180,-180.0
1970,174,-174.0
1971,185,-185.0
1972,184,-184.0
1973,182,-182.0
1974,165,-165.0
1975,105,-105.0
1976,200,-200.0
1977,98,-98.0
1978,175,-175.0
1979,200,-200.0
1980,169,-169.0
1981,175,-175.0
1982,134,-134.0
1983,148,-148.0
1984,147,-147.0
1985,138,-138.0
1986,172,-172.0
1987,174,-174.0
1988,129,-129.0
1989,187,-187.0
1990,122,-122.0
1991,162,-162.0
1992,119,-119.0
1993,165,-165.0
1994,153,-153.0
1995,177,-177.0
1996,200,-200.0
1997,200,-200.0
1998,121,-121.0
1999,200,-200.0
2000,200,-200.0
2001,103,-103.0
2002,200,-200.0
2003,95,-95.0
2004,108,-108.0
2005,200,-200.0
2006,200,-200.0
2007,132,-132.0
2008,200,-200.0
2009,200,-200.0
2010,92,-92.0
2011,171,-171.0
2012,91,-91.0
2013,154,-154.0
2014,119,-119.0
2015,95,-95.0
2016,93,-93.0
2017,171,-171.0
2018,99,-99.0
2019,121,-121.0
2020,151,-151.0
2021,183,-183.0
2022,93,-93.0
2023,191,-191.0
2024,155,-155.0
2025,174,-174.0
2026,99,-99.0
2027,157,-157.0
2028,152,-152.0
2029,159,-159.0
2030,161,-161.0
2031,164,-164.0
2032,94,-94.0
2033,104,-104.0
2034,157,-157.0
2035,153,-153.0
2036,87,-87.0
2037,200,-200.0
2038,87,-87.0
2039,87,-87.0
2040,180,-180.0
2041,155,-155.0
2042,189,-189.0
2043,152,-152.0
2044,160,-160.0
2045,88,-88.0
2046,160,-160.0
2047,93,-93.0
2048,151,-151.0
2049,158,-158.0
2050,149,-149.0
2051,130,-130.0
2052,139,-139.0
2053,99,-99.0
2054,148,-148.0
2055,156,-156.0
2056,85,-85.0
2057,90,-90.0
2058,85,-85.0
2059,155,-155.0
2060,107,-107.0
2061,154,-154.0
2062,91,-91.0
2063,148,-148.0
2064,159,-159.0
2065,117,-117.0
2066,150,-150.0
2067,163,-163.0
2068,141,-141.0
2069,105,-105.0
2070,97,-97.0
2071,107,-107.0
2072,85,-85.0
2073,190,-190.0
2074,167,-167.0
2075,162,-162.0
2076,158,-158.0
2077,95,-95.0
2078,91,-91.0
2079,140,-140.0
2080,88,-88.0
2081,150,-150.0
2082,167,-167.0
2083,150,-150.0
2084,88,-88.0
2085,121,-121.0
2086,179,-179.0
2087,86,-86.0
2088,91,-91.0
2089,178,-178.0
2090,160,-160.0
2091,189,-189.0
2092,151,-151.0
2093,107,-107.0
2094,160,-160.0
2095,158,-158.0
2096,88,-88.0
2097,86,-86.0
2098,94,-94.0
2099,88,-88.0
2100,144,-144.0
2101,164,-164.0
2102,170,-170.0
2103,139,-139.0
2104,92,-92.0
2105,150,-150.0
2106,155,-155.0
2107,168,-168.0
2108,197,-197.0
2109,200,-200.0
2110,152,-152.0
2111,146,-146.0
2112,86,-86.0
2113,146,-146.0
2114,89,-89.0
2115,154,-154.0
2116,90,-90.0
2117,148,-148.0
2118,143,-143.0
2119,145,-145.0
2120,96,-96.0
2121,93,-93.0
2122,119,-119.0
2123,152,-152.0
2124,135,-135.0
2125,86,-86.0
2126,129,-129.0
2127,166,-166.0
2128,83,-83.0
2129,144,-144.0
2130,157,-157.0
2131,140,-140.0
2132,146,-146.0
2133,137,-137.0
2134,154,-154.0
2135,148,-148.0
2136,152,-152.0
2137,141,-141.0
2138,163,-163.0
2139,146,-146.0
2140,139,-139.0
2141,112,-112.0
2142,146,-146.0
2143,97,-97.0
2144,90,-90.0
2145,151,-151.0
2146,177,-177.0
2147,94,-94.0
2148,88,-88.0
2149,154,-154.0
2150,147,-147.0
2151,152,-152.0
2152,146,-146.0
2153,149,-149.0
2154,141,-141.0
2155,148,-148.0
2156,142,-142.0
2157,86,-86.0
2158,140,-140.0
2159,154,-154.0
2160,150,-150.0
2161,168,-168.0
2162,93,-93.0
2163,102,-102.0
2164,154,-154.0
2165,164,-164.0
2166,171,-171.0
2167,90,-90.0
2168,157,-157.0
2169,95,-95.0
2170,152,-152.0
2171,154,-154.0
2172,148,-148.0
2173,155,-155.0
2174,152,-152.0
2175,147,-147.0
2176,92,-92.0
2177,141,-141.0
2178,140,-140.0
2179,143,-143.0
2180,133,-133.0
2181,143,-143.0
2182,152,-152.0
2183,118,-118.0
2184,90,-90.0
2185,137,-137.0
2186,88,-88.0
2187,146,-146.0
2188,151,-151.0
2189,149,-149.0
2190,91,-91.0
2191,144,-144.0
2192,150,-150.0
2193,155,-155.0
2194,157,-157.0
2195,146,-146.0
2196,98,-98.0
2197,91,-91.0
2198,139,-139.0
2199,122,-122.0
2200,116,-116.0
2201,139,-139.0
2202,127,-127.0
2203,137,-137.0
2204,153,-153.0
2205,117,-117.0
2206,152,-152.0
2207,122,-122.0
2208,151,-151.0
2209,114,-114.0
2210,114,-114.0
2211,135,-135.0
2212,116,-116.0
2213,129,-129.0
2214,94,-94.0
2215,84,-84.0
2216,100,-100.0
2217,87,-87.0
2218,113,-113.0
2219,155,-155.0
2220,113,-113.0
2221,134,-134.0
2222,117,-117.0
2223,118,-118.0
2224,114,-114.0
2225,166,-166.0
2226,105,-105.0
2227,85,-85.0
2228,169,-169.0
2229,107,-107.0
2230,126,-126.0
2231,147,-147.0
2232,136,-136.0
2233,172,-172.0
2234,87,-87.0
2235,117,-117.0
2236,115,-115.0
2237,147,-147.0
2238,147,-147.0
2239,165,-165.0
2240,163,-163.0
2241,189,-189.0
2242,170,-170.0
2243,158,-158.0
2244,97,-97.0
2245,92,-92.0
2246,145,-145.0
2247,148,-148.0
2248,160,-160.0
2249,148,-148.0
2250,151,-151.0
2251,163,-163.0
2252,167,-167.0
2253,165,-165.0
2254,158,-158.0
2255,171,-171.0
2256,159,-159.0
2257,156,-156.0
2258,156,-156.0
2259,157,-157.0
2260,163,-163.0
2261,184,-184.0
2262,85,-85.0
2263,98,-98.0
2264,147,-147.0
2265,157,-157.0
2266,164,-164.0
2267,155,-155.0
2268,84,-84.0
2269,157,-157.0
2270,90,-90.0
2271,163,-163.0
2272,90,-90.0
2273,160,-160.0
2274,163,-163.0
2275,155,-155.0
2276,150,-150.0
2277,84,-84.0
2278,156,-156.0
2279,163,-163.0
2280,149,-149.0
2281,155,-155.0
2282,101,-101.0
2283,99,-99.0
2284,147,-147.0
2285,192,-192.0
2286,143,-143.0
2287,87,-87.0
2288,144,-144.0
2289,157,-157.0
2290,93,-93.0
2291,151,-151.0
2292,164,-164.0
2293,161,-161.0
2294,87,-87.0
2295,96,-96.0
2296,96,-96.0
2297,88,-88.0
2298,162,-162.0
2299,144,-144.0
2300,152,-152.0
2301,148,-148.0
2302,154,-154.0
2303,87,-87.0
2304,84,-84.0
2305,86,-86.0
2306,149,-149.0
2307,160,-160.0
2308,121,-121.0
2309,147,-147.0
2310,99,-99.0
2311,179,-179.0
2312,159,-159.0
2313,84,-84.0
2314,105,-105.0
2315,144,-144.0
2316,144,-144.0
2317,86,-86.0
2318,149,-149.0
2319,143,-143.0
2320,147,-147.0
2321,152,-152.0
2322,108,-108.0
2323,146,-146.0
2324,148,-148.0
2325,86,-86.0
2326,151,-151.0
2327,159,-159.0
2328,100,-100.0
2329,153,-153.0
2330,97,-97.0
2331,158,-158.0
2332,175,-175.0
2333,158,-158.0
2334,149,-149.0
2335,153,-153.0
2336,143,-143.0
2337,92,-92.0
2338,142,-142.0
2339,90,-90.0
2340,144,-144.0
2341,150,-150.0
2342,154,-154.0
2343,139,-139.0
2344,143,-143.0
2345,150,-150.0
2346,87,-87.0
2347,87,-87.0
2348,93,-93.0
2349,163,-163.0
2350,161,-161.0
2351,157,-157.0
2352,88,-88.0
2353,121,-121.0
2354,86,-86.0
2355,155,-155.0
2356,167,-167.0
2357,85,-85.0
2358,132,-132.0
2359,176,-176.0
2360,143,-143.0
2361,95,-95.0
2362,143,-143.0
2363,149,-149.0
2364,85,-85.0
2365,142,-142.0
2366,134,-134.0
2367,86,-86.0
2368,132,-132.0
2369,136,-136.0
2370,113,-113.0
2371,172,-172.0
2372,87,-87.0
2373,85,-85.0
2374,90,-90.0
2375,105,-105.0
2376,192,-192.0
2377,114,-114.0
2378,104,-104.0
2379,172,-172.0
2380,134,-134.0
2381,105,-105.0
2382,149,-149.0
2383,84,-84.0
2384,152,-152.0
2385,154,-154.0
2386,146,-146.0
2387,111,-111.0
2388,107,-107.0
2389,177,-177.0
2390,167,-167.0
2391,117,-117.0
2392,90,-90.0
2393,106,-106.0
2394,92,-92.0
2395,89,-89.0
2396,91,-91.0
2397,158,-158.0
2398,109,-109.0
2399,150,-150.0
2400,141,-141.0
2401,155,-155.0
2402,188,-188.0
2403,172,-172.0
2404,106,-106.0
2405,90,-90.0
2406,110,-110.0
2407,89,-89.0
2408,113,-113.0
2409,135,-135.0
2410,143,-143.0
2411,85,-85.0
2412,89,-89.0
2413,140,-140.0
2414,94,-94.0
2415,149,-149.0
2416,99,-99.0
2417,137,-137.0
2418,151,-151.0
2419,139,-139.0
2420,155,-155.0
2421,87,-87.0
2422,150,-150.0
2423,101,-101.0
2424,94,-94.0
2425,112,-112.0
2426,134,-134.0
2427,141,-141.0
2428,155,-155.0
2429,153,-153.0
2430,143,-143.0
2431,85,-85.0
2432,145,-145.0
2433,139,-139.0
2434,144,-144.0
2435,162,-162.0
2436,145,-145.0
2437,140,-140.0
2438,148,-148.0
2439,87,-87.0
2440,84,-84.0
2441,148,-148.0
2442,147,-147.0
2443,141,-141.0
2444,146,-146.0
2445,141,-141.0
2446,92,-92.0
2447,148,-148.0
2448,144,-144.0
2449,139,-139.0
2450,134,-134.0
2451,152,-152.0
2452,140,-140.0
2453,172,-172.0
2454,147,-147.0
2455,150,-150.0
2456,144,-144.0
2457,171,-171.0
2458,87,-87.0
2459,145,-145.0
2460,141,-141.0
2461,91,-91.0
2462,143,-143.0
2463,146,-146.0
2464,150,-150.0
2465,144,-144.0
2466,171,-171.0
2467,141,-141.0
2468,152,-152.0
2469,83,-83.0
2470,151,-151.0
2471,154,-154.0
2472,165,-165.0
2473,90,-90.0
2474,149,-149.0
2475,97,-97.0
2476,154,-154.0
2477,159,-159.0
2478,149,-149.0
2479,144,-144.0
2480,105,-105.0
2481,145,-145.0
2482,165,-165.0
2483,162,-162.0
2484,150,-150.0
2485,153,-153.0
2486,158,-158.0
2487,85,-85.0
2488,93,-93.0
2489,114,-114.0
2490,200,-200.0
2491,161,-161.0
2492,143,-143.0
2493,85,-85.0
2494,99,-99.0
2495,149,-149.0
2496,148,-148.0
2497,160,-160.0
2498,171,-171.0
2499,158,-158.0
2500,154,-154.0
2501,149,-149.0
2502,200,-200.0
2503,162,-162.0
2504,200,-200.0
2505,139,-139.0
2506,200,-200.0
2507,152,-152.0
2508,143,-143.0
2509,200,-200.0
2510,161,-161.0
2511,154,-154.0
2512,200,-200.0
2513,200,-200.0
2514,180,-180.0
2515,151,-151.0
2516,147,-147.0
2517,200,-200.0
2518,160,-160.0
2519,200,-200.0
2520,156,-156.0
2521,200,-200.0
2522,154,-154.0
2523,155,-155.0
2524,159,-159.0
2525,154,-154.0
2526,186,-186.0
2527,170,-170.0
2528,200,-200.0
2529,155,-155.0
2530,155,-155.0
2531,148,-148.0
2532,158,-158.0
2533,200,-200.0
2534,140,-140.0
2535,145,-145.0
2536,98,-98.0
2537,156,-156.0
2538,143,-143.0
2539,92,-92.0
2540,140,-140.0
2541,152,-152.0
2542,150,-150.0
2543,154,-154.0
2544,148,-148.0
2545,200,-200.0
2546,152,-152.0
2547,155,-155.0
2548,149,-149.0
2549,162,-162.0
2550,149,-149.0
2551,200,-200.0
2552,97,-97.0
2553,200,-200.0
2554,200,-200.0
2555,153,-153.0
2556,97,-97.0
2557,169,-169.0
2558,159,-159.0
2559,151,-151.0
2560,200,-200.0
2561,200,-200.0
2562,156,-156.0
2563,161,-161.0
2564,161,-161.0
2565,88,-88.0
2566,200,-200.0
2567,158,-158.0
2568,150,-150.0
2569,166,-166.0
2570,164,-164.0
2571,162,-162.0
2572,185,-185.0
2573,165,-165.0
2574,156,-156.0
2575,96,-96.0
2576,200,-200.0
2577,175,-175.0
2578,162,-162.0
2579,105,-105.0
2580,172,-172.0
2581,99,-99.0
2582,200,-200.0
2583,152,-152.0
2584,100,-100.0
2585,200,-200.0
2586,152,-152.0
2587,200,-200.0
2588,153,-153.0
2589,149,-149.0
2590,200,-200.0
2591,121,-121.0
2592,174,-174.0
2593,165,-165.0
2594,155,-155.0
2595,200,-200.0
2596,103,-103.0
2597,200,-200.0
2598,200,-200.0
2599,198,-198.0
2600,180,-180.0
2601,162,-162.0
2602,153,-153.0
2603,158,-158.0
2604,110,-110.0
2605,200,-200.0
2606,167,-167.0
2607,157,-157.0
2608,200,-200.0
2609,200,-200.0
2610,150,-150.0
2611,155,-155.0
2612,171,-171.0
2613,164,-164.0
2614,111,-111.0
2615,144,-144.0
2616,126,-126.0
2617,138,-138.0
2618,117,-117.0
2619,169,-169.0
2620,200,-200.0
2621,127,-127.0
2622,119,-119.0
2623,92,-92.0
2624,161,-161.0
2625,200,-200.0
2626,132,-132.0
2627,157,-157.0
2628,151,-151.0
2629,135,-135.0
2630,115,-115.0
2631,129,-129.0
2632,96,-96.0
2633,116,-116.0
2634,98,-98.0
2635,106,-106.0
2636,171,-171.0
2637,155,-155.0
2638,155,-155.0
2639,150,-150.0
2640,97,-97.0
2641,92,-92.0
2642,162,-162.0
2643,162,-162.0
2644,166,-166.0
2645,167,-167.0
2646,152,-152.0
2647,160,-160.0
2648,105,-105.0
2649,158,-158.0
2650,91,-91.0
2651,157,-157.0
2652,142,-142.0
2653,168,-168.0
2654,159,-159.0
2655,99,-99.0
2656,162,-162.0
2657,160,-160.0
2658,140,-140.0
2659,153,-153.0
2660,154,-154.0
2661,158,-158.0
2662,159,-159.0
2663,151,-151.0
2664,145,-145.0
2665,139,-139.0
2666,149,-149.0
2667,147,-147.0
2668,152,-152.0
2669,148,-148.0
2670,152,-152.0
2671,147,-147.0
2672,152,-152.0
2673,158,-158.0
2674,157,-157.0
2675,162,-162.0
2676,144,-144.0
2677,161,-161.0
2678,155,-155.0
2679,163,-163.0
2680,152,-152.0
2681,171,-171.0
2682,147,-147.0
2683,165,-165.0
2684,153,-153.0
2685,159,-159.0
2686,154,-154.0
2687,100,-100.0
2688,158,-158.0
2689,160,-160.0
2690,162,-162.0
2691,92,-92.0
2692,164,-164.0
2693,148,-148.0
2694,153,-153.0
2695,149,-149.0
2696,86,-86.0
2697,158,-158.0
2698,171,-171.0
2699,161,-161.0
2700,158,-158.0
2701,151,-151.0
2702,149,-149.0
2703,147,-147.0
2704,104,-104.0
2705,170,-170.0
2706,114,-114.0
2707,152,-152.0
2708,89,-89.0
2709,143,-143.0
2710,148,-148.0
2711,155,-155.0
2712,94,-94.0
2713,105,-105.0
2714,91,-91.0
2715,163,-163.0
2716,86,-86.0
2717,144,-144.0
2718,149,-149.0
2719,150,-150.0
2720,84,-84.0
2721,167,-167.0
2722,154,-154.0
2723,150,-150.0
2724,151,-151.0
2725,153,-153.0
2726,89,-89.0
2727,113,-113.0
2728,146,-146.0
2729,150,-150.0
2730,153,-153.0
2731,85,-85.0
2732,154,-154.0
2733,147,-147.0
2734,170,-170.0
2735,100,-100.0
2736,153,-153.0
2737,159,-159.0
2738,150,-150.0
2739,109,-109.0
2740,101,-101.0
2741,149,-149.0
2742,152,-152.0
2743,90,-90.0
2744,159,-159.0
2745,104,-104.0
2746,150,-150.0
2747,90,-90.0
2748,160,-160.0
2749,99,-99.0
2750,90,-90.0
