episodes,steps,rewards
0,92,-245.94169821569298
1,80,-160.2588492097624
2,119,-155.2776676957967
3,104,-65.17851710405027
4,90,-203.5102934052963
5,73,-171.93243437542077
6,75,-152.428000331142
7,76,-317.3069264877674
8,84,23.081662356439722
9,74,-109.45717803221366
10,137,5.773401431678337
11,71,-92.58851802830333
12,107,-209.9854208133097
13,98,-295.8998491341848
14,106,-77.19184700952502
15,154,-161.76628950174802
16,90,-103.59882363064992
17,138,-171.4355478336961
18,152,-67.09248417061099
19,73,-131.47285765921433
20,123,-109.43513343325994
21,147,-94.67831634246201
22,129,-136.14304822806417
23,88,-301.70040941294656
24,111,-282.9058529423613
25,136,-209.59670850947634
26,108,-305.2692932466925
27,116,-238.06641908148194
28,120,-230.52356908733498
29,106,-220.51888207433166
30,102,-135.01978550584175
31,92,-266.8239571669148
32,90,-241.2910800172899
33,141,-477.20140978170525
34,143,-142.37821686663318
35,190,-149.15769526413752
36,108,-112.0242894711814
37,107,-128.27797791862696
38,76,-207.87890711395804
39,115,-123.72909899753589
40,162,-199.82541247999052
41,134,18.68698525026302
42,412,-107.77861109877169
43,1000,-79.84985342042029
44,126,-99.8339082743652
45,153,-139.63358700827897
46,167,-38.276202301949596
47,218,-133.33876470850606
48,184,-148.32274967339725
49,249,15.62763640067078
50,197,-36.574838150617396
51,113,-72.03624589589299
52,232,-17.767814055278535
53,211,-6.744225141879014
54,244,-48.508781214486305
55,165,-62.41653966156994
56,123,-113.80232350515438
57,277,-367.8569333779133
58,1000,-74.2588301347786
59,233,-59.18261700393131
60,216,10.616930608506564
61,191,-88.23269810691454
62,377,-139.90045162623437
63,127,18.887715507500985
64,692,-47.5452476263041
65,744,-118.22225370880733
66,1000,-69.48456427625693
67,1000,-73.54359014124135
68,148,-30.743912240500194
69,1000,-63.273097611436214
70,1000,-77.2566590185111
71,117,-49.78177708654508
72,1000,-50.14685484433066
73,91,-293.2848714375089
74,207,-127.41239200642029
75,501,-186.7114952078691
76,335,-121.8140895938952
77,176,-65.4581481211448
78,416,-223.81245210188257
79,214,-75.78558466109217
80,979,-247.73822207855284
81,442,-139.58532460094457
82,362,-72.12065922641807
83,374,-206.9742645574035
84,204,-105.60753451875938
85,153,-119.6711568818731
86,92,-143.95557503214587
87,330,-48.34081319949435
88,368,-301.13868885585043
89,1000,-69.70949400134816
90,539,-89.58782251608667
91,57,-221.49096687361117
92,1000,-40.98861485045003
93,567,-132.706154851335
94,1000,-76.3683709577774
95,1000,-100.58141959765106
96,255,-212.1206623746948
97,1000,-94.5182408745127
98,1000,-51.86395214512426
99,1000,-109.45567209810582
100,1000,-12.321297882455177
101,1000,-37.504795705393306
102,1000,-12.497788843802173
103,1000,-47.1210083283458
104,1000,-38.348099759303054
105,963,-344.19341375859267
106,747,-136.1291362468125
107,137,-83.0826273716824
108,1000,57.041396759437795
109,151,-120.0404829698125
110,1000,-28.42125066565844
111,488,-147.43660634494773
112,218,-195.07425847368128
113,1000,-47.809358696581874
114,1000,-33.27903358759488
115,175,-85.04246481445371
116,1000,0.2054267430674721
117,1000,-13.186185954494903
118,801,-101.9780684988521
119,1000,-34.53053084438041
120,1000,18.64531421282221
121,52,-128.70563995631193
122,1000,34.6395481146995
123,948,110.51084455127867
124,1000,-26.121963068662627
125,1000,-2.5227414419756986
126,1000,-99.7684036827539
127,438,-260.05938858781496
128,1000,-41.189121309197205
129,945,-229.95178095715585
130,1000,30.138519572737028
131,1000,-58.60734307150387
132,710,114.18385346961904
133,631,-54.73456771685133
134,768,126.88774075497312
135,1000,-90.48523253738891
136,1000,-27.049493522843846
137,614,-62.17702593000399
138,522,-357.55440084748045
139,1000,-4.623691760354788
140,1000,14.970133674389885
141,978,-424.64319028184474
142,103,-65.67253625197557
143,354,186.7896849669906
144,520,-54.40424231678807
145,500,271.079568875268
146,1000,-29.458092668809886
147,244,-75.81790372184798
148,1000,-20.630971969291476
149,422,219.31047014105553
150,1000,19.145809318705716
151,250,6.775808308605903
152,395,208.72297010031622
153,1000,12.348878896479597
154,948,153.99141832032655
155,373,215.99983030338748
156,305,275.7281013234724
157,1000,5.110016004580039
158,109,-111.73783525558432
159,497,208.84948520341646
160,202,-44.032254848711844
161,331,46.92878611403219
162,621,-130.8602313808756
163,315,-89.08873504705734
164,389,-190.04255449710587
165,683,221.4847033112046
166,412,-34.05547411727757
167,168,23.615896619546575
168,521,198.05939835983384
169,154,-29.78772643169124
170,643,216.67204878109368
171,710,195.24541778536712
172,936,167.64049022242614
173,773,223.328940468753
174,576,-210.81413324130733
175,191,-24.516471374572603
176,522,262.29635194564037
177,146,1.3395988200695115
178,237,32.64813861226676
179,525,216.22060272177674
180,615,189.02280904441386
181,167,-33.44453617004925
182,108,34.27018773154762
183,619,188.04723156617666
184,569,163.7420211551957
185,969,-152.48772820230135
186,550,174.47168898982608
187,294,-32.14357380827062
188,374,-24.860020770307088
189,316,-48.99038861729868
190,415,253.11844920876626
191,597,231.39418762369021
192,548,203.0779130005454
193,446,193.10795488378642
194,404,-249.72690132365898
195,486,-204.27708073116008
196,313,-203.50408214526442
197,414,225.79812427872022
198,447,237.592885411396
199,949,152.70128708239207
200,376,240.96369249144774
201,1000,-36.44769602208055
202,238,-31.108332591222677
203,1000,-40.90440099392262
204,502,219.72020821803073
205,470,236.84531147178623
206,445,240.54314242730638
207,667,160.48738707257118
208,422,-40.97341680148687
209,433,193.39655868771814
210,570,185.91304946583665
211,631,180.24517558285754
212,499,115.14591739134235
213,1000,30.178318388060966
214,423,201.3030037577009
215,608,-89.3073250403759
216,688,197.29686810726724
217,670,-169.68349135773633
218,382,203.29834050074606
219,487,-182.29376837550126
220,236,-90.96732584259635
221,557,174.37304137497077
222,357,240.7149860963627
223,1000,-47.6637540334029
224,847,156.363079588599
225,1000,-24.168789441754466
226,1000,-41.792761156658116
227,396,196.3104312390996
228,518,198.75167259838204
229,612,228.96270715322945
230,684,-59.316107073816084
231,1000,69.47885308443352
232,368,263.194665118829
233,390,198.4167778838768
234,370,218.15496316001065
235,426,160.6376924589283
236,459,224.88836740021597
237,668,226.6990402742765
238,266,1.8009243124371892
239,480,248.97789123912779
240,401,-235.9302269952465
241,453,245.57952258839768
242,314,-113.12079939445165
243,525,214.14380384201948
244,489,196.9976390753951
245,848,166.76245783466754
246,783,-66.18673856581401
247,379,-33.566684282620926
248,218,-1064.6376585773053
249,347,223.6244695385506
250,338,254.60878211203115
251,599,150.70121740498095
252,391,230.80362031763804
253,685,171.55130479647067
254,389,210.22498260987706
255,78,-30.547290317625553
256,779,170.18891428169863
257,156,-50.32756370331967
258,498,-156.21912467117573
259,584,185.60261647700457
260,938,79.28176486088367
261,708,250.4248919730028
262,511,176.88238100046698
263,57,-124.87438774300027
264,374,220.18873686109393
265,71,-128.48507864379275
266,416,256.2112326236922
267,584,-156.4653400826622
268,378,236.9728516280158
269,675,193.10807598320994
270,341,222.1705031401536
271,440,242.92174897571664
272,347,224.82667545859718
273,499,197.57071890878706
274,301,297.8274282152255
275,507,235.6748020621372
276,296,268.84838135161215
277,491,218.71406570288244
278,339,246.55397385015218
279,379,267.26092167031425
280,814,131.71782951390477
281,394,232.27605424857353
282,327,279.4343266735907
283,481,259.7362390398181
284,347,282.6208881310964
285,394,267.03238787413136
286,414,249.15362884443005
287,338,224.17416608452552
288,300,253.52410807503324
289,323,264.4650217216456
290,375,276.40758131032464
291,358,231.2226771945037
292,1000,6.967869286583123
293,963,183.2203685168493
294,350,235.20421213203196
295,398,284.28829948428904
296,575,261.3685457771154
297,368,253.04317282232302
298,574,244.36436109079062
299,861,181.93886812378017
300,346,237.02912331933362
301,420,231.5462933035268
302,390,264.16645930969264
303,415,258.14847829752466
304,448,235.7937975381728
305,358,284.5432049131812
306,273,-21.031466508828572
307,691,-296.075312107332
308,409,209.39045043431304
309,125,-55.4145353434686
310,588,169.41093071056258
311,1000,-115.47065376268245
312,332,261.0745872848215
313,485,265.85472226911804
314,637,162.72919294780866
315,330,215.31111861769133
316,348,225.59368825894887
317,463,233.43030790239078
318,442,244.70634879257025
319,314,243.41410992126222
320,290,253.8684060506516
321,401,215.45813406113945
322,69,-123.38758044143857
323,62,-107.10629972337706
324,90,-150.0910799698794
325,375,245.67069872224226
326,365,278.44300337045377
327,418,244.5335378979688
328,584,157.95417319784852
329,520,243.53711845918622
330,543,157.29855446033383
331,334,262.869661518135
332,452,252.1163363733699
333,337,250.00538728433355
334,623,146.3011002205687
335,580,222.07270928032642
336,429,266.9590140226409
337,444,266.54113563705204
338,413,271.5981433173084
339,1000,98.6548740586231
340,424,247.76830108323944
341,377,226.49842200516824
342,408,247.21623463062545
343,295,247.33247430482135
344,360,251.76815935171155
345,384,204.41381694761827
346,157,-35.06351627634089
347,377,254.35005416887708
348,84,-61.39076631345512
349,228,30.15886786812706
350,556,240.86067017588107
351,453,228.75968880984314
352,490,260.19892942362037
353,253,282.20065800980603
354,294,254.62117347412791
355,835,-127.14333184221132
356,437,256.1326924668732
357,287,284.92006575207944
358,289,252.13458384248486
359,445,220.83890963993377
360,333,252.4439356728364
361,335,239.68829511510322
362,283,244.86084535762726
363,512,205.71503951230005
364,934,-252.15014064457966
365,266,256.299639215188
366,632,196.43195876100347
367,532,-149.47563038980687
368,629,229.44519151590964
369,400,214.67740938359958
370,601,152.33086807583135
371,435,211.11221219859107
372,190,-8.416952231018769
373,357,218.03222774106064
374,336,250.02204269920912
375,804,131.235424426505
376,332,252.995942345455
377,332,266.24855158001264
378,264,298.1044548832604
379,683,241.70008449663922
380,478,234.54813351226898
381,417,207.2857587566926
382,328,265.5674081821278
383,411,258.75936528642603
384,319,184.9045570944848
385,477,193.8466623233777
386,298,223.9098372808909
387,295,250.395355492479
388,326,276.9144218895526
389,350,281.65428836179694
390,318,209.0061044374222
391,392,239.53440798831983
392,416,247.313790295218
393,344,230.57156624456456
394,195,24.405239395934814
395,363,220.16267364394452
396,254,222.59403644934645
397,1000,124.62152423670278
398,286,265.4915389226711
399,400,255.2598549518155
400,341,247.6633090851862
401,331,61.722543267119136
402,502,225.56100808312075
403,370,224.6605427109215
404,308,221.061656396354
405,429,-210.8024316694303
406,198,-32.37071965297211
407,469,208.2062982425705
408,1000,-19.2361888665662
409,395,277.11646715085203
410,341,266.48002152628237
411,368,231.66936715807415
412,95,23.801763461948667
413,414,242.4200454408135
414,470,260.50946387665147
415,284,250.58754744794135
416,273,288.4660397458454
417,287,283.498272536786
418,271,300.5779184474671
419,566,201.27293743801852
420,590,169.7574075601852
421,375,156.21301828479665
422,495,251.97284228762788
423,578,145.6932147121935
424,630,-267.2585832840109
425,424,257.9696885053197
426,563,218.88878283961122
427,517,221.3212054769063
428,342,222.62453773012777
429,283,-338.95757758003674
430,700,-225.1005687780601
431,389,209.35458575484506
432,488,203.02444975928256
433,313,235.7619401740505
434,426,192.03042550134998
435,283,238.6330469029752
436,411,237.75321233143367
437,437,212.57385883228835
438,478,247.71495451255888
439,398,223.71047732796035
440,322,269.9895079376364
441,400,236.50088979382224
442,574,174.00940157634565
443,298,225.1636435784349
444,430,247.00547383428292
445,286,274.2855473041775
446,403,249.61134740943527
447,462,250.06468797832835
448,370,250.04751716126407
449,257,282.1046806146311
450,397,199.0956591915
451,122,-50.894531231547376
452,571,148.7569648171004
453,246,273.8079637679828
454,289,234.64767855341015
455,289,280.60525715154733
456,326,235.16130737294168
457,367,259.30201360829983
458,345,246.82253505180302
459,412,267.9606420684818
460,201,13.464149286295296
461,391,245.6695505459066
462,404,254.9684942130665
463,537,233.15067184281574
464,323,217.13677916357858
465,376,256.4091738103509
466,612,130.9338775593552
467,326,213.79836494687862
468,317,255.7537977518942
469,286,244.476751229143
470,370,215.80578277191023
471,292,296.5242199356233
472,264,266.6305750276729
473,291,280.59261288283494
474,381,256.55412566579025
475,592,192.09181983536112
476,288,244.17045677388217
