episodes,steps,rewards
0,200,-200.0
1,200,-200.0
2,200,-200.0
3,200,-200.0
4,200,-200.0
5,200,-200.0
6,200,-200.0
7,200,-200.0
8,200,-200.0
9,200,-200.0
10,200,-200.0
11,200,-200.0
12,200,-200.0
13,200,-200.0
14,200,-200.0
15,200,-200.0
16,200,-200.0
17,200,-200.0
18,200,-200.0
19,200,-200.0
20,200,-200.0
21,200,-200.0
22,200,-200.0
23,200,-200.0
24,200,-200.0
25,200,-200.0
26,200,-200.0
27,200,-200.0
28,200,-200.0
29,200,-200.0
30,200,-200.0
31,200,-200.0
32,200,-200.0
33,200,-200.0
34,200,-200.0
35,200,-200.0
36,200,-200.0
37,200,-200.0
38,200,-200.0
39,200,-200.0
40,200,-200.0
41,200,-200.0
42,200,-200.0
43,200,-200.0
44,200,-200.0
45,200,-200.0
46,200,-200.0
47,200,-200.0
48,200,-200.0
49,200,-200.0
50,200,-200.0
51,200,-200.0
52,200,-200.0
53,200,-200.0
54,200,-200.0
55,200,-200.0
56,200,-200.0
57,200,-200.0
58,153,-153.0
59,193,-193.0
60,200,-200.0
61,200,-200.0
62,200,-200.0
63,200,-200.0
64,200,-200.0
65,200,-200.0
66,200,-200.0
67,200,-200.0
68,200,-200.0
69,200,-200.0
70,200,-200.0
71,200,-200.0
72,200,-200.0
73,200,-200.0
74,200,-200.0
75,200,-200.0
76,200,-200.0
77,200,-200.0
78,200,-200.0
79,200,-200.0
80,200,-200.0
81,200,-200.0
82,200,-200.0
83,200,-200.0
84,163,-163.0
85,200,-200.0
86,200,-200.0
87,200,-200.0
88,191,-191.0
89,200,-200.0
90,200,-200.0
91,200,-200.0
92,110,-110.0
93,200,-200.0
94,200,-200.0
95,200,-200.0
96,200,-200.0
97,200,-200.0
98,200,-200.0
99,200,-200.0
100,200,-200.0
101,154,-154.0
102,200,-200.0
103,200,-200.0
104,200,-200.0
105,200,-200.0
106,200,-200.0
107,200,-200.0
108,161,-161.0
109,200,-200.0
110,200,-200.0
111,159,-159.0
112,200,-200.0
113,173,-173.0
114,200,-200.0
115,186,-186.0
116,153,-153.0
117,200,-200.0
118,134,-134.0
119,124,-124.0
120,200,-200.0
121,200,-200.0
122,194,-194.0
123,168,-168.0
124,191,-191.0
125,152,-152.0
126,168,-168.0
127,200,-200.0
128,160,-160.0
129,158,-158.0
130,200,-200.0
131,119,-119.0
132,168,-168.0
133,115,-115.0
134,123,-123.0
135,104,-104.0
136,176,-176.0
137,169,-169.0
138,200,-200.0
139,169,-169.0
140,168,-168.0
141,165,-165.0
142,177,-177.0
143,115,-115.0
144,105,-105.0
145,114,-114.0
146,121,-121.0
147,107,-107.0
148,169,-169.0
149,156,-156.0
150,113,-113.0
151,183,-183.0
152,112,-112.0
153,154,-154.0
154,157,-157.0
155,184,-184.0
156,197,-197.0
157,116,-116.0
158,104,-104.0
159,161,-161.0
160,175,-175.0
161,125,-125.0
162,200,-200.0
163,93,-93.0
164,138,-138.0
165,200,-200.0
166,174,-174.0
167,145,-145.0
168,170,-170.0
169,156,-156.0
170,186,-186.0
171,200,-200.0
172,146,-146.0
173,89,-89.0
174,200,-200.0
175,173,-173.0
176,186,-186.0
177,91,-91.0
178,160,-160.0
179,116,-116.0
180,152,-152.0
181,92,-92.0
182,162,-162.0
183,198,-198.0
184,154,-154.0
185,182,-182.0
186,148,-148.0
187,165,-165.0
188,87,-87.0
189,181,-181.0
190,156,-156.0
191,185,-185.0
192,92,-92.0
193,87,-87.0
194,171,-171.0
195,168,-168.0
196,165,-165.0
197,86,-86.0
198,87,-87.0
199,94,-94.0
200,167,-167.0
201,94,-94.0
202,168,-168.0
203,185,-185.0
204,176,-176.0
205,85,-85.0
206,189,-189.0
207,159,-159.0
208,151,-151.0
209,87,-87.0
210,172,-172.0
211,167,-167.0
212,200,-200.0
213,93,-93.0
214,91,-91.0
215,141,-141.0
216,99,-99.0
217,83,-83.0
218,95,-95.0
219,171,-171.0
220,155,-155.0
221,145,-145.0
222,151,-151.0
223,174,-174.0
224,153,-153.0
225,180,-180.0
226,93,-93.0
227,148,-148.0
228,184,-184.0
229,146,-146.0
230,153,-153.0
231,165,-165.0
232,103,-103.0
233,158,-158.0
234,111,-111.0
235,85,-85.0
236,105,-105.0
237,94,-94.0
238,93,-93.0
239,83,-83.0
240,83,-83.0
241,132,-132.0
242,86,-86.0
243,156,-156.0
244,182,-182.0
245,145,-145.0
246,181,-181.0
247,173,-173.0
248,151,-151.0
249,180,-180.0
250,87,-87.0
251,155,-155.0
252,87,-87.0
253,167,-167.0
254,86,-86.0
255,164,-164.0
256,143,-143.0
257,178,-178.0
258,154,-154.0
259,146,-146.0
260,86,-86.0
261,154,-154.0
262,141,-141.0
263,85,-85.0
264,151,-151.0
265,150,-150.0
266,148,-148.0
267,149,-149.0
268,88,-88.0
269,150,-150.0
270,192,-192.0
271,148,-148.0
272,111,-111.0
273,88,-88.0
274,166,-166.0
275,104,-104.0
276,84,-84.0
277,88,-88.0
278,173,-173.0
279,160,-160.0
280,110,-110.0
281,145,-145.0
282,105,-105.0
283,86,-86.0
284,174,-174.0
285,89,-89.0
286,148,-148.0
287,149,-149.0
288,171,-171.0
289,147,-147.0
290,168,-168.0
291,146,-146.0
292,163,-163.0
293,153,-153.0
294,116,-116.0
295,152,-152.0
296,146,-146.0
297,148,-148.0
298,88,-88.0
299,110,-110.0
300,93,-93.0
301,148,-148.0
302,140,-140.0
303,142,-142.0
304,146,-146.0
305,154,-154.0
306,146,-146.0
307,149,-149.0
308,143,-143.0
309,120,-120.0
310,168,-168.0
311,147,-147.0
312,182,-182.0
313,87,-87.0
314,200,-200.0
315,91,-91.0
316,150,-150.0
317,95,-95.0
318,90,-90.0
319,94,-94.0
320,151,-151.0
321,108,-108.0
322,154,-154.0
323,89,-89.0
324,152,-152.0
325,158,-158.0
326,150,-150.0
327,174,-174.0
328,151,-151.0
329,103,-103.0
330,91,-91.0
331,87,-87.0
332,200,-200.0
333,147,-147.0
334,175,-175.0
335,147,-147.0
336,134,-134.0
337,200,-200.0
338,112,-112.0
339,145,-145.0
340,155,-155.0
341,200,-200.0
342,200,-200.0
343,93,-93.0
344,148,-148.0
345,138,-138.0
346,155,-155.0
347,105,-105.0
348,150,-150.0
349,157,-157.0
350,153,-153.0
351,175,-175.0
352,98,-98.0
353,144,-144.0
354,156,-156.0
355,89,-89.0
356,146,-146.0
357,92,-92.0
358,165,-165.0
359,94,-94.0
360,134,-134.0
361,150,-150.0
362,139,-139.0
363,154,-154.0
364,154,-154.0
365,197,-197.0
366,110,-110.0
367,154,-154.0
368,200,-200.0
369,149,-149.0
370,88,-88.0
371,90,-90.0
372,154,-154.0
373,99,-99.0
374,145,-145.0
375,98,-98.0
376,88,-88.0
377,161,-161.0
378,152,-152.0
379,95,-95.0
380,98,-98.0
381,145,-145.0
382,163,-163.0
383,181,-181.0
384,171,-171.0
385,93,-93.0
386,172,-172.0
387,165,-165.0
388,155,-155.0
389,143,-143.0
390,102,-102.0
391,137,-137.0
392,91,-91.0
393,85,-85.0
394,87,-87.0
395,138,-138.0
396,121,-121.0
397,174,-174.0
398,143,-143.0
399,95,-95.0
400,142,-142.0
