episodes,steps,rewards
0,96,-134.27390460567074
1,64,-67.60203560068067
2,87,-296.02925016186293
3,64,-106.2430337547946
4,88,-131.69038295701966
5,73,-337.56773452052494
6,61,-149.27463844299376
7,76,-253.37392441453818
8,84,-137.167630631332
9,65,-91.82920236543066
10,87,-369.683730401613
11,76,-80.16627928344425
12,111,-219.22462313318408
13,153,-263.19096495074064
14,187,-587.721698904337
15,99,-271.998202030234
16,115,-223.09345252358102
17,173,-112.72276595023817
18,163,-139.5377575168729
19,450,-250.92835352168706
20,653,-269.50757243821323
21,1000,-243.35063540359198
22,1000,-223.3098084259084
23,458,-278.780964006972
24,1000,-179.26408029655215
25,1000,-153.41681285861725
26,225,-62.98204360334876
27,278,-93.61637757186195
28,162,-77.96795000237036
29,203,-101.32090350487432
30,158,-8.227866443958035
31,656,-34.545812673322885
32,999,-208.5722883714663
33,1000,-80.46725240410083
34,1000,-68.02302771073714
35,1000,17.639444466584088
36,1000,-45.21399324071276
37,1000,-43.381003001885844
38,261,-147.92124192790783
39,804,155.44788001488692
40,1000,-50.300486486534005
41,1000,-70.17757868216357
42,305,-255.9614457169957
43,269,-230.56570732979122
44,1000,-116.87833382329862
45,1000,-47.551764257744885
46,1000,8.666631114341735
47,1000,-62.25835979938421
48,1000,-26.907524120645313
49,1000,12.760750104027053
50,1000,25.176087337749514
51,1000,-10.797194583659312
52,1000,5.129511237725928
53,928,112.55968034295361
54,115,-29.62040238620152
55,95,-499.05972025117876
56,307,-844.8412118639116
57,202,-245.64123422232683
58,433,-210.32605326034724
59,57,-343.7755036118883
60,54,-369.99403592656273
61,51,-314.3495781634613
62,68,-171.265734734911
63,112,-166.94237671171487
64,67,-92.8839681635192
65,89,-153.24774046503592
66,187,-405.3811413738986
67,95,-579.6037318068209
68,115,-473.61914513072605
69,106,-894.8030261735394
70,154,-396.55992708963424
71,101,-197.5976545172463
72,176,-131.83071943721563
73,169,-323.75330041617127
74,548,-306.75623877755686
75,279,-393.7929192116122
76,600,-148.77025211585573
77,114,-98.72877042922998
78,157,-74.63781216776711
79,1000,-288.8006358309761
80,1000,-80.71517122312409
81,633,194.69197308933735
82,712,218.29367514815596
83,211,-73.96527956813188
84,693,-32.76050607639419
85,375,-48.773544913424715
86,1000,11.6968320365496
87,1000,-47.21577673305695
88,508,147.20418970647057
89,693,215.94558785995451
90,426,-238.62482317753995
91,876,-215.07566396672541
92,340,-77.07500543132241
93,1000,-26.981340762279856
94,1000,-4.118689103936158
95,1000,-58.72164079630194
96,841,179.93786680447744
97,765,-269.16759290164407
98,1000,-65.61941426188659
99,485,213.18501923406137
100,138,-238.53644311757384
101,530,-62.13124055868786
102,163,-164.33945753326103
103,1000,-17.902792152990436
104,1000,0.6942872659020467
105,1000,1.4380744021050802
106,954,138.15524309532898
107,892,178.11500394263476
108,689,223.33877788040786
109,676,168.41990629342325
110,594,204.12899210349212
111,629,271.6898727051158
112,434,245.59368264167142
113,99,-234.17286393481618
114,106,-212.77857020147718
115,548,-160.64468710711856
116,611,207.66189095423482
117,785,198.92285448366357
118,425,-33.88285662630288
119,524,193.2831736866849
120,391,185.16852865421308
121,437,-314.65837550870054
122,411,220.95484842871446
123,441,-101.4437746153314
124,926,112.41122625568937
125,713,147.89053609413835
126,380,215.76689894674183
127,624,212.07276781126677
128,467,249.71394755394522
129,468,-10.715886009131992
130,325,241.13940099192934
131,1000,-78.30100485834622
132,674,141.66752241720164
133,152,-162.44574893624642
134,389,-22.242604737888556
135,602,166.753456371376
136,383,255.95475433987284
137,624,209.11863726585253
138,549,211.5706174568241
139,605,219.25281157401275
140,108,-220.72382162391398
141,359,243.81675934511927
142,196,-254.4723435594066
143,378,230.3410593800146
144,420,214.26254181040264
145,509,163.51428242058034
146,382,-21.035422028980662
147,380,247.0758855150401
148,466,239.01110853896603
149,186,-38.16971502083294
150,471,204.50724501640553
151,540,205.70533346394546
152,1000,47.14261701151028
153,368,298.01528391650675
154,387,256.28924395482886
155,280,246.27656002959262
156,568,239.5294404185496
157,477,234.3278712554978
158,366,283.055517282851
159,458,236.97748908495032
160,328,266.4740989633018
161,289,298.88127831761653
162,282,226.33466034526964
163,317,298.561434639388
164,490,238.74606804902044
165,293,234.62480860342606
166,390,246.552407529821
167,357,266.6381755610606
168,265,269.4088484065784
169,339,250.34398831147575
170,344,280.7940845472233
171,828,239.30349619383898
172,828,245.62445274114873
173,246,245.61851095490366
174,329,235.41690255411658
175,140,-691.2593394462717
176,238,-76.36633108994043
177,93,-133.8006916719217
178,301,296.2087708796344
179,505,212.89797962182354
180,483,252.8517409508238
181,440,205.47402105922518
182,661,263.2418001604476
183,114,-134.46876076766387
184,232,279.5449155648289
185,452,233.81213285237786
186,301,243.55752044573154
187,283,255.77279508589265
188,309,299.54735638424063
189,202,51.085516849993326
190,297,247.82561305835196
191,245,280.3425601496244
192,282,256.5149926848786
193,407,241.86468926583711
194,108,-229.825465536396
195,119,-410.52690167071523
196,102,-324.6214703322305
197,228,237.14127221978106
198,284,211.6188352982795
199,180,19.542849646126754
200,278,261.28643820044124
201,1000,-17.168084187747162
202,390,216.73973437112198
203,100,-293.70529354905557
204,135,-216.8749788740357
205,462,267.92799933524316
206,370,226.99917766479626
207,425,245.65765619268362
208,561,-558.1792549113775
209,769,218.08554939386164
210,523,241.89898168039346
211,532,211.28978317063644
212,401,252.37256996588889
213,345,238.21945977396715
214,168,-101.14115250684976
215,313,256.31284241929086
216,481,222.38759529252968
217,485,209.13746564865923
218,317,246.25707610273497
219,409,229.40848132549806
220,299,-289.8952696320099
221,172,36.28882980423995
222,297,275.17507107548323
223,512,207.021830959831
224,673,210.5396538821676
225,538,189.6290191557187
226,305,-90.62725461324396
227,663,219.85537927453015
228,262,-380.24029802050853
229,151,-268.99433203004253
230,282,-300.02971795976345
231,363,-899.1502117103719
232,189,-219.06693946441308
233,769,-237.48756274736422
234,856,171.18091986416127
235,588,200.36022800526774
236,89,-120.58919685984635
237,1000,-134.1150566956471
238,583,191.3446471031537
239,234,272.33219961525833
240,360,286.43532182105093
241,272,247.16829095185653
242,417,-145.19081400354804
243,346,285.38774914854764
244,146,58.204867507091706
245,265,227.53233722748928
246,325,246.91220501026675
247,399,255.151300199569
248,179,53.45870576516285
249,323,-120.4519091294402
250,90,-295.0527111115034
251,818,-233.54463689273308
252,518,-113.6099228386956
253,785,200.82322920993528
254,149,34.173486808946706
255,1000,59.127952364541684
256,430,-145.22938511996813
257,456,242.92013033124843
258,811,209.34622396294617
259,209,-86.36536864094937
260,626,226.54016596598115
261,437,244.22866325425534
262,603,264.9862291339604
263,784,231.08205343136007
264,1000,-132.14500056607125
265,296,216.67844478584084
266,1000,42.16245252005574
267,391,246.8786394890788
268,450,231.80961466772482
269,579,247.23232827178785
270,369,31.704968807216147
271,377,251.08500545349003
272,395,230.3276497022394
273,379,250.0163164480345
274,328,256.73664253522804
275,466,248.2907703852892
276,269,241.49351597994183
277,660,208.21115532604483
278,374,235.23090400986214
279,139,-51.539414484794904
280,350,214.18731509141446
281,161,41.922132483949724
282,82,-18.381266231789198
283,113,52.60763539448436
284,101,-21.482939135171577
285,368,257.1914325651237
286,1000,43.38066932067
287,343,245.91186209977263
288,365,263.2022841142077
289,436,209.78634383278504
290,467,237.79670374073686
291,292,233.5452273842135
292,386,247.8384828335398
293,306,244.84377377126253
294,280,264.77095725459264
295,265,262.55105364640485
296,545,227.5721788370235
297,453,262.77408047531065
298,297,278.85940969781615
299,353,-26.735964891815925
300,458,268.96635662733866
