episodes,steps,rewards
0,95,-308.973981315834
1,79,-79.4705732240807
2,144,-44.47073790330637
3,124,-40.10042699296443
4,70,-158.10468371433
5,100,-286.869882009251
6,115,-151.42410692544036
7,62,-125.78420962374013
8,80,-134.79977238441757
9,98,-429.6320613632232
10,65,-69.76092647098197
11,165,-93.10003623402909
12,132,-280.20320284946786
13,117,-327.1421875460209
14,147,-82.91315503007255
15,613,-68.79662842139751
16,1000,-121.63831458089352
17,337,-280.28041524103963
18,527,-159.04050684689076
19,1000,-139.3635193858477
20,1000,-157.94396075230856
21,1000,-131.30795091886625
22,1000,-146.5778542973425
23,1000,-111.94559731618757
24,1000,-146.21751879485865
25,1000,-121.51911613207324
26,105,-188.75202250474024
27,1000,-207.27740133758684
28,1000,-195.02582814707657
29,1000,-180.4741386803288
30,1000,-195.41633697938377
31,1000,-175.56656507608227
32,1000,-160.5383712974257
33,1000,-179.16830214269064
34,1000,-206.1547576590465
35,412,-238.4731838609699
36,1000,-194.97508671556685
37,938,125.99849182814242
38,225,-174.80060513915282
39,137,-174.67174025698128
40,204,-227.06797185226327
41,250,-188.03188134240486
42,798,-34.885931607127844
43,394,-62.069963378783385
44,429,-123.40540405954724
45,583,-354.83792295249464
46,177,-189.62711230627167
47,334,-333.8946741498101
48,129,-575.1194901935482
49,304,-464.112861729898
50,563,-202.7640167407239
51,99,-205.46602759723925
52,126,-126.8435653952539
53,376,-111.59136916573969
54,1000,-181.98113529423037
55,1000,-201.30963855837854
56,237,-225.66354940445828
57,393,-220.71045249230764
58,946,-291.8459652013067
59,1000,-319.9810936738233
60,521,-284.01317368540083
61,134,-97.21991730482364
62,359,-337.32206581106834
63,1000,-35.714519030738884
64,887,178.83766052151663
65,559,-64.31644226347558
66,1000,-55.99744312274804
67,335,-145.60013964773663
68,1000,-194.59491212494896
69,709,-319.9274118977647
70,1000,-105.33331335159365
71,250,-259.91250151522433
72,469,-382.97142925918246
73,1000,-129.43156606641153
74,513,-332.5045122925367
75,1000,-91.79763195590452
76,1000,-93.31614888769053
77,1000,-36.56300817545516
78,1000,-84.26076145117564
79,1000,-49.14277341339129
80,1000,-143.71491818443843
81,156,-99.81323032495602
82,1000,-49.22114106574594
83,1000,-59.399139795624606
84,1000,-112.32995367582934
85,1000,-117.28687170678896
86,1000,-73.8535823194867
87,1000,-66.61789214672615
88,118,-147.91088808347027
89,203,-93.84964473440766
90,1000,-184.3732526224394
91,1000,-116.41094424073496
92,1000,-80.88543462055948
93,1000,-91.27549565599982
94,1000,-59.311707423742284
95,1000,-80.5322412149215
96,1000,-85.74023076545512
97,1000,-45.62574670360515
98,255,-72.68290574655252
99,94,-266.4318668423151
100,1000,-63.88154032139845
101,1000,14.793595924341366
102,586,-134.86713499630605
103,507,-264.29326735176704
104,165,-386.4886122975698
105,1000,-492.61893941063926
106,240,-216.67302577009787
107,108,0.5752214038631678
108,995,-205.02091401026394
109,100,-148.7321373195523
110,777,-760.3297767766222
111,101,-36.53062954592063
112,172,-257.13198325827443
113,1000,-17.239000309466082
114,1000,-17.27218461287153
115,1000,-36.168658900331536
116,1000,46.13136820287764
117,1000,-94.96336844415349
118,1000,-128.7311491811086
119,425,-271.5318395226768
120,173,-310.42038598689135
121,100,-368.48668645907503
122,120,-244.50668732064733
123,604,169.56076843176598
124,124,-160.16897829417715
125,162,-205.37682152133812
126,245,-229.53008290760334
127,128,-140.22994690589155
128,525,-272.4636746851846
129,391,-13.703633253331006
130,413,-233.9851237872108
131,335,-207.99214631516702
132,1000,-53.85973234792545
133,257,-44.810443315401486
134,612,-190.72798499696012
135,546,242.67409906730626
136,359,-49.92017577424146
137,349,232.40242359985973
138,702,179.2436558571941
139,572,147.41369015198816
140,99,-162.81861141182446
141,172,-81.14371337393374
142,421,-306.42882155583607
143,688,225.27140162587105
144,369,212.7830431704774
145,107,-137.98761316806815
146,291,-22.916389803327732
147,311,-0.9109279900683873
148,262,-197.79619727331755
149,805,183.93817183006644
150,287,-229.76648909862405
151,114,-1.116857011753467
152,433,-61.74533353135199
153,464,209.07901402904955
154,455,-68.41547337442583
155,519,203.07810038714868
156,172,20.82567486673767
157,158,-112.9917428791959
158,127,-197.46451835176717
159,331,-150.3986433463702
160,129,-66.32987558130195
161,370,-374.21012231089907
162,426,239.41488487450252
163,478,-281.17368077557546
164,1000,-40.95359001958196
165,1000,-76.78152194473202
166,1000,-147.19463494869083
167,377,-129.86160819240047
168,207,-381.653418971953
169,79,-98.52170504545498
170,94,-271.5481273632147
171,100,-119.5356865669086
172,120,-220.45330297804063
173,154,-695.5628086799704
174,97,-349.9529890951786
175,75,-433.6002058673797
176,137,-1070.0278536488026
177,159,-380.21919918994246
178,171,-308.90591544727835
179,296,-200.2168596190204
180,188,-586.9298248560613
181,633,-867.3703862420866
182,656,-639.5724292865111
183,275,-45.919029538803116
184,1000,-72.16714770383072
185,541,-277.54262044248753
186,920,111.63349050099276
187,1000,-21.23471652941255
188,282,-264.2205514928389
189,241,-180.16164837897617
190,552,-108.07466992070229
191,562,-93.85803852548997
192,658,-95.31052534301594
193,228,-246.25781628688037
194,1000,-23.253934753878397
195,1000,-17.213993747518707
196,1000,-147.8195415058646
197,97,-461.4244477726397
198,1000,-93.83058854448959
199,402,-279.46469690189747
200,253,-295.3482022201812
201,211,-334.2687902613594
202,1000,-129.66707838859568
203,937,-325.95572193766054
204,300,-113.72570489241988
205,379,-106.86967181778715
206,1000,-122.47614153819093
207,376,-159.46865778239626
208,1000,-148.33007931571188
209,494,-197.1744396496581
210,1000,-80.67767549167564
211,1000,-129.84056328968845
212,129,-280.75366018367123
213,1000,-104.6351537084999
214,1000,-124.98707869225561
215,1000,-218.8252114857373
216,1000,-180.7449228781901
217,1000,-150.7623015048295
218,1000,-145.81912428275453
219,176,-360.23228117139763
220,513,-242.19075366253813
221,310,-260.90464940339103
222,128,-177.21412954861114
223,137,-160.0063413198357
224,1000,-172.65283315156867
225,1000,-171.11021590300896
226,1000,-169.83550858890337
227,516,-145.53724971175689
228,442,-125.67424413867579
229,745,-211.99387827372004
230,511,-216.4723139469965
231,1000,-144.0945770672339
232,789,-395.4557654466257
233,317,-359.92538658421245
234,1000,-197.8103715990582
235,759,-337.26519868882883
236,628,134.32589631616952
237,158,-299.78306878336434
238,1000,-62.66021445475933
239,1000,-34.66364603476905
240,1000,-23.034137914563555
241,992,-438.8935883241774
242,155,-343.6345457367496
243,214,-176.22705991308587
244,279,-474.79377400321624
245,89,-435.179291019916
246,130,-312.5669528749421
247,270,-115.23588791305109
248,377,-206.9026625564252
249,570,-171.83772678007767
250,189,-276.55768550660366
251,962,-447.72987806515744
252,1000,-105.35534919934881
253,1000,-144.64935187132826
254,247,-291.84147799938864
255,1000,-84.96180846731413
256,182,-160.42972919400978
257,248,-184.46536359431212
258,368,-147.79755887004686
259,344,-122.1960264253008
260,160,-172.9453932123982
261,461,-325.7787849598342
262,324,-286.7100261069681
263,451,-201.52038306951698
264,1000,-422.97274464005426
265,1000,-282.68032944816053
266,1000,-328.12936517504676
267,351,-325.7732395985233
268,187,-243.99670941792135
269,124,-131.96753893930187
270,852,-565.4714023752227
271,203,-220.55941804309936
272,1000,-260.6662222324288
273,1000,-191.99549040706347
274,1000,-170.35005802456385
275,664,-413.6964527094642
276,1000,-192.49580214702706
277,1000,-317.70209083882844
278,591,-262.02500306257537
279,1000,-374.2522680782164
280,1000,-176.17410265492228
281,300,-337.0380439105942
282,1000,-198.6955916183874
283,481,-332.3341115784102
284,233,-193.49521361865214
285,124,-175.33733083910943
286,1000,-194.86656929276575
287,710,-273.302093343367
288,219,-74.60787612855594
289,774,-372.96573551771894
290,417,-72.3270027514835
291,131,-134.86942693161242
292,511,-170.73450706384972
293,1000,-211.78772404706058
294,1000,-131.00020785573454
295,677,-296.250340797264
296,245,-160.31767317021368
297,1000,-99.56420488285727
298,293,-64.05555988836642
299,200,-102.06026557222057
300,248,-245.102601637889
301,1000,-102.07800975242122
302,1000,-83.10949211054209
303,1000,-111.34562227918948
304,134,-144.86135367391378
305,1000,-99.87459422072027
306,122,-168.60209737983035
307,416,-59.89334752108057
308,1000,-98.14654001128744
309,824,-342.8837469570585
310,776,-372.6933317095399
311,276,-316.1726614906214
312,176,-454.5953858944418
313,123,-356.8214587796253
314,103,-257.3128919894233
315,261,-250.15618854458222
316,139,-184.01187170757078
317,58,-526.7116512361105
318,78,-676.7455649583686
319,97,-570.7584820924426
320,66,-586.0070307307493
321,90,-527.0114852115087
322,96,-627.4591665306576
323,110,-377.7868509327064
324,100,-7.096954588147227
325,934,-275.5227005645647
326,149,-196.05605891061427
327,158,-41.8935504154325
328,147,-272.8844744287218
329,176,-338.99073890472005
330,258,-326.54411116087965
331,116,-155.0676061981555
332,234,-346.0889460970824
333,1000,-180.31703892809844
334,102,-272.13889151311344
335,255,-332.6417798460259
336,721,-145.89409704641483
337,333,-73.67842925496117
338,384,-144.27910558919405
339,371,-56.38482738242483
340,339,-74.29355077441419
341,327,-67.60475671201722
342,333,-90.00427557712906
343,1000,-67.81467312544237
344,1000,-109.0628035480186
345,360,-297.1825587030519
346,268,-483.08420383940285
347,241,-536.6173179589907
348,119,-444.3293222480653
349,133,-429.58202540502475
350,164,-241.54291336689693
351,117,-282.6129685265917
352,145,-746.2496079027437
353,61,-586.437726135206
354,97,-478.0322615508178
355,191,-495.07403724005854
356,189,-270.5025362787479
357,1000,-175.85638458380933
358,750,-325.92913685642725
359,889,-146.2563064659361
360,1000,-34.45313777540574
361,128,-264.36104599643465
362,530,-103.78235843050086
363,1000,-112.55517564393666
364,715,-52.15408725223666
365,176,-55.748049518289534
366,631,-146.10284001000508
367,269,-268.07418943290884
368,413,-243.91312155108827
369,349,-281.54571162780553
370,272,-243.11074305902778
371,1000,-23.94546627086309
372,295,-191.90376079553744
373,278,-235.74911788564924
374,299,-225.8986388226543
375,383,-267.599624790629
376,436,-206.68126909855238
377,923,127.37926345547157
378,142,-13.523193020612368
379,1000,-25.631566645731585
380,1000,-64.82452485206333
381,263,-536.4658523619934
382,283,-368.6576352003916
383,272,-164.76470315436558
384,154,-140.58759943764503
385,1000,-166.96364096392787
386,391,-462.0658266541389
387,1000,-365.88557869025936
388,1000,-516.1289375562548
389,1000,-415.0947294571284
390,1000,-148.87168963293198
391,1000,-179.91925292272103
392,945,-496.58882674191625
393,1000,-186.22805065618888
394,1000,-153.13502915492737
395,513,-424.58723577565786
396,1000,-147.42321811901743
397,1000,-190.76117488802038
398,1000,-163.63439537409536
399,1000,-184.47886468586523
400,1000,-164.7613796889673
401,1000,-174.50944135270174
402,1000,-147.34307018212974
403,314,-631.0685491285464
404,1000,-94.39731250658467
405,1000,-163.90318085026257
406,1000,-164.5786967750925
407,1000,-259.2343833240996
408,89,-367.7483835021305
409,521,-230.38456096609116
410,1000,-79.14265260032249
411,144,-247.72140921434274
412,1000,-167.708192105107
413,1000,-3.2354813056933915
414,133,-140.76030084419807
415,1000,-93.84001297117528
416,590,-217.35799207125746
417,553,-222.31165412832527
418,748,-166.05089252401797
419,413,-163.46384828845083
420,577,-151.2342394441032
421,1000,-127.82560635806628
422,1000,-159.09359538110795
423,369,-471.766058089779
424,1000,-155.84125931867038
425,1000,-152.922750814967
426,1000,-138.40261137585742
427,1000,-177.7258247578416
428,437,-183.8556849995893
429,1000,-204.69352353339326
430,215,-165.57771795919967
431,1000,-148.09204550283556
432,1000,-152.65463617854053
433,289,-304.64168397925687
434,482,-378.1908843388072
435,129,-238.45929063673293
436,157,-262.49232676966426
437,1000,-256.423793988315
438,1000,-236.3288033366682
439,1000,-260.8745420656699
440,1000,-206.2168649778171
441,1000,-220.1894906268307
442,1000,-191.17167049092166
443,1000,-205.91337862739468
444,896,-751.8139482670271
445,1000,-284.28608063623494
446,1000,-261.49014876641695
447,154,-597.4382520585004
448,667,-182.43236676865666
449,1000,-92.15394007436863
450,256,-185.2824077175565
451,387,-701.1838506142185
452,261,-195.8219868728396
453,651,-511.0929929883122
454,1000,-344.2633639597086
455,293,-141.54125323544497
456,1000,-170.71266055616488
457,1000,-133.09291963501207
458,1000,-285.8407213465251
459,1000,-77.43479380928387
460,283,-60.50093292816521
461,450,-135.46293483074075
462,370,-160.86103482785512
463,135,-138.8525275252348
464,875,-491.1770386835842
465,108,-214.1321992275113
466,265,-50.44378334207547
467,241,-59.168681241672196
468,211,-155.88299465805085
469,1000,-196.23200793605128
470,113,-232.8976194794773
471,294,-341.9901033780351
472,231,-251.46652765257303
473,247,-267.1182319983479
474,391,-454.8825571670021
475,243,-309.5609686795251
476,1000,-121.97284215918272
477,263,-344.91730580489923
478,1000,-144.09417060656438
479,776,-287.21244625150365
480,98,-179.0221785033338
481,516,-95.52531396970471
482,126,-195.99648424766065
483,1000,-52.08521829647002
484,433,-65.91444413504036
485,502,-173.72949481255557
486,608,169.52074465974067
487,413,4.33674084139183
488,1000,21.951805717077356
489,556,-64.72574700495811
490,973,130.9225458177072
491,431,-68.06921133353262
492,1000,-29.573679559478876
493,194,47.1045827939179
494,1000,-83.20576471290605
495,195,-17.042465784293114
496,1000,-37.84827380609086
497,1000,-28.429835360971747
498,347,-135.90146024518972
499,507,-341.68034750708665
500,1000,-161.46527900716853
501,456,-370.6715690595703
502,304,-334.4512412674201
503,823,-95.03983405835812
504,143,-41.80787238351221
505,91,-462.43343992411434
506,101,-372.60943070726984
507,280,-339.04202018087153
508,168,-374.9578856364644
509,1000,-146.8834886386243
510,156,-332.18863729794674
511,128,-332.060250575851
512,947,-221.9336401081386
513,411,-249.9950060490823
514,93,-95.28335256355038
515,462,-146.1280076783873
516,358,-118.35740495652107
517,1000,-203.3259239189465
518,1000,-48.15087640819991
519,1000,-187.6309989943755
520,184,-40.817476411594555
521,703,-124.39976372090254
522,1000,-161.74750392092838
523,1000,-156.4676456675517
524,828,-111.8425679723086
525,1000,-98.867846651019
526,1000,-89.2881521562195
527,1000,-45.54530261331072
528,1000,-15.670194058281885
529,691,-240.75081370163292
530,1000,-35.55590936966714
531,1000,-56.278995117524616
532,1000,-28.07871227661874
533,1000,-18.902302687665745
534,1000,-48.80644742404206
535,1000,-50.31985500544343
536,152,-129.0732402070268
537,163,-352.59565830736904
538,117,-243.78315736101578
539,196,-535.350943164967
540,211,-383.3164809428277
541,192,-308.56337139544763
542,280,-253.3343036613736
543,349,-384.4433950688536
544,498,-318.8639686144763
545,1000,-205.2202011660965
546,278,-110.1122233960859
547,121,-105.33178159656134
548,230,-177.37709676439306
549,1000,-165.83253353134975
550,289,-142.72536943088198
551,90,-41.93769894944215
552,76,-41.387003010238885
553,942,-371.35873381809785
554,871,-187.03767579884106
555,1000,-142.65512345219543
556,1000,-131.11657513914548
557,1000,-73.43594675346053
558,1000,-101.51640127678999
559,1000,-74.1241119964504
560,398,-205.78087164875006
561,1000,-148.401591591654
562,793,-225.87799025454473
563,56,-133.21767067718707
564,132,-90.24654016706435
565,307,-9.877559983951741
566,108,-64.5885580228948
567,1000,-148.70932545868013
568,1000,-198.42676833305725
569,1000,-164.20788480065855
570,1000,-138.69495935000913
571,1000,-225.29258426297773
572,1000,-201.98784217430128
573,252,-135.7767795159725
574,410,-283.99792141394903
575,860,-338.0808329971253
576,582,-182.8123920625907
577,806,-211.1669016790444
578,1000,-244.718790010044
579,1000,-159.97060124003553
580,308,-277.26339487504185
581,155,-152.4022198879145
582,378,-233.77638193902985
583,1000,-110.44007146222214
584,1000,-126.09971113223223
585,394,-304.33414383596573
586,88,-269.9757122294674
587,1000,-168.65946646995093
588,1000,-198.4823306489539
589,183,-265.95760424457967
590,923,-366.48718491987546
591,622,-351.8279798948299
592,1000,-222.64296048344184
593,1000,-211.83056074171748
594,1000,-212.36801277115862
595,1000,-170.0791488094057
596,1000,-166.35115996837231
597,1000,-189.52601734205905
598,1000,-133.18871741128297
599,996,-470.8846499544174
600,1000,-67.64077037428137
601,452,-342.820093781938
602,1000,-52.63418028508879
603,1000,-64.04734854785099
604,1000,-58.55819758952684
605,107,-187.62650430300442
606,497,-24.011883532542583
607,1000,-45.666576220553665
608,822,-324.72663226606323
609,139,-55.1097967805854
610,1000,-51.13069733700643
611,123,-145.36062424916736
612,140,-326.1091379328603
613,1000,-22.893038428779025
614,143,-240.42805490121776
615,637,-332.246491192388
616,108,-30.253489165245213
617,86,-64.11195268031004
618,1000,-201.7341449725431
619,287,-444.7564939412726
620,380,-200.42382790478825
621,548,-259.29873196928327
622,225,-495.2962744150412
623,471,-352.529022187613
624,227,-81.00022300431817
625,476,-121.60476321946288
626,516,-284.23531233342356
627,1000,-217.40201732487034
628,427,-239.57342477570495
629,494,-134.50646787574058
630,1000,-127.45793119161458
631,1000,-54.45525376603375
632,942,-489.3595510282158
633,1000,-112.84883849482468
634,1000,-119.1086965981049
635,1000,-128.78548788161964
636,1000,-95.28026251923876
637,1000,-145.25907132357543
638,1000,-140.79678197309636
639,1000,-254.92623025144613
640,1000,-95.23658693713513
641,127,-156.2938880691375
642,118,-329.98005869925817
643,265,-282.1523089384006
644,337,-129.74126679894601
645,1000,-282.93953485749466
646,1000,-192.23115571044946
647,358,-304.70664947836605
648,1000,-204.7382141313844
649,1000,-241.13505951551485
650,1000,-67.84886822874532
651,779,-370.77854797467256
652,1000,-171.32051138191656
653,923,-340.9530866377222
654,1000,-201.4220475416093
655,171,-130.0735633800576
656,1000,-187.56611536946085
657,1000,-179.42725543108384
658,287,-190.24147523288514
659,1000,-189.7861326131885
660,1000,-124.62920897059642
661,114,-331.8602540942976
662,1000,-158.75936432636814
663,1000,-170.48026016818358
664,1000,-125.4608079531505
665,1000,-213.83943148759883
666,1000,-117.58543120951705
667,138,-779.9145832271138
668,1000,-119.82154447632749
669,220,-129.98076233448523
670,84,-306.5563591980385
671,209,-262.2527409042629
672,1000,-196.92616148508327
673,219,-185.2629992579701
674,247,-181.5244166417731
675,272,-210.0923423018213
676,270,-453.481415120968
677,707,-205.47081100418342
678,928,146.51630223569424
679,1000,-77.17008032110067
680,1000,-12.540422411842512
681,1000,-18.039862673699417
682,100,-72.61492589302246
683,572,-20.029874082206533
684,569,154.46626915156037
685,1000,23.700420194783682
686,1000,-6.5425465061565875
687,310,-97.29113606665537
688,172,-212.13398636238247
689,676,-244.9302201850269
690,567,-647.9884944179355
691,287,-73.48112552940144
692,232,-189.21697990001744
693,73,-335.0524023418456
694,84,-390.8974264855181
695,103,-176.1110252600848
696,121,-253.74257946448753
697,372,-975.180386732239
698,274,-271.2237767198743
699,356,-94.50691324573202
700,111,-262.3884527872324
701,520,-389.8928702501863
702,1000,-148.85206425302917
703,1000,-120.22531582871795
704,770,-307.7980180382442
705,1000,-273.1930126134931
706,1000,-116.03282488542983
707,1000,-149.14796833576673
708,1000,-151.23658337081818
709,160,-341.89660697185474
710,1000,-122.20556998215649
711,137,-214.69211546835368
712,1000,-100.54138951414055
713,1000,-98.94053011230939
714,1000,-65.49229526385811
715,238,-289.979878079822
716,1000,-121.60679863870067
717,1000,-155.49890345821834
718,1000,-123.91420879298934
719,1000,-123.87588022331398
720,1000,-141.44912466828671
721,1000,-102.96069706913138
722,1000,-83.32537231784372
723,1000,-342.77343872806364
724,1000,-349.7173789030001
725,722,-383.98006848461443
726,131,-323.7524401619461
727,304,-372.9241345181176
728,232,-210.84801659502142
729,1000,-214.09642335821752
730,1000,-226.35702956181356
731,323,-278.286112283948
732,113,-179.2716123636194
733,379,-253.01910368193887
734,826,-501.78302107675233
735,327,-150.57440162780856
736,199,-230.24198832423608
737,176,-315.8787758418149
738,215,-395.33821631139057
739,356,-325.6353983190885
740,391,-29.731263797095124
741,357,-254.63045734806647
742,482,-174.08341947188916
743,1000,-162.29214595350078
744,913,-232.53390951318394
745,299,-121.16864552766748
746,1000,-133.99103933637423
747,1000,-62.67969041571176
748,1000,-46.34168131478829
749,661,-30.16853581303141
750,1000,-118.86040770832021
751,260,-291.5855593430686
752,989,-418.61465618807836
753,339,-347.0193753167557
754,1000,-263.05783517672745
755,402,-301.5710632638067
756,773,-130.26947149542957
757,861,92.00294424761722
758,1000,-111.64521036075043
759,1000,-61.14423277566824
760,1000,-140.82034565933895
761,1000,-87.77548472620356
762,1000,-126.48001807555072
763,130,-240.64932973190167
764,357,-190.40094343108441
765,1000,-159.6730429153124
766,974,-439.44490631935355
767,355,-222.50137987535652
768,664,-89.7734320491333
769,189,-138.48753377568426
770,68,-159.88017541681245
771,334,-222.39084608451702
772,973,-228.4385229555975
773,209,-356.34707827260337
774,69,21.114026200937218
775,186,-224.19050221749856
776,838,-164.5406885512081
777,612,-195.55303805749514
778,985,-194.26499100950235
779,667,-192.53364668463416
780,466,-197.9491434450164
781,1000,-40.21430709940153
782,510,-134.3189520635001
783,1000,-87.48649804112915
784,379,-178.23035627460513
785,282,-118.1239447569664
786,222,-199.1293093354547
787,1000,-82.40187461947204
788,1000,-108.8413672635922
789,1000,-95.82415307014276
790,1000,-69.90143310577925
791,785,-201.9726736770265
792,1000,-110.39563860729908
793,828,-213.33197722017115
794,1000,-86.9646800916409
795,1000,-128.89345443758504
796,1000,-87.51459577977037
797,1000,-154.29219069907495
798,1000,-77.2621253864314
799,221,-159.92164820275613
800,1000,-162.39502436191657
801,910,-276.5229426901493
802,384,-283.9766638109088
803,813,-414.34911881273456
804,1000,-53.65184749488756
805,1000,-98.52215203162719
806,1000,-133.25572361984513
807,1000,-92.64826310488472
808,1000,-131.0346845047339
809,1000,-156.34653121808816
810,274,-285.8998257334082
811,283,-153.52046642531383
812,1000,-126.12492337048211
813,1000,-118.23350628580138
814,1000,-184.0602295231426
815,737,-258.6914429437859
816,413,-171.30975596487926
817,434,-217.6939228059794
818,162,-158.80849271788875
819,182,-158.74692998740952
820,498,-149.1071480019168
821,433,-172.60178704095316
822,243,-175.34504248263266
823,889,-338.350163724279
824,1000,-219.00366439276604
825,981,-410.5109083126794
826,338,-220.73224277212083
827,221,-100.61325784944403
828,1000,-107.94481640111371
829,1000,-54.467491536822564
830,1000,-66.20321936423827
831,1000,-178.95586778258726
832,237,-212.01505999943817
833,1000,-194.203626328254
834,1000,-135.8228508730696
835,104,-296.032604787751
836,163,-385.5759118494284
837,213,-442.59839535148416
838,151,-309.09495371838375
839,272,-286.7271548674473
840,169,-208.00065124280917
841,491,-281.7826823239816
842,530,-241.87763558979432
843,116,-325.62003191220606
844,336,-448.72046605604146
845,741,-321.56073340926093
846,1000,-183.2433346495507
847,1000,-162.2485631343418
848,1000,-135.6810725705737
849,1000,-119.66043024031244
850,1000,-203.36972192362123
851,156,-293.9268542898809
852,120,-99.64068810619293
853,191,-121.14038680788961
854,70,-554.3298498579661
855,78,-449.3238881899758
856,138,-485.1878776291283
857,124,-414.16837362941277
858,485,-639.1773481040437
859,1000,-440.1043818494561
860,1000,-316.0441793195719
861,1000,-304.4801093413717
862,250,-423.15923682804123
863,73,-366.2040688677139
864,132,-358.91261039605126
865,1000,-256.2646641411049
866,324,-306.74375218490417
867,1000,-229.55086692721545
868,941,-272.5809291899399
869,57,-116.26849734033841
870,74,-134.35391959309774
871,55,-113.02201840869049
872,284,-196.7106631644294
873,170,-255.5111441837324
874,1000,-226.74377654587798
875,883,-260.01057138383567
876,56,-230.43033607143832
877,90,-20.794359902409212
878,81,-107.26215772797835
879,205,-94.93274603472163
880,1000,-123.29634828143169
881,1000,-66.89533391460755
882,181,-6.949019069195941
883,1000,-75.05290193565429
884,1000,-88.54874747108458
885,182,-289.77969635879055
886,844,-323.42089544017574
887,204,-62.56658262922387
888,1000,-169.07115925246785
889,1000,-133.53338302005508
890,1000,-184.64905451644094
891,1000,-166.52083330612882
892,1000,-43.35346973153605
893,397,-300.51187243770266
894,1000,-89.75357744959729
895,155,-139.19883118951734
896,1000,-138.3014464265693
897,1000,-201.9018455184506
898,156,-206.06454085271912
899,356,-342.6362771672111
900,491,-124.15646292843259
901,144,-122.96214965777203
902,1000,-261.09537052985104
903,528,-76.35052801137758
904,250,-78.64276004995929
905,743,-299.4769541361706
906,540,-345.02536457825374
907,234,-251.5651467678076
908,153,-263.5622909555783
909,275,-193.69462031927873
910,969,-200.8696527448177
911,858,-404.7827420848941
912,278,-281.9774510176468
913,322,-499.80508880651666
914,364,-308.11259125299523
915,861,-490.6543791224152
916,1000,-105.37475292514321
917,1000,-185.35456885444293
918,1000,-86.05919834487668
919,1000,-70.67907890104112
920,151,-257.07015611696573
921,103,-152.7934195898722
922,1000,-17.9068475804581
923,505,-355.7100147233157
924,111,-278.6803133979382
925,1000,-97.90987493575973
926,69,-299.8454413330752
927,162,-255.88602273579232
928,1000,-115.16053761472286
929,1000,-176.74827880584718
930,176,-215.96936863360224
931,406,-625.4733733932123
932,500,-149.62141462413715
933,446,-307.3900977328942
934,588,-232.9601407882498
935,575,-184.9400479236357
936,722,-197.53412144215065
937,1000,-78.15127055266318
938,209,-236.96619159689484
939,223,-106.12367201277281
940,1000,-110.04964188093722
941,1000,-71.237350459011
942,1000,-100.60069901753678
943,1000,-92.84204560842879
944,1000,-73.10601942133516
945,1000,-40.504927618563656
946,1000,-125.58109415821296
947,199,-464.7607255334113
948,655,-293.97099012089166
949,1000,-105.0827772148978
950,236,-208.78970765950697
951,183,-539.8279403031348
952,193,-647.3942989578275
953,389,-122.05699662442703
954,397,-197.07942889029388
955,223,-114.35511857806284
956,331,-283.3761551171814
957,401,-364.4294730253005
958,300,-273.69407169885096
959,265,-308.92992845395014
960,460,-207.93687068016084
961,318,-167.91831573265807
962,337,-197.7175731431912
963,442,-242.83746845639385
964,914,-267.37364718337193
965,595,-1289.98799584025
966,1000,-215.91067175517983
967,1000,-123.75215657365872
968,1000,-77.72246178843469
969,912,-469.97671969696495
970,1000,-160.7626208174125
971,1000,-91.15733126699756
972,302,-169.7214755259179
973,1000,-147.67167620774552
974,1000,-139.88068608579832
975,1000,-65.03808024562036
976,1000,-90.96926698271929
977,1000,-55.55029044317297
978,1000,-82.34781676157246
979,1000,-101.35826033301385
980,1000,-60.22126531887282
981,1000,-31.379691556251576
982,213,-101.07741368729455
983,1000,-35.734970817819516
984,1000,-98.73536492749213
985,1000,-77.27230024761789
986,1000,-150.39822198915303
987,985,-262.71139860359665
988,1000,-46.99665726390068
989,1000,-31.445132354318325
990,1000,-143.9518747944671
991,752,-275.14502024001627
992,223,-261.7410806268316
993,117,-438.7299982817921
994,1000,-189.91998558770942
995,1000,-179.32848061534057
996,699,-229.4947958891592
997,170,-192.38136835108094
998,1000,-211.6022183832808
999,1000,-222.96448428059514
