episodes,steps,rewards
0,200,-200.0
1,200,-200.0
2,200,-200.0
3,200,-200.0
4,200,-200.0
5,200,-200.0
6,200,-200.0
7,200,-200.0
8,200,-200.0
9,200,-200.0
10,200,-200.0
11,200,-200.0
12,200,-200.0
13,200,-200.0
14,200,-200.0
15,200,-200.0
16,200,-200.0
17,200,-200.0
18,200,-200.0
19,200,-200.0
20,200,-200.0
21,200,-200.0
22,200,-200.0
23,200,-200.0
24,200,-200.0
25,200,-200.0
26,200,-200.0
27,200,-200.0
28,200,-200.0
29,200,-200.0
30,200,-200.0
31,200,-200.0
32,200,-200.0
33,200,-200.0
34,200,-200.0
35,200,-200.0
36,200,-200.0
37,200,-200.0
38,200,-200.0
39,200,-200.0
40,200,-200.0
41,200,-200.0
42,200,-200.0
43,200,-200.0
44,200,-200.0
45,200,-200.0
46,200,-200.0
47,200,-200.0
48,200,-200.0
49,200,-200.0
50,200,-200.0
51,190,-190.0
52,200,-200.0
53,200,-200.0
54,200,-200.0
55,200,-200.0
56,200,-200.0
57,200,-200.0
58,200,-200.0
59,200,-200.0
60,200,-200.0
61,200,-200.0
62,200,-200.0
63,200,-200.0
64,200,-200.0
65,143,-143.0
66,200,-200.0
67,200,-200.0
68,200,-200.0
69,200,-200.0
70,200,-200.0
71,200,-200.0
72,200,-200.0
73,200,-200.0
74,200,-200.0
75,200,-200.0
76,200,-200.0
77,194,-194.0
78,200,-200.0
79,200,-200.0
80,200,-200.0
81,200,-200.0
82,200,-200.0
83,200,-200.0
84,200,-200.0
85,115,-115.0
86,200,-200.0
87,184,-184.0
88,200,-200.0
89,200,-200.0
90,200,-200.0
91,196,-196.0
92,200,-200.0
93,200,-200.0
94,200,-200.0
95,200,-200.0
96,176,-176.0
97,200,-200.0
98,200,-200.0
99,200,-200.0
100,200,-200.0
101,200,-200.0
102,200,-200.0
103,200,-200.0
104,200,-200.0
105,200,-200.0
106,124,-124.0
107,200,-200.0
108,200,-200.0
109,200,-200.0
110,177,-177.0
111,189,-189.0
112,200,-200.0
113,200,-200.0
114,200,-200.0
115,200,-200.0
116,200,-200.0
117,200,-200.0
118,200,-200.0
119,200,-200.0
120,200,-200.0
121,200,-200.0
122,200,-200.0
123,200,-200.0
124,200,-200.0
125,200,-200.0
126,200,-200.0
127,200,-200.0
128,200,-200.0
129,200,-200.0
130,200,-200.0
131,183,-183.0
132,200,-200.0
133,184,-184.0
134,200,-200.0
135,189,-189.0
136,135,-135.0
137,159,-159.0
138,200,-200.0
139,200,-200.0
140,200,-200.0
141,200,-200.0
142,200,-200.0
143,137,-137.0
144,200,-200.0
145,200,-200.0
146,200,-200.0
147,200,-200.0
148,200,-200.0
149,194,-194.0
150,200,-200.0
151,133,-133.0
152,135,-135.0
153,147,-147.0
154,200,-200.0
155,200,-200.0
156,200,-200.0
157,111,-111.0
158,89,-89.0
159,200,-200.0
160,132,-132.0
161,112,-112.0
162,158,-158.0
163,119,-119.0
164,155,-155.0
165,200,-200.0
166,152,-152.0
167,180,-180.0
168,88,-88.0
169,175,-175.0
170,199,-199.0
171,137,-137.0
172,160,-160.0
173,200,-200.0
174,129,-129.0
175,122,-122.0
176,200,-200.0
177,184,-184.0
178,145,-145.0
179,113,-113.0
180,107,-107.0
181,191,-191.0
182,186,-186.0
183,149,-149.0
184,146,-146.0
185,187,-187.0
186,200,-200.0
187,200,-200.0
188,93,-93.0
189,150,-150.0
190,200,-200.0
191,200,-200.0
192,200,-200.0
193,161,-161.0
194,90,-90.0
195,200,-200.0
196,200,-200.0
197,200,-200.0
198,200,-200.0
199,170,-170.0
200,90,-90.0
201,170,-170.0
202,180,-180.0
203,200,-200.0
204,173,-173.0
205,200,-200.0
206,200,-200.0
207,148,-148.0
208,111,-111.0
209,164,-164.0
210,200,-200.0
211,184,-184.0
212,200,-200.0
213,198,-198.0
214,200,-200.0
215,178,-178.0
216,200,-200.0
217,200,-200.0
218,119,-119.0
219,200,-200.0
220,200,-200.0
221,200,-200.0
222,193,-193.0
223,200,-200.0
224,200,-200.0
225,175,-175.0
226,182,-182.0
227,200,-200.0
228,180,-180.0
229,97,-97.0
230,127,-127.0
231,149,-149.0
232,174,-174.0
233,200,-200.0
234,200,-200.0
235,200,-200.0
236,200,-200.0
237,195,-195.0
238,200,-200.0
239,200,-200.0
240,200,-200.0
241,95,-95.0
242,99,-99.0
243,200,-200.0
244,200,-200.0
245,88,-88.0
246,151,-151.0
247,95,-95.0
248,200,-200.0
249,200,-200.0
250,108,-108.0
251,175,-175.0
252,191,-191.0
253,200,-200.0
254,192,-192.0
255,200,-200.0
256,200,-200.0
257,200,-200.0
258,136,-136.0
259,159,-159.0
260,200,-200.0
261,92,-92.0
262,200,-200.0
263,186,-186.0
264,200,-200.0
265,200,-200.0
266,162,-162.0
267,200,-200.0
268,183,-183.0
269,174,-174.0
270,86,-86.0
271,136,-136.0
272,200,-200.0
273,103,-103.0
274,165,-165.0
275,158,-158.0
276,182,-182.0
277,97,-97.0
278,129,-129.0
279,164,-164.0
280,89,-89.0
281,200,-200.0
282,154,-154.0
283,200,-200.0
284,88,-88.0
285,151,-151.0
286,156,-156.0
287,158,-158.0
288,200,-200.0
289,175,-175.0
290,178,-178.0
291,123,-123.0
292,196,-196.0
293,112,-112.0
294,92,-92.0
295,200,-200.0
296,86,-86.0
297,129,-129.0
298,200,-200.0
299,84,-84.0
300,200,-200.0
301,172,-172.0
302,175,-175.0
303,116,-116.0
304,200,-200.0
305,87,-87.0
306,136,-136.0
307,191,-191.0
308,200,-200.0
309,151,-151.0
310,169,-169.0
311,200,-200.0
312,200,-200.0
313,169,-169.0
314,138,-138.0
315,195,-195.0
316,200,-200.0
317,85,-85.0
318,200,-200.0
319,142,-142.0
320,183,-183.0
321,200,-200.0
322,200,-200.0
323,108,-108.0
324,114,-114.0
325,200,-200.0
326,200,-200.0
327,175,-175.0
328,184,-184.0
329,200,-200.0
330,156,-156.0
331,169,-169.0
332,200,-200.0
333,163,-163.0
334,128,-128.0
335,200,-200.0
336,101,-101.0
337,200,-200.0
338,200,-200.0
339,94,-94.0
340,89,-89.0
341,98,-98.0
342,92,-92.0
343,176,-176.0
344,99,-99.0
345,200,-200.0
346,94,-94.0
347,119,-119.0
348,200,-200.0
349,200,-200.0
350,164,-164.0
351,190,-190.0
352,188,-188.0
353,158,-158.0
354,155,-155.0
355,181,-181.0
356,200,-200.0
357,157,-157.0
358,182,-182.0
359,200,-200.0
360,109,-109.0
361,200,-200.0
362,171,-171.0
363,200,-200.0
364,181,-181.0
365,166,-166.0
366,174,-174.0
367,92,-92.0
368,200,-200.0
369,83,-83.0
370,200,-200.0
371,200,-200.0
372,170,-170.0
373,200,-200.0
374,174,-174.0
375,164,-164.0
376,157,-157.0
377,92,-92.0
378,104,-104.0
379,171,-171.0
380,200,-200.0
381,152,-152.0
382,91,-91.0
383,158,-158.0
384,92,-92.0
385,165,-165.0
386,152,-152.0
387,91,-91.0
388,85,-85.0
389,155,-155.0
390,200,-200.0
391,136,-136.0
392,192,-192.0
393,200,-200.0
394,200,-200.0
395,91,-91.0
396,168,-168.0
397,172,-172.0
398,200,-200.0
399,157,-157.0
400,97,-97.0
401,158,-158.0
402,146,-146.0
403,200,-200.0
404,188,-188.0
405,87,-87.0
406,153,-153.0
407,149,-149.0
408,101,-101.0
409,176,-176.0
410,156,-156.0
411,167,-167.0
412,94,-94.0
413,130,-130.0
414,200,-200.0
415,168,-168.0
416,180,-180.0
417,101,-101.0
418,94,-94.0
419,112,-112.0
420,94,-94.0
421,133,-133.0
422,83,-83.0
423,86,-86.0
424,92,-92.0
425,165,-165.0
426,90,-90.0
427,159,-159.0
428,158,-158.0
429,167,-167.0
430,176,-176.0
431,85,-85.0
432,91,-91.0
433,181,-181.0
434,171,-171.0
435,180,-180.0
436,187,-187.0
437,200,-200.0
438,88,-88.0
439,188,-188.0
440,98,-98.0
441,167,-167.0
442,200,-200.0
443,169,-169.0
444,176,-176.0
445,200,-200.0
446,162,-162.0
447,186,-186.0
448,160,-160.0
449,83,-83.0
450,160,-160.0
451,172,-172.0
452,148,-148.0
453,200,-200.0
454,160,-160.0
455,84,-84.0
456,154,-154.0
457,164,-164.0
458,157,-157.0
459,200,-200.0
460,200,-200.0
461,119,-119.0
462,200,-200.0
463,156,-156.0
464,156,-156.0
465,90,-90.0
466,160,-160.0
467,200,-200.0
468,177,-177.0
469,150,-150.0
470,151,-151.0
471,151,-151.0
472,159,-159.0
473,156,-156.0
474,200,-200.0
475,200,-200.0
476,155,-155.0
477,165,-165.0
478,90,-90.0
479,148,-148.0
480,200,-200.0
481,200,-200.0
482,159,-159.0
483,152,-152.0
484,157,-157.0
485,200,-200.0
486,165,-165.0
487,149,-149.0
488,171,-171.0
489,200,-200.0
490,168,-168.0
491,158,-158.0
492,87,-87.0
493,200,-200.0
494,193,-193.0
495,156,-156.0
496,148,-148.0
497,181,-181.0
498,200,-200.0
499,186,-186.0
500,199,-199.0
501,89,-89.0
502,161,-161.0
503,164,-164.0
504,170,-170.0
505,200,-200.0
506,156,-156.0
507,175,-175.0
508,200,-200.0
509,101,-101.0
510,100,-100.0
511,155,-155.0
512,162,-162.0
513,87,-87.0
514,165,-165.0
515,138,-138.0
516,146,-146.0
517,105,-105.0
518,200,-200.0
519,162,-162.0
520,159,-159.0
521,94,-94.0
522,200,-200.0
523,100,-100.0
524,186,-186.0
525,188,-188.0
526,200,-200.0
527,200,-200.0
528,200,-200.0
529,88,-88.0
530,200,-200.0
531,173,-173.0
532,94,-94.0
533,200,-200.0
534,160,-160.0
535,85,-85.0
536,183,-183.0
537,85,-85.0
538,165,-165.0
539,90,-90.0
540,171,-171.0
541,134,-134.0
542,164,-164.0
543,168,-168.0
544,200,-200.0
545,180,-180.0
546,200,-200.0
547,200,-200.0
548,162,-162.0
549,162,-162.0
550,184,-184.0
