episodes,steps,rewards
0,200,-200.0
1,200,-200.0
2,200,-200.0
3,200,-200.0
4,200,-200.0
5,200,-200.0
6,200,-200.0
7,200,-200.0
8,200,-200.0
9,200,-200.0
10,200,-200.0
11,200,-200.0
12,200,-200.0
13,200,-200.0
14,200,-200.0
15,200,-200.0
16,200,-200.0
17,200,-200.0
18,200,-200.0
19,200,-200.0
20,200,-200.0
21,200,-200.0
22,200,-200.0
23,200,-200.0
24,200,-200.0
25,200,-200.0
26,200,-200.0
27,200,-200.0
28,200,-200.0
29,200,-200.0
30,200,-200.0
31,200,-200.0
32,200,-200.0
33,200,-200.0
34,200,-200.0
35,200,-200.0
36,200,-200.0
37,200,-200.0
38,200,-200.0
39,200,-200.0
40,200,-200.0
41,200,-200.0
42,200,-200.0
43,200,-200.0
44,200,-200.0
45,200,-200.0
46,200,-200.0
47,200,-200.0
48,200,-200.0
49,200,-200.0
50,200,-200.0
51,200,-200.0
52,200,-200.0
53,200,-200.0
54,200,-200.0
55,200,-200.0
56,200,-200.0
57,200,-200.0
58,200,-200.0
59,200,-200.0
60,200,-200.0
61,200,-200.0
62,200,-200.0
63,200,-200.0
64,200,-200.0
65,200,-200.0
66,200,-200.0
67,200,-200.0
68,200,-200.0
69,200,-200.0
70,200,-200.0
71,200,-200.0
72,200,-200.0
73,200,-200.0
74,200,-200.0
75,200,-200.0
76,200,-200.0
77,200,-200.0
78,200,-200.0
79,200,-200.0
80,200,-200.0
81,200,-200.0
82,200,-200.0
83,200,-200.0
84,200,-200.0
85,200,-200.0
86,200,-200.0
87,200,-200.0
88,200,-200.0
89,200,-200.0
90,200,-200.0
91,200,-200.0
92,200,-200.0
93,200,-200.0
94,200,-200.0
95,200,-200.0
96,200,-200.0
97,200,-200.0
98,200,-200.0
99,200,-200.0
100,200,-200.0
101,200,-200.0
102,200,-200.0
103,200,-200.0
104,200,-200.0
105,200,-200.0
106,200,-200.0
107,200,-200.0
108,200,-200.0
109,200,-200.0
110,200,-200.0
111,200,-200.0
112,200,-200.0
113,200,-200.0
114,200,-200.0
115,200,-200.0
116,200,-200.0
117,200,-200.0
118,200,-200.0
119,200,-200.0
120,200,-200.0
121,200,-200.0
122,200,-200.0
123,200,-200.0
124,200,-200.0
125,200,-200.0
126,200,-200.0
127,200,-200.0
128,200,-200.0
129,200,-200.0
130,200,-200.0
131,200,-200.0
132,200,-200.0
133,200,-200.0
134,200,-200.0
135,200,-200.0
136,200,-200.0
137,200,-200.0
138,200,-200.0
139,200,-200.0
140,200,-200.0
141,200,-200.0
142,200,-200.0
143,200,-200.0
144,200,-200.0
145,200,-200.0
146,200,-200.0
147,200,-200.0
148,200,-200.0
149,200,-200.0
150,200,-200.0
151,200,-200.0
152,200,-200.0
153,200,-200.0
154,200,-200.0
155,200,-200.0
156,200,-200.0
157,200,-200.0
158,200,-200.0
159,200,-200.0
160,200,-200.0
161,200,-200.0
162,200,-200.0
163,200,-200.0
164,200,-200.0
165,200,-200.0
166,200,-200.0
167,200,-200.0
168,200,-200.0
169,200,-200.0
170,200,-200.0
171,200,-200.0
172,200,-200.0
173,200,-200.0
174,200,-200.0
175,200,-200.0
176,200,-200.0
177,200,-200.0
178,200,-200.0
179,200,-200.0
180,200,-200.0
181,200,-200.0
182,200,-200.0
183,200,-200.0
184,200,-200.0
185,200,-200.0
186,200,-200.0
187,200,-200.0
188,200,-200.0
189,200,-200.0
190,200,-200.0
191,200,-200.0
192,200,-200.0
193,200,-200.0
194,200,-200.0
195,200,-200.0
196,200,-200.0
197,200,-200.0
198,200,-200.0
199,200,-200.0
200,200,-200.0
201,200,-200.0
202,200,-200.0
203,200,-200.0
204,200,-200.0
205,200,-200.0
206,193,-193.0
207,200,-200.0
208,200,-200.0
209,200,-200.0
210,200,-200.0
211,200,-200.0
212,119,-119.0
213,200,-200.0
214,200,-200.0
215,200,-200.0
216,200,-200.0
217,200,-200.0
218,200,-200.0
219,200,-200.0
220,200,-200.0
221,200,-200.0
222,200,-200.0
223,200,-200.0
224,200,-200.0
225,200,-200.0
226,200,-200.0
227,200,-200.0
228,200,-200.0
229,200,-200.0
230,200,-200.0
231,200,-200.0
232,200,-200.0
233,200,-200.0
234,200,-200.0
235,200,-200.0
236,200,-200.0
237,200,-200.0
238,200,-200.0
239,200,-200.0
240,200,-200.0
241,200,-200.0
242,200,-200.0
243,200,-200.0
244,200,-200.0
245,200,-200.0
246,200,-200.0
247,200,-200.0
248,200,-200.0
249,200,-200.0
250,200,-200.0
251,200,-200.0
252,200,-200.0
253,200,-200.0
254,200,-200.0
255,200,-200.0
256,200,-200.0
257,200,-200.0
258,200,-200.0
259,200,-200.0
260,200,-200.0
261,200,-200.0
262,188,-188.0
263,200,-200.0
264,200,-200.0
265,170,-170.0
266,200,-200.0
267,200,-200.0
268,141,-141.0
269,200,-200.0
270,200,-200.0
271,200,-200.0
272,200,-200.0
273,200,-200.0
274,181,-181.0
275,200,-200.0
276,200,-200.0
277,200,-200.0
278,200,-200.0
279,200,-200.0
280,182,-182.0
281,200,-200.0
282,187,-187.0
283,200,-200.0
284,200,-200.0
285,179,-179.0
286,200,-200.0
287,200,-200.0
288,175,-175.0
289,200,-200.0
290,200,-200.0
291,200,-200.0
292,200,-200.0
293,200,-200.0
294,200,-200.0
295,171,-171.0
296,200,-200.0
297,172,-172.0
298,200,-200.0
299,200,-200.0
300,200,-200.0
301,200,-200.0
302,200,-200.0
303,200,-200.0
304,200,-200.0
305,171,-171.0
306,200,-200.0
307,200,-200.0
308,200,-200.0
309,200,-200.0
310,200,-200.0
311,200,-200.0
312,200,-200.0
313,200,-200.0
314,200,-200.0
315,200,-200.0
316,200,-200.0
317,200,-200.0
318,199,-199.0
319,200,-200.0
320,200,-200.0
321,173,-173.0
322,165,-165.0
323,144,-144.0
324,200,-200.0
325,169,-169.0
326,130,-130.0
327,199,-199.0
328,166,-166.0
329,159,-159.0
330,166,-166.0
331,200,-200.0
332,200,-200.0
333,164,-164.0
334,200,-200.0
335,152,-152.0
336,200,-200.0
337,200,-200.0
338,200,-200.0
339,200,-200.0
340,200,-200.0
341,200,-200.0
342,156,-156.0
343,154,-154.0
344,200,-200.0
345,200,-200.0
346,155,-155.0
347,200,-200.0
348,156,-156.0
349,158,-158.0
350,200,-200.0
351,200,-200.0
352,200,-200.0
353,200,-200.0
354,200,-200.0
355,200,-200.0
356,200,-200.0
357,157,-157.0
358,200,-200.0
359,200,-200.0
360,200,-200.0
361,200,-200.0
362,200,-200.0
363,146,-146.0
364,147,-147.0
365,200,-200.0
366,200,-200.0
367,158,-158.0
368,161,-161.0
369,200,-200.0
370,200,-200.0
371,200,-200.0
372,200,-200.0
373,200,-200.0
374,160,-160.0
375,158,-158.0
376,159,-159.0
377,200,-200.0
378,200,-200.0
379,200,-200.0
380,152,-152.0
381,200,-200.0
382,156,-156.0
383,154,-154.0
384,200,-200.0
385,200,-200.0
386,191,-191.0
387,149,-149.0
388,169,-169.0
389,153,-153.0
390,166,-166.0
391,150,-150.0
392,153,-153.0
393,200,-200.0
394,127,-127.0
395,194,-194.0
396,156,-156.0
397,159,-159.0
398,156,-156.0
399,200,-200.0
400,160,-160.0
401,200,-200.0
402,150,-150.0
403,200,-200.0
404,200,-200.0
405,175,-175.0
406,200,-200.0
407,200,-200.0
408,200,-200.0
409,200,-200.0
410,200,-200.0
411,200,-200.0
412,200,-200.0
413,200,-200.0
414,200,-200.0
415,200,-200.0
416,200,-200.0
417,200,-200.0
418,200,-200.0
419,200,-200.0
420,200,-200.0
421,200,-200.0
422,200,-200.0
423,200,-200.0
424,200,-200.0
425,200,-200.0
426,200,-200.0
427,200,-200.0
428,200,-200.0
429,200,-200.0
430,200,-200.0
431,200,-200.0
432,200,-200.0
433,200,-200.0
434,200,-200.0
435,200,-200.0
436,200,-200.0
437,200,-200.0
438,200,-200.0
439,200,-200.0
440,200,-200.0
441,191,-191.0
442,200,-200.0
443,172,-172.0
444,200,-200.0
445,157,-157.0
446,168,-168.0
447,158,-158.0
448,200,-200.0
449,200,-200.0
450,200,-200.0
451,200,-200.0
452,200,-200.0
453,200,-200.0
454,158,-158.0
455,200,-200.0
456,200,-200.0
457,200,-200.0
458,200,-200.0
459,200,-200.0
460,200,-200.0
461,200,-200.0
462,177,-177.0
463,200,-200.0
464,174,-174.0
465,200,-200.0
466,183,-183.0
467,200,-200.0
468,118,-118.0
469,200,-200.0
470,200,-200.0
471,183,-183.0
472,172,-172.0
473,174,-174.0
474,177,-177.0
475,179,-179.0
476,200,-200.0
477,102,-102.0
478,169,-169.0
479,107,-107.0
480,200,-200.0
481,88,-88.0
482,200,-200.0
483,189,-189.0
484,200,-200.0
485,200,-200.0
486,200,-200.0
487,200,-200.0
488,182,-182.0
489,185,-185.0
490,200,-200.0
491,172,-172.0
492,167,-167.0
493,91,-91.0
494,169,-169.0
495,98,-98.0
496,181,-181.0
497,165,-165.0
498,179,-179.0
499,106,-106.0
500,174,-174.0
501,200,-200.0
502,126,-126.0
503,181,-181.0
504,86,-86.0
505,132,-132.0
506,131,-131.0
507,137,-137.0
508,137,-137.0
509,122,-122.0
510,95,-95.0
511,133,-133.0
512,125,-125.0
513,130,-130.0
514,126,-126.0
515,131,-131.0
516,128,-128.0
517,200,-200.0
518,164,-164.0
519,167,-167.0
520,90,-90.0
521,167,-167.0
522,162,-162.0
523,200,-200.0
524,192,-192.0
525,159,-159.0
526,87,-87.0
527,170,-170.0
528,132,-132.0
529,162,-162.0
530,127,-127.0
531,183,-183.0
532,178,-178.0
533,163,-163.0
534,200,-200.0
535,200,-200.0
536,193,-193.0
537,161,-161.0
538,96,-96.0
539,147,-147.0
540,157,-157.0
541,152,-152.0
542,198,-198.0
543,153,-153.0
544,149,-149.0
545,148,-148.0
546,180,-180.0
547,157,-157.0
548,162,-162.0
549,84,-84.0
550,158,-158.0
551,96,-96.0
552,173,-173.0
553,198,-198.0
554,181,-181.0
555,167,-167.0
556,167,-167.0
557,152,-152.0
558,87,-87.0
559,153,-153.0
560,200,-200.0
561,144,-144.0
562,161,-161.0
563,161,-161.0
564,178,-178.0
565,163,-163.0
566,85,-85.0
567,144,-144.0
568,149,-149.0
569,148,-148.0
570,84,-84.0
571,196,-196.0
572,87,-87.0
573,101,-101.0
574,166,-166.0
575,186,-186.0
576,200,-200.0
577,126,-126.0
578,84,-84.0
579,93,-93.0
580,143,-143.0
581,184,-184.0
582,151,-151.0
583,93,-93.0
584,87,-87.0
585,94,-94.0
586,89,-89.0
587,152,-152.0
588,144,-144.0
589,200,-200.0
590,87,-87.0
591,200,-200.0
592,161,-161.0
593,140,-140.0
594,151,-151.0
595,140,-140.0
596,143,-143.0
597,200,-200.0
598,141,-141.0
599,87,-87.0
600,139,-139.0
601,143,-143.0
602,137,-137.0
603,165,-165.0
604,90,-90.0
605,143,-143.0
606,150,-150.0
607,157,-157.0
608,139,-139.0
609,139,-139.0
610,91,-91.0
611,139,-139.0
612,169,-169.0
613,182,-182.0
614,153,-153.0
615,138,-138.0
616,86,-86.0
617,134,-134.0
618,152,-152.0
619,87,-87.0
620,86,-86.0
621,160,-160.0
622,172,-172.0
623,139,-139.0
624,136,-136.0
625,170,-170.0
626,142,-142.0
627,140,-140.0
628,141,-141.0
629,91,-91.0
630,139,-139.0
631,146,-146.0
632,138,-138.0
633,152,-152.0
634,108,-108.0
635,140,-140.0
636,200,-200.0
637,146,-146.0
638,140,-140.0
639,145,-145.0
640,143,-143.0
641,177,-177.0
642,89,-89.0
643,89,-89.0
644,140,-140.0
645,86,-86.0
646,144,-144.0
647,200,-200.0
648,153,-153.0
649,143,-143.0
650,88,-88.0
651,152,-152.0
652,113,-113.0
653,94,-94.0
654,142,-142.0
655,143,-143.0
656,150,-150.0
657,179,-179.0
658,93,-93.0
659,140,-140.0
660,86,-86.0
661,145,-145.0
662,146,-146.0
663,85,-85.0
664,157,-157.0
665,99,-99.0
666,129,-129.0
667,107,-107.0
668,85,-85.0
669,153,-153.0
670,145,-145.0
671,147,-147.0
672,89,-89.0
673,167,-167.0
674,200,-200.0
675,89,-89.0
676,93,-93.0
677,162,-162.0
678,156,-156.0
679,152,-152.0
680,169,-169.0
681,86,-86.0
682,96,-96.0
683,102,-102.0
684,86,-86.0
685,170,-170.0
686,96,-96.0
687,200,-200.0
688,145,-145.0
689,200,-200.0
690,200,-200.0
691,150,-150.0
692,200,-200.0
693,161,-161.0
694,84,-84.0
695,187,-187.0
696,88,-88.0
697,147,-147.0
698,190,-190.0
699,159,-159.0
700,89,-89.0
701,87,-87.0
702,84,-84.0
703,86,-86.0
704,94,-94.0
705,152,-152.0
706,86,-86.0
707,106,-106.0
708,152,-152.0
709,151,-151.0
710,200,-200.0
711,100,-100.0
712,165,-165.0
713,152,-152.0
714,84,-84.0
715,152,-152.0
716,147,-147.0
717,147,-147.0
718,140,-140.0
719,149,-149.0
720,147,-147.0
721,152,-152.0
722,152,-152.0
723,150,-150.0
724,200,-200.0
725,152,-152.0
726,155,-155.0
727,143,-143.0
728,143,-143.0
729,94,-94.0
730,200,-200.0
731,97,-97.0
732,142,-142.0
733,144,-144.0
734,153,-153.0
735,149,-149.0
736,145,-145.0
737,149,-149.0
738,146,-146.0
739,93,-93.0
740,142,-142.0
741,140,-140.0
742,144,-144.0
743,142,-142.0
744,151,-151.0
745,142,-142.0
746,200,-200.0
747,142,-142.0
748,91,-91.0
749,141,-141.0
750,91,-91.0
751,97,-97.0
752,90,-90.0
753,153,-153.0
754,200,-200.0
755,149,-149.0
756,90,-90.0
757,200,-200.0
758,145,-145.0
759,107,-107.0
760,103,-103.0
761,147,-147.0
762,151,-151.0
763,143,-143.0
764,143,-143.0
765,142,-142.0
766,146,-146.0
767,145,-145.0
768,160,-160.0
769,143,-143.0
770,200,-200.0
771,155,-155.0
772,147,-147.0
773,142,-142.0
774,143,-143.0
775,149,-149.0
776,147,-147.0
777,198,-198.0
778,147,-147.0
779,144,-144.0
780,137,-137.0
781,185,-185.0
782,147,-147.0
783,156,-156.0
784,200,-200.0
785,197,-197.0
786,142,-142.0
787,139,-139.0
788,144,-144.0
789,141,-141.0
790,150,-150.0
791,151,-151.0
792,145,-145.0
793,141,-141.0
794,144,-144.0
795,144,-144.0
796,146,-146.0
797,142,-142.0
798,138,-138.0
799,146,-146.0
800,144,-144.0
801,200,-200.0
802,142,-142.0
803,147,-147.0
804,162,-162.0
805,154,-154.0
806,154,-154.0
807,150,-150.0
808,136,-136.0
809,162,-162.0
810,200,-200.0
811,142,-142.0
812,146,-146.0
813,143,-143.0
814,155,-155.0
815,155,-155.0
816,148,-148.0
817,145,-145.0
818,147,-147.0
819,148,-148.0
820,153,-153.0
821,150,-150.0
822,144,-144.0
823,143,-143.0
824,143,-143.0
825,143,-143.0
826,144,-144.0
827,149,-149.0
828,143,-143.0
829,142,-142.0
830,142,-142.0
831,147,-147.0
832,152,-152.0
833,151,-151.0
834,200,-200.0
835,200,-200.0
836,152,-152.0
837,148,-148.0
838,167,-167.0
839,149,-149.0
840,137,-137.0
841,141,-141.0
842,142,-142.0
843,145,-145.0
844,142,-142.0
845,143,-143.0
846,147,-147.0
847,131,-131.0
848,144,-144.0
849,153,-153.0
850,144,-144.0
851,143,-143.0
852,146,-146.0
853,144,-144.0
854,152,-152.0
855,200,-200.0
856,158,-158.0
857,142,-142.0
858,145,-145.0
859,148,-148.0
860,185,-185.0
861,177,-177.0
862,145,-145.0
863,117,-117.0
864,116,-116.0
865,113,-113.0
866,112,-112.0
867,113,-113.0
868,138,-138.0
869,116,-116.0
870,113,-113.0
871,114,-114.0
872,153,-153.0
873,116,-116.0
874,157,-157.0
875,111,-111.0
876,142,-142.0
877,143,-143.0
878,113,-113.0
879,182,-182.0
880,106,-106.0
881,112,-112.0
882,111,-111.0
883,117,-117.0
884,112,-112.0
885,152,-152.0
886,111,-111.0
887,158,-158.0
888,154,-154.0
889,121,-121.0
890,115,-115.0
891,136,-136.0
892,112,-112.0
893,119,-119.0
894,116,-116.0
895,114,-114.0
896,117,-117.0
897,114,-114.0
898,114,-114.0
899,110,-110.0
900,143,-143.0
901,112,-112.0
902,149,-149.0
903,114,-114.0
904,137,-137.0
905,200,-200.0
906,157,-157.0
907,154,-154.0
908,92,-92.0
909,94,-94.0
910,94,-94.0
911,97,-97.0
912,89,-89.0
913,159,-159.0
914,103,-103.0
915,91,-91.0
916,91,-91.0
917,153,-153.0
918,133,-133.0
919,86,-86.0
920,158,-158.0
921,149,-149.0
922,98,-98.0
923,148,-148.0
924,150,-150.0
925,147,-147.0
926,200,-200.0
927,149,-149.0
928,151,-151.0
929,181,-181.0
930,86,-86.0
931,144,-144.0
932,146,-146.0
933,173,-173.0
934,146,-146.0
935,155,-155.0
936,162,-162.0
937,191,-191.0
938,146,-146.0
939,90,-90.0
940,150,-150.0
941,146,-146.0
942,200,-200.0
943,160,-160.0
944,171,-171.0
945,200,-200.0
946,154,-154.0
947,150,-150.0
948,168,-168.0
949,160,-160.0
950,200,-200.0
951,117,-117.0
952,149,-149.0
953,200,-200.0
954,98,-98.0
955,200,-200.0
956,93,-93.0
957,97,-97.0
958,104,-104.0
959,154,-154.0
960,161,-161.0
961,200,-200.0
962,148,-148.0
963,152,-152.0
964,200,-200.0
965,152,-152.0
966,140,-140.0
967,144,-144.0
968,143,-143.0
969,131,-131.0
970,140,-140.0
971,200,-200.0
972,94,-94.0
973,200,-200.0
974,200,-200.0
975,151,-151.0
976,142,-142.0
977,200,-200.0
978,200,-200.0
979,200,-200.0
980,141,-141.0
981,200,-200.0
982,143,-143.0
983,137,-137.0
984,140,-140.0
985,156,-156.0
986,146,-146.0
987,190,-190.0
988,168,-168.0
989,176,-176.0
990,156,-156.0
991,156,-156.0
992,194,-194.0
993,179,-179.0
994,200,-200.0
995,172,-172.0
996,138,-138.0
997,172,-172.0
998,157,-157.0
999,163,-163.0
1000,166,-166.0
1001,155,-155.0
1002,85,-85.0
1003,175,-175.0
1004,84,-84.0
1005,122,-122.0
1006,157,-157.0
1007,200,-200.0
1008,146,-146.0
1009,151,-151.0
1010,86,-86.0
1011,150,-150.0
1012,159,-159.0
1013,200,-200.0
1014,200,-200.0
1015,183,-183.0
1016,200,-200.0
1017,173,-173.0
1018,154,-154.0
1019,138,-138.0
1020,157,-157.0
1021,119,-119.0
1022,87,-87.0
1023,92,-92.0
1024,163,-163.0
1025,180,-180.0
1026,92,-92.0
1027,157,-157.0
1028,91,-91.0
1029,160,-160.0
1030,100,-100.0
1031,186,-186.0
1032,176,-176.0
1033,144,-144.0
1034,100,-100.0
1035,97,-97.0
1036,95,-95.0
1037,91,-91.0
1038,153,-153.0
1039,169,-169.0
1040,167,-167.0
1041,200,-200.0
1042,200,-200.0
1043,152,-152.0
1044,153,-153.0
1045,166,-166.0
1046,167,-167.0
1047,163,-163.0
1048,149,-149.0
1049,161,-161.0
1050,158,-158.0
1051,146,-146.0
1052,154,-154.0
1053,86,-86.0
1054,161,-161.0
1055,149,-149.0
1056,149,-149.0
1057,85,-85.0
1058,105,-105.0
1059,157,-157.0
1060,161,-161.0
1061,92,-92.0
1062,148,-148.0
1063,94,-94.0
1064,145,-145.0
1065,162,-162.0
1066,90,-90.0
1067,163,-163.0
1068,151,-151.0
1069,165,-165.0
1070,100,-100.0
1071,102,-102.0
1072,200,-200.0
1073,159,-159.0
1074,149,-149.0
1075,157,-157.0
1076,180,-180.0
1077,89,-89.0
1078,86,-86.0
1079,90,-90.0
1080,141,-141.0
1081,101,-101.0
1082,146,-146.0
1083,150,-150.0
1084,95,-95.0
1085,152,-152.0
1086,166,-166.0
1087,93,-93.0
1088,91,-91.0
1089,88,-88.0
1090,100,-100.0
1091,98,-98.0
1092,96,-96.0
1093,92,-92.0
1094,151,-151.0
1095,156,-156.0
1096,89,-89.0
1097,152,-152.0
1098,144,-144.0
1099,147,-147.0
1100,144,-144.0
1101,89,-89.0
1102,88,-88.0
1103,88,-88.0
1104,167,-167.0
1105,200,-200.0
1106,154,-154.0
1107,144,-144.0
1108,151,-151.0
1109,145,-145.0
1110,148,-148.0
1111,148,-148.0
1112,157,-157.0
1113,164,-164.0
1114,200,-200.0
1115,150,-150.0
1116,173,-173.0
1117,155,-155.0
1118,200,-200.0
1119,161,-161.0
1120,144,-144.0
1121,149,-149.0
1122,145,-145.0
1123,138,-138.0
1124,141,-141.0
1125,95,-95.0
1126,136,-136.0
1127,157,-157.0
1128,144,-144.0
1129,157,-157.0
1130,139,-139.0
1131,165,-165.0
1132,200,-200.0
1133,141,-141.0
1134,142,-142.0
1135,200,-200.0
1136,144,-144.0
1137,148,-148.0
1138,139,-139.0
1139,148,-148.0
1140,138,-138.0
1141,135,-135.0
1142,142,-142.0
1143,140,-140.0
1144,143,-143.0
1145,149,-149.0
1146,146,-146.0
1147,145,-145.0
1148,139,-139.0
1149,137,-137.0
1150,151,-151.0
1151,149,-149.0
1152,146,-146.0
1153,200,-200.0
1154,141,-141.0
1155,160,-160.0
1156,192,-192.0
1157,200,-200.0
1158,136,-136.0
1159,133,-133.0
1160,128,-128.0
1161,91,-91.0
1162,146,-146.0
1163,143,-143.0
1164,148,-148.0
1165,168,-168.0
1166,149,-149.0
1167,157,-157.0
1168,151,-151.0
1169,182,-182.0
1170,96,-96.0
1171,200,-200.0
1172,151,-151.0
1173,89,-89.0
1174,200,-200.0
1175,200,-200.0
1176,158,-158.0
1177,154,-154.0
1178,200,-200.0
1179,151,-151.0
1180,142,-142.0
1181,154,-154.0
1182,157,-157.0
1183,151,-151.0
1184,160,-160.0
1185,146,-146.0
1186,200,-200.0
1187,142,-142.0
1188,90,-90.0
1189,143,-143.0
1190,91,-91.0
1191,169,-169.0
1192,99,-99.0
1193,173,-173.0
1194,200,-200.0
1195,134,-134.0
1196,147,-147.0
1197,88,-88.0
1198,86,-86.0
1199,140,-140.0
1200,140,-140.0
