episodes,steps,rewards
0,200,-200.0
1,200,-200.0
2,200,-200.0
3,200,-200.0
4,200,-200.0
5,200,-200.0
6,200,-200.0
7,200,-200.0
8,200,-200.0
9,200,-200.0
10,200,-200.0
11,200,-200.0
12,200,-200.0
13,200,-200.0
14,200,-200.0
15,200,-200.0
16,200,-200.0
17,200,-200.0
18,200,-200.0
19,200,-200.0
20,200,-200.0
21,200,-200.0
22,200,-200.0
23,200,-200.0
24,200,-200.0
25,200,-200.0
26,200,-200.0
27,200,-200.0
28,200,-200.0
29,200,-200.0
30,200,-200.0
31,200,-200.0
32,200,-200.0
33,200,-200.0
34,200,-200.0
35,200,-200.0
36,200,-200.0
37,200,-200.0
38,200,-200.0
39,200,-200.0
40,200,-200.0
41,200,-200.0
42,200,-200.0
43,200,-200.0
44,200,-200.0
45,200,-200.0
46,200,-200.0
47,200,-200.0
48,200,-200.0
49,200,-200.0
50,200,-200.0
51,200,-200.0
52,200,-200.0
53,200,-200.0
54,200,-200.0
55,200,-200.0
56,200,-200.0
57,200,-200.0
58,200,-200.0
59,200,-200.0
60,200,-200.0
61,200,-200.0
62,200,-200.0
63,200,-200.0
64,200,-200.0
65,200,-200.0
66,200,-200.0
67,200,-200.0
68,200,-200.0
69,200,-200.0
70,200,-200.0
71,200,-200.0
72,200,-200.0
73,200,-200.0
74,200,-200.0
75,200,-200.0
76,200,-200.0
77,200,-200.0
78,200,-200.0
79,200,-200.0
80,200,-200.0
81,200,-200.0
82,200,-200.0
83,200,-200.0
84,200,-200.0
85,200,-200.0
86,200,-200.0
87,200,-200.0
88,200,-200.0
89,200,-200.0
90,200,-200.0
91,200,-200.0
92,200,-200.0
93,200,-200.0
94,200,-200.0
95,200,-200.0
96,200,-200.0
97,200,-200.0
98,200,-200.0
99,200,-200.0
100,200,-200.0
101,200,-200.0
102,200,-200.0
103,200,-200.0
104,200,-200.0
105,200,-200.0
106,200,-200.0
107,200,-200.0
108,200,-200.0
109,200,-200.0
110,200,-200.0
111,200,-200.0
112,200,-200.0
113,200,-200.0
114,200,-200.0
115,200,-200.0
116,200,-200.0
117,200,-200.0
118,200,-200.0
119,200,-200.0
120,200,-200.0
121,200,-200.0
122,200,-200.0
123,200,-200.0
124,200,-200.0
125,200,-200.0
126,200,-200.0
127,200,-200.0
128,200,-200.0
129,200,-200.0
130,200,-200.0
131,200,-200.0
132,200,-200.0
133,200,-200.0
134,200,-200.0
135,200,-200.0
136,200,-200.0
137,200,-200.0
138,200,-200.0
139,200,-200.0
140,200,-200.0
141,200,-200.0
142,200,-200.0
143,200,-200.0
144,200,-200.0
145,200,-200.0
146,200,-200.0
147,200,-200.0
148,200,-200.0
149,200,-200.0
150,200,-200.0
151,200,-200.0
152,200,-200.0
153,200,-200.0
154,200,-200.0
155,200,-200.0
156,200,-200.0
157,200,-200.0
158,200,-200.0
159,200,-200.0
160,200,-200.0
161,200,-200.0
162,200,-200.0
163,200,-200.0
164,200,-200.0
165,200,-200.0
166,200,-200.0
167,200,-200.0
168,200,-200.0
169,200,-200.0
170,200,-200.0
171,200,-200.0
172,163,-163.0
173,175,-175.0
174,200,-200.0
175,200,-200.0
176,200,-200.0
177,200,-200.0
178,200,-200.0
179,200,-200.0
180,200,-200.0
181,200,-200.0
182,200,-200.0
183,200,-200.0
184,200,-200.0
185,200,-200.0
186,200,-200.0
187,200,-200.0
188,200,-200.0
189,200,-200.0
190,200,-200.0
191,180,-180.0
192,190,-190.0
193,181,-181.0
194,142,-142.0
195,159,-159.0
196,106,-106.0
197,180,-180.0
198,137,-137.0
199,131,-131.0
200,121,-121.0
201,89,-89.0
202,118,-118.0
203,185,-185.0
204,164,-164.0
205,125,-125.0
206,93,-93.0
207,174,-174.0
208,117,-117.0
209,167,-167.0
210,188,-188.0
211,166,-166.0
212,159,-159.0
213,185,-185.0
214,98,-98.0
215,169,-169.0
216,165,-165.0
217,164,-164.0
218,99,-99.0
219,187,-187.0
220,200,-200.0
221,173,-173.0
222,168,-168.0
223,157,-157.0
224,178,-178.0
225,180,-180.0
226,151,-151.0
227,170,-170.0
228,200,-200.0
229,166,-166.0
230,154,-154.0
231,152,-152.0
232,200,-200.0
233,111,-111.0
234,138,-138.0
235,144,-144.0
236,126,-126.0
237,91,-91.0
238,167,-167.0
239,160,-160.0
240,165,-165.0
241,164,-164.0
242,91,-91.0
243,103,-103.0
244,158,-158.0
245,162,-162.0
246,156,-156.0
247,164,-164.0
248,115,-115.0
249,165,-165.0
250,162,-162.0
251,160,-160.0
252,168,-168.0
253,178,-178.0
254,175,-175.0
255,192,-192.0
256,118,-118.0
257,89,-89.0
258,163,-163.0
259,120,-120.0
260,200,-200.0
261,87,-87.0
262,158,-158.0
263,88,-88.0
264,135,-135.0
265,200,-200.0
266,87,-87.0
267,96,-96.0
268,140,-140.0
269,105,-105.0
270,163,-163.0
271,115,-115.0
272,168,-168.0
273,162,-162.0
274,156,-156.0
275,185,-185.0
276,165,-165.0
277,200,-200.0
278,157,-157.0
279,163,-163.0
280,161,-161.0
281,174,-174.0
282,161,-161.0
283,200,-200.0
284,200,-200.0
285,86,-86.0
286,84,-84.0
287,172,-172.0
288,88,-88.0
289,119,-119.0
290,119,-119.0
291,124,-124.0
292,178,-178.0
293,86,-86.0
294,154,-154.0
295,166,-166.0
296,115,-115.0
297,200,-200.0
298,158,-158.0
299,161,-161.0
300,110,-110.0
301,104,-104.0
302,155,-155.0
303,138,-138.0
304,145,-145.0
305,200,-200.0
306,161,-161.0
307,153,-153.0
308,88,-88.0
309,169,-169.0
310,161,-161.0
311,140,-140.0
312,166,-166.0
313,155,-155.0
314,148,-148.0
315,104,-104.0
316,157,-157.0
317,152,-152.0
318,154,-154.0
319,86,-86.0
320,155,-155.0
321,145,-145.0
322,173,-173.0
323,200,-200.0
324,141,-141.0
325,200,-200.0
326,200,-200.0
327,150,-150.0
328,86,-86.0
329,93,-93.0
330,145,-145.0
331,144,-144.0
332,88,-88.0
333,147,-147.0
334,142,-142.0
335,200,-200.0
336,98,-98.0
337,132,-132.0
338,146,-146.0
339,200,-200.0
340,143,-143.0
341,148,-148.0
342,153,-153.0
343,143,-143.0
344,138,-138.0
345,110,-110.0
346,89,-89.0
347,188,-188.0
348,146,-146.0
349,164,-164.0
350,146,-146.0
