{
    "model_info": "common32",
    "episodes": [
        9,
        15,
        10,
        11,
        9,
        14,
        12,
        13,
        13,
        9,
        12,
        12,
        13,
        16,
        11,
        24,
        28,
        22,
        21,
        23,
        15,
        26,
        24,
        44,
        31,
        19,
        26,
        12,
        11,
        23,
        25,
        13,
        15,
        15,
        19,
        12,
        15,
        11,
        10,
        12,
        18,
        11,
        18,
        19,
        12,
        13,
        22,
        19,
        17,
        19,
        18,
        21,
        13,
        15,
        11,
        14,
        16,
        20,
        32,
        10,
        24,
        24,
        10,
        18,
        16,
        17,
        27,
        24,
        12,
        17,
        25,
        14,
        18,
        13,
        14,
        9,
        26,
        33,
        12,
        33,
        42,
        107,
        27,
        78,
        23,
        151,
        57,
        88,
        56,
        30,
        151,
        33,
        30,
        55,
        42,
        52,
        61,
        49,
        37,
        49,
        47,
        40,
        70,
        73,
        63,
        52,
        44,
        41,
        55,
        54,
        89,
        52,
        68,
        64,
        89,
        94,
        76,
        75,
        105,
        126,
        129,
        133,
        70,
        15,
        33,
        98,
        31,
        14,
        18,
        28,
        17,
        17,
        15,
        17,
        9,
        22,
        18,
        17,
        30,
        21,
        34,
        20,
        16,
        34,
        20,
        31,
        55,
        19,
        54,
        46,
        84,
        43,
        71,
        110,
        317,
        92,
        55,
        77,
        102,
        359,
        191,
        89,
        236,
        116,
        104,
        88,
        78,
        73,
        70,
        79,
        129,
        82,
        141,
        95,
        141,
        199,
        168,
        248,
        164,
        261,
        257,
        247,
        236,
        303,
        231,
        343,
        264,
        500,
        355,
        402,
        331,
        211,
        441,
        196,
        35,
        170,
        487,
        500,
        147,
        316,
        147,
        99,
        132,
        45,
        169,
        232,
        207,
        347,
        111,
        138,
        122,
        102,
        464,
        283,
        308,
        500,
        201,
        427,
        500,
        500,
        500,
        500,
        500,
        500,
        500,
        500,
        500,
        500,
        500,
        500,
        500,
        500,
        500,
        500,
        500,
        500,
        500,
        500,
        500,
        500,
        500,
        500,
        500,
        442,
        500,
        500,
        500,
        500,
        500,
        500,
        500,
        500,
        500,
        500,
        500,
        500,
        500,
        500,
        500,
        500,
        500,
        500,
        451,
        500,
        500,
        500,
        500,
        500,
        500,
        500,
        500,
        500,
        500,
        500,
        500,
        500,
        500,
        500,
        500,
        500,
        500,
        500,
        500,
        500,
        116,
        500,
        107,
        500,
        321,
        500,
        311,
        113,
        500,
        103,
        500,
        500,
        500,
        500,
        414,
        244,
        500,
        500,
        500,
        500,
        135,
        500,
        500,
        500,
        500,
        500,
        500,
        500,
        500,
        500,
        500,
        500,
        500,
        500,
        500,
        500,
        500,
        500,
        500,
        500,
        500,
        500,
        500,
        500,
        500,
        500,
        500,
        500,
        500,
        500,
        500,
        500,
        500,
        500,
        500,
        500,
        500,
        500,
        500,
        500,
        500,
        500,
        500,
        500,
        500,
        500,
        500,
        500,
        500,
        500,
        500,
        500,
        500,
        500,
        500,
        500,
        500,
        500,
        500,
        500,
        500,
        500,
        500,
        500,
        500,
        500,
        500,
        500,
        500,
        500,
        500,
        500,
        500,
        500,
        500,
        500,
        500,
        500,
        500,
        500,
        500
    ],
    "durations": [
        1.368872,
        0.0,
        0.015618,
        0.0,
        0.0,
        0.0,
        0.016894,
        0.0,
        0.0,
        0.0,
        0.015628,
        0.0,
        0.0,
        0.0,
        0.015625,
        0.0,
        0.015626,
        0.0,
        0.0,
        0.017854,
        0.001228,
        0.0,
        0.015632,
        0.0,
        0.015619,
        0.0,
        0.016832,
        0.0,
        0.0,
        0.015625,
        0.0,
        0.0,
        0.0,
        0.0,
        0.0,
        0.0,
        0.015625,
        0.0,
        0.0,
        0.0,
        0.016263,
        0.003998,
        0.001235,
        0.0,
        0.0,
        0.015626,
        0.0,
        0.0,
        0.016726,
        0.0,
        0.0,
        0.015627,
        0.0,
        0.0,
        0.0,
        0.015627,
        0.0,
        0.0,
        0.015625,
        0.0,
        0.0,
        0.015624,
        0.0,
        0.0,
        0.016943,
        0.004236,
        0.0,
        0.0,
        0.016736,
        0.0,
        0.0,
        0.015626,
        0.0,
        0.0,
        0.0,
        0.015626,
        0.0,
        0.015625,
        0.0,
        0.0,
        0.015628,
        0.037549,
        0.0,
        0.015626,
        0.015627,
        0.031249,
        0.015624,
        0.033364,
        0.002282,
        0.015627,
        0.03125,
        0.015637,
        0.0,
        0.01563,
        0.01561,
        0.020984,
        0.015625,
        0.015628,
        0.0,
        0.015627,
        0.015624,
        0.017026,
        0.016028,
        0.019945,
        0.01563,
        0.0,
        0.015622,
        0.015627,
        0.015625,
        0.016753,
        0.021118,
        0.015628,
        0.015624,
        0.015624,
        0.015629,
        0.032443,
        0.021222,
        0.015626,
        0.03125,
        0.032384,
        0.035511,
        0.032499,
        0.016786,
        0.0,
        0.015629,
        0.015625,
        0.015625,
        0.0,
        0.0,
        0.021341,
        0.0,
        0.0,
        0.0,
        0.015626,
        0.0,
        0.0,
        0.016848,
        0.0,
        0.0,
        0.01563,
        0.0,
        0.015618,
        0.0,
        0.015626,
        0.0,
        0.0,
        0.015625,
        0.017934,
        0.00228,
        0.016995,
        0.015626,
        0.015627,
        0.015624,
        0.036775,
        0.079648,
        0.021176,
        0.017149,
        0.015625,
        0.031255,
        0.10063,
        0.036724,
        0.032513,
        0.067796,
        0.016877,
        0.031248,
        0.015626,
        0.034481,
        0.018221,
        0.015626,
        0.015626,
        0.031249,
        0.021172,
        0.048063,
        0.015624,
        0.03125,
        0.053293,
        0.046879,
        0.067844,
        0.046876,
        0.067891,
        0.0625,
        0.067962,
        0.064697,
        0.065812,
        0.052332,
        0.097096,
        0.064789,
        0.13078,
        0.085065,
        0.116214,
        0.069468,
        0.048017,
        0.115393,
        0.051396,
        0.0,
        0.048018,
        0.131946,
        0.130796,
        0.035811,
        0.079298,
        0.03685,
        0.015612,
        0.037276,
        0.016778,
        0.046879,
        0.062244,
        0.046878,
        0.084966,
        0.031249,
        0.038657,
        0.031252,
        0.031252,
        0.121236,
        0.079275,
        0.069168,
        0.130822,
        0.046876,
        0.115233,
        0.13617,
        0.132849,
        0.130837,
        0.132003,
        0.136175,
        0.132861,
        0.130857,
        0.131933,
        0.131774,
        0.134495,
        0.129153,
        0.130337,
        0.130609,
        0.131463,
        0.131355,
        0.132899,
        0.134019,
        0.118436,
        0.132899,
        0.130738,
        0.13094,
        0.131326,
        0.131475,
        0.132824,
        0.137269,
        0.116316,
        0.130617,
        0.131953,
        0.131848,
        0.132046,
        0.13141,
        0.131559,
        0.118893,
        0.131368,
        0.131927,
        0.131768,
        0.131929,
        0.137204,
        0.130635,
        0.130642,
        0.132806,
        0.131906,
        0.130804,
        0.116294,
        0.131967,
        0.11825,
        0.132832,
        0.130656,
        0.132352,
        0.130689,
        0.137679,
        0.130308,
        0.130396,
        0.130463,
        0.131425,
        0.131991,
        0.132235,
        0.135148,
        0.116246,
        0.131774,
        0.132893,
        0.130826,
        0.130828,
        0.131724,
        0.136489,
        0.131919,
        0.031255,
        0.131947,
        0.021305,
        0.133218,
        0.085347,
        0.131276,
        0.081227,
        0.016874,
        0.131459,
        0.03125,
        0.130817,
        0.1385,
        0.130861,
        0.130743,
        0.100549,
        0.063619,
        0.136449,
        0.130607,
        0.130681,
        0.132979,
        0.031251,
        0.134047,
        0.117236,
        0.131631,
        0.132954,
        0.140654,
        0.122551,
        0.131314,
        0.13775,
        0.131673,
        0.131787,
        0.117469,
        0.131706,
        0.130896,
        0.135361,
        0.131567,
        0.133041,
        0.13189,
        0.130778,
        0.131353,
        0.142621,
        0.125654,
        0.146667,
        0.132962,
        0.134118,
        0.118327,
        0.131723,
        0.13584,
        0.131845,
        0.131442,
        0.130751,
        0.130351,
        0.137183,
        0.131668,
        0.131686,
        0.116127,
        0.133395,
        0.13179,
        0.131621,
        0.136695,
        0.131374,
        0.130697,
        0.131909,
        0.130761,
        0.132118,
        0.130767,
        0.133956,
        0.119377,
        0.13068,
        0.132864,
        0.131313,
        0.146644,
        0.125056,
        0.137153,
        0.130729,
        0.130821,
        0.131801,
        0.130666,
        0.13293,
        0.120217,
        0.136301,
        0.130685,
        0.132919,
        0.130753,
        0.130811,
        0.11503,
        0.121423,
        0.133386,
        0.147493,
        0.152782,
        0.146974,
        0.161872,
        0.152594,
        0.161774,
        0.146118,
        0.13698,
        0.130892,
        0.146306,
        0.129999,
        0.129003,
        0.132069
    ]
}