episodes,steps,rewards
0,200,-200.0
1,200,-200.0
2,200,-200.0
3,200,-200.0
4,200,-200.0
5,200,-200.0
6,200,-200.0
7,200,-200.0
8,200,-200.0
9,200,-200.0
10,200,-200.0
11,200,-200.0
12,200,-200.0
13,200,-200.0
14,200,-200.0
15,200,-200.0
16,200,-200.0
17,200,-200.0
18,200,-200.0
19,200,-200.0
20,200,-200.0
21,114,-114.0
22,184,-184.0
23,200,-200.0
24,176,-176.0
25,200,-200.0
26,189,-189.0
27,180,-180.0
28,200,-200.0
29,200,-200.0
30,200,-200.0
31,200,-200.0
32,200,-200.0
33,200,-200.0
34,200,-200.0
35,200,-200.0
36,200,-200.0
37,200,-200.0
38,153,-153.0
39,200,-200.0
40,200,-200.0
41,200,-200.0
42,156,-156.0
43,200,-200.0
44,143,-143.0
45,174,-174.0
46,130,-130.0
47,200,-200.0
48,144,-144.0
49,170,-170.0
50,199,-199.0
51,176,-176.0
52,192,-192.0
53,188,-188.0
54,157,-157.0
55,150,-150.0
56,152,-152.0
57,156,-156.0
58,200,-200.0
59,200,-200.0
60,200,-200.0
61,153,-153.0
62,143,-143.0
63,135,-135.0
64,200,-200.0
65,171,-171.0
66,200,-200.0
67,159,-159.0
68,200,-200.0
69,152,-152.0
70,135,-135.0
71,142,-142.0
72,147,-147.0
73,158,-158.0
74,200,-200.0
75,146,-146.0
76,149,-149.0
77,151,-151.0
78,153,-153.0
79,200,-200.0
80,152,-152.0
81,200,-200.0
82,200,-200.0
83,137,-137.0
84,200,-200.0
85,151,-151.0
86,176,-176.0
87,145,-145.0
88,200,-200.0
89,162,-162.0
90,146,-146.0
91,143,-143.0
92,143,-143.0
93,148,-148.0
94,200,-200.0
95,152,-152.0
96,166,-166.0
97,155,-155.0
98,165,-165.0
99,130,-130.0
100,163,-163.0
101,188,-188.0
102,188,-188.0
103,200,-200.0
104,159,-159.0
105,200,-200.0
106,200,-200.0
107,200,-200.0
108,200,-200.0
109,174,-174.0
110,200,-200.0
111,200,-200.0
112,191,-191.0
113,162,-162.0
114,118,-118.0
115,125,-125.0
116,130,-130.0
117,156,-156.0
118,175,-175.0
119,153,-153.0
120,115,-115.0
121,122,-122.0
122,194,-194.0
123,174,-174.0
124,142,-142.0
125,180,-180.0
126,163,-163.0
127,156,-156.0
128,127,-127.0
129,119,-119.0
130,117,-117.0
131,152,-152.0
132,160,-160.0
133,149,-149.0
134,113,-113.0
135,114,-114.0
136,157,-157.0
137,159,-159.0
138,144,-144.0
139,144,-144.0
140,111,-111.0
141,149,-149.0
142,164,-164.0
143,154,-154.0
144,113,-113.0
145,145,-145.0
146,146,-146.0
147,113,-113.0
148,130,-130.0
149,162,-162.0
150,145,-145.0
151,144,-144.0
152,122,-122.0
153,151,-151.0
154,159,-159.0
155,175,-175.0
156,105,-105.0
157,151,-151.0
158,115,-115.0
159,149,-149.0
160,147,-147.0
161,155,-155.0
162,200,-200.0
163,169,-169.0
164,165,-165.0
165,184,-184.0
166,164,-164.0
167,145,-145.0
168,175,-175.0
169,153,-153.0
170,102,-102.0
171,166,-166.0
172,141,-141.0
173,150,-150.0
174,155,-155.0
175,168,-168.0
176,169,-169.0
177,147,-147.0
178,100,-100.0
179,97,-97.0
180,149,-149.0
181,145,-145.0
182,87,-87.0
183,140,-140.0
184,151,-151.0
185,156,-156.0
186,145,-145.0
187,161,-161.0
188,143,-143.0
189,146,-146.0
190,148,-148.0
191,88,-88.0
192,111,-111.0
193,91,-91.0
194,108,-108.0
195,114,-114.0
196,113,-113.0
197,109,-109.0
198,88,-88.0
199,103,-103.0
200,147,-147.0
201,149,-149.0
202,150,-150.0
203,88,-88.0
204,87,-87.0
205,139,-139.0
206,105,-105.0
207,139,-139.0
208,141,-141.0
209,110,-110.0
210,111,-111.0
211,163,-163.0
212,92,-92.0
213,147,-147.0
214,93,-93.0
215,147,-147.0
216,124,-124.0
217,112,-112.0
218,130,-130.0
219,114,-114.0
220,164,-164.0
221,146,-146.0
222,163,-163.0
223,89,-89.0
224,144,-144.0
225,88,-88.0
226,141,-141.0
227,118,-118.0
228,153,-153.0
229,146,-146.0
230,141,-141.0
231,145,-145.0
232,138,-138.0
233,87,-87.0
234,96,-96.0
235,144,-144.0
236,149,-149.0
237,149,-149.0
238,111,-111.0
239,84,-84.0
240,102,-102.0
241,155,-155.0
242,110,-110.0
243,116,-116.0
244,86,-86.0
245,111,-111.0
246,163,-163.0
247,157,-157.0
248,130,-130.0
249,153,-153.0
250,109,-109.0
251,137,-137.0
252,88,-88.0
253,115,-115.0
254,151,-151.0
255,86,-86.0
256,107,-107.0
257,110,-110.0
258,161,-161.0
259,90,-90.0
260,147,-147.0
261,108,-108.0
262,112,-112.0
263,93,-93.0
264,109,-109.0
265,150,-150.0
266,107,-107.0
267,126,-126.0
268,109,-109.0
269,87,-87.0
270,107,-107.0
271,147,-147.0
272,190,-190.0
273,152,-152.0
274,178,-178.0
275,120,-120.0
276,159,-159.0
277,94,-94.0
278,96,-96.0
279,98,-98.0
280,106,-106.0
281,158,-158.0
282,96,-96.0
283,106,-106.0
284,106,-106.0
285,131,-131.0
286,143,-143.0
287,113,-113.0
288,162,-162.0
289,87,-87.0
290,128,-128.0
291,87,-87.0
292,149,-149.0
293,107,-107.0
294,92,-92.0
295,146,-146.0
296,113,-113.0
297,157,-157.0
298,105,-105.0
299,158,-158.0
300,83,-83.0
