episodes,steps,rewards
0,200,-200.0
1,200,-200.0
2,200,-200.0
3,200,-200.0
4,200,-200.0
5,200,-200.0
6,200,-200.0
7,200,-200.0
8,200,-200.0
9,200,-200.0
10,200,-200.0
11,200,-200.0
12,200,-200.0
13,200,-200.0
14,200,-200.0
15,200,-200.0
16,200,-200.0
17,200,-200.0
18,200,-200.0
19,200,-200.0
20,200,-200.0
21,200,-200.0
22,200,-200.0
23,200,-200.0
24,200,-200.0
25,200,-200.0
26,200,-200.0
27,200,-200.0
28,200,-200.0
29,200,-200.0
30,200,-200.0
31,200,-200.0
32,200,-200.0
33,200,-200.0
34,200,-200.0
35,200,-200.0
36,200,-200.0
37,200,-200.0
38,200,-200.0
39,200,-200.0
40,200,-200.0
41,200,-200.0
42,200,-200.0
43,200,-200.0
44,200,-200.0
45,200,-200.0
46,200,-200.0
47,200,-200.0
48,200,-200.0
49,200,-200.0
50,159,-159.0
51,181,-181.0
52,200,-200.0
53,200,-200.0
54,200,-200.0
55,200,-200.0
56,200,-200.0
57,200,-200.0
58,200,-200.0
59,200,-200.0
60,200,-200.0
61,200,-200.0
62,171,-171.0
63,200,-200.0
64,200,-200.0
65,200,-200.0
66,200,-200.0
67,200,-200.0
68,200,-200.0
69,200,-200.0
70,160,-160.0
71,200,-200.0
72,200,-200.0
73,115,-115.0
74,200,-200.0
75,200,-200.0
76,200,-200.0
77,200,-200.0
78,200,-200.0
79,200,-200.0
80,200,-200.0
81,200,-200.0
82,177,-177.0
83,200,-200.0
84,200,-200.0
85,200,-200.0
86,200,-200.0
87,200,-200.0
88,200,-200.0
89,200,-200.0
90,200,-200.0
91,200,-200.0
92,200,-200.0
93,200,-200.0
94,200,-200.0
95,200,-200.0
96,200,-200.0
97,169,-169.0
98,200,-200.0
99,200,-200.0
100,158,-158.0
101,148,-148.0
102,200,-200.0
103,200,-200.0
104,152,-152.0
105,200,-200.0
106,200,-200.0
107,200,-200.0
108,154,-154.0
109,162,-162.0
110,200,-200.0
111,153,-153.0
112,200,-200.0
113,183,-183.0
114,200,-200.0
115,200,-200.0
116,200,-200.0
117,200,-200.0
118,162,-162.0
119,156,-156.0
120,200,-200.0
121,200,-200.0
122,200,-200.0
123,200,-200.0
124,165,-165.0
125,167,-167.0
126,200,-200.0
127,168,-168.0
128,200,-200.0
129,188,-188.0
130,153,-153.0
131,161,-161.0
132,85,-85.0
133,135,-135.0
134,200,-200.0
135,110,-110.0
136,145,-145.0
137,168,-168.0
138,200,-200.0
139,145,-145.0
140,157,-157.0
141,150,-150.0
142,110,-110.0
143,164,-164.0
144,200,-200.0
145,170,-170.0
146,200,-200.0
147,200,-200.0
148,155,-155.0
149,200,-200.0
150,142,-142.0
151,173,-173.0
152,163,-163.0
153,136,-136.0
154,154,-154.0
155,152,-152.0
156,145,-145.0
157,170,-170.0
158,195,-195.0
159,144,-144.0
160,117,-117.0
161,153,-153.0
162,195,-195.0
163,149,-149.0
164,134,-134.0
165,179,-179.0
166,148,-148.0
167,150,-150.0
168,184,-184.0
169,166,-166.0
170,143,-143.0
171,159,-159.0
172,186,-186.0
173,194,-194.0
174,152,-152.0
175,173,-173.0
176,154,-154.0
177,182,-182.0
178,164,-164.0
179,155,-155.0
180,167,-167.0
181,143,-143.0
182,141,-141.0
183,111,-111.0
184,168,-168.0
185,126,-126.0
186,198,-198.0
187,200,-200.0
188,106,-106.0
189,183,-183.0
190,151,-151.0
191,162,-162.0
192,107,-107.0
193,99,-99.0
194,177,-177.0
195,137,-137.0
196,140,-140.0
197,150,-150.0
198,162,-162.0
199,92,-92.0
200,88,-88.0
201,200,-200.0
202,158,-158.0
203,110,-110.0
204,143,-143.0
205,131,-131.0
206,140,-140.0
207,147,-147.0
208,142,-142.0
209,169,-169.0
210,139,-139.0
211,154,-154.0
212,139,-139.0
213,126,-126.0
214,140,-140.0
215,178,-178.0
216,108,-108.0
217,130,-130.0
218,159,-159.0
219,146,-146.0
220,155,-155.0
221,136,-136.0
222,157,-157.0
223,134,-134.0
224,180,-180.0
225,200,-200.0
226,167,-167.0
227,166,-166.0
228,151,-151.0
229,170,-170.0
230,144,-144.0
231,128,-128.0
232,144,-144.0
233,169,-169.0
234,149,-149.0
235,89,-89.0
236,134,-134.0
237,138,-138.0
238,200,-200.0
239,110,-110.0
240,146,-146.0
241,152,-152.0
242,140,-140.0
243,138,-138.0
244,157,-157.0
245,139,-139.0
246,154,-154.0
247,116,-116.0
248,142,-142.0
249,135,-135.0
250,89,-89.0
251,140,-140.0
252,89,-89.0
253,84,-84.0
254,200,-200.0
255,110,-110.0
256,138,-138.0
257,124,-124.0
258,141,-141.0
259,97,-97.0
260,112,-112.0
261,116,-116.0
262,110,-110.0
263,119,-119.0
264,86,-86.0
265,137,-137.0
266,94,-94.0
267,176,-176.0
268,194,-194.0
269,135,-135.0
270,155,-155.0
271,130,-130.0
272,149,-149.0
273,127,-127.0
274,187,-187.0
275,110,-110.0
276,112,-112.0
277,113,-113.0
278,143,-143.0
279,155,-155.0
280,90,-90.0
281,131,-131.0
282,136,-136.0
283,86,-86.0
284,154,-154.0
285,129,-129.0
286,91,-91.0
287,157,-157.0
288,110,-110.0
289,137,-137.0
290,114,-114.0
291,156,-156.0
292,200,-200.0
293,99,-99.0
294,113,-113.0
295,92,-92.0
296,148,-148.0
297,84,-84.0
298,114,-114.0
299,110,-110.0
300,90,-90.0
301,85,-85.0
302,108,-108.0
303,167,-167.0
304,111,-111.0
305,107,-107.0
306,85,-85.0
307,127,-127.0
308,107,-107.0
309,109,-109.0
310,91,-91.0
311,107,-107.0
312,164,-164.0
313,92,-92.0
314,149,-149.0
315,109,-109.0
316,110,-110.0
317,157,-157.0
318,168,-168.0
319,110,-110.0
320,159,-159.0
321,107,-107.0
322,148,-148.0
323,106,-106.0
324,114,-114.0
325,110,-110.0
326,106,-106.0
327,93,-93.0
328,90,-90.0
329,146,-146.0
330,105,-105.0
331,195,-195.0
332,105,-105.0
333,152,-152.0
334,152,-152.0
335,105,-105.0
336,90,-90.0
337,115,-115.0
338,107,-107.0
339,95,-95.0
340,92,-92.0
341,166,-166.0
342,122,-122.0
343,200,-200.0
344,95,-95.0
345,164,-164.0
346,147,-147.0
347,138,-138.0
348,137,-137.0
349,105,-105.0
350,166,-166.0
