episodes,steps,rewards
0,200,-200.0
1,200,-200.0
2,200,-200.0
3,200,-200.0
4,200,-200.0
5,200,-200.0
6,200,-200.0
7,200,-200.0
8,186,-186.0
9,200,-200.0
10,200,-200.0
11,200,-200.0
12,200,-200.0
13,200,-200.0
14,200,-200.0
15,200,-200.0
16,200,-200.0
17,200,-200.0
18,200,-200.0
19,200,-200.0
20,200,-200.0
21,200,-200.0
22,200,-200.0
23,200,-200.0
24,200,-200.0
25,200,-200.0
26,200,-200.0
27,200,-200.0
28,200,-200.0
29,200,-200.0
30,200,-200.0
31,200,-200.0
32,200,-200.0
33,200,-200.0
34,200,-200.0
35,200,-200.0
36,200,-200.0
37,200,-200.0
38,200,-200.0
39,200,-200.0
40,200,-200.0
41,200,-200.0
42,200,-200.0
43,200,-200.0
44,200,-200.0
45,200,-200.0
46,200,-200.0
47,200,-200.0
48,200,-200.0
49,200,-200.0
50,197,-197.0
51,200,-200.0
52,200,-200.0
53,200,-200.0
54,200,-200.0
55,113,-113.0
56,200,-200.0
57,200,-200.0
58,200,-200.0
59,200,-200.0
60,200,-200.0
61,200,-200.0
62,200,-200.0
63,200,-200.0
64,200,-200.0
65,200,-200.0
66,200,-200.0
67,200,-200.0
68,200,-200.0
69,200,-200.0
70,200,-200.0
71,200,-200.0
72,200,-200.0
73,200,-200.0
74,200,-200.0
75,200,-200.0
76,170,-170.0
77,200,-200.0
78,200,-200.0
79,200,-200.0
80,200,-200.0
81,200,-200.0
82,152,-152.0
83,149,-149.0
84,156,-156.0
85,200,-200.0
86,200,-200.0
87,200,-200.0
88,171,-171.0
89,200,-200.0
90,168,-168.0
91,186,-186.0
92,200,-200.0
93,200,-200.0
94,200,-200.0
95,200,-200.0
96,200,-200.0
97,200,-200.0
98,152,-152.0
99,200,-200.0
100,200,-200.0
101,200,-200.0
102,200,-200.0
103,200,-200.0
104,193,-193.0
105,200,-200.0
106,200,-200.0
107,200,-200.0
108,200,-200.0
109,112,-112.0
110,200,-200.0
111,174,-174.0
112,131,-131.0
113,163,-163.0
114,167,-167.0
115,188,-188.0
116,167,-167.0
117,168,-168.0
118,200,-200.0
119,114,-114.0
120,118,-118.0
121,200,-200.0
122,198,-198.0
123,200,-200.0
124,95,-95.0
125,200,-200.0
126,200,-200.0
127,165,-165.0
128,189,-189.0
129,182,-182.0
130,200,-200.0
131,105,-105.0
132,196,-196.0
133,140,-140.0
134,200,-200.0
135,186,-186.0
136,145,-145.0
137,200,-200.0
138,90,-90.0
139,200,-200.0
140,159,-159.0
141,200,-200.0
142,152,-152.0
143,143,-143.0
144,192,-192.0
145,200,-200.0
146,148,-148.0
147,200,-200.0
148,172,-172.0
149,200,-200.0
150,156,-156.0
151,200,-200.0
152,155,-155.0
153,200,-200.0
154,200,-200.0
155,174,-174.0
156,200,-200.0
157,179,-179.0
158,200,-200.0
159,137,-137.0
160,114,-114.0
161,200,-200.0
162,175,-175.0
163,200,-200.0
164,139,-139.0
165,88,-88.0
166,152,-152.0
167,157,-157.0
168,178,-178.0
169,200,-200.0
170,200,-200.0
171,130,-130.0
172,135,-135.0
173,97,-97.0
174,150,-150.0
175,171,-171.0
176,157,-157.0
177,157,-157.0
178,200,-200.0
179,91,-91.0
180,145,-145.0
181,108,-108.0
182,200,-200.0
183,200,-200.0
184,90,-90.0
185,154,-154.0
186,170,-170.0
187,200,-200.0
188,152,-152.0
189,90,-90.0
190,101,-101.0
191,110,-110.0
192,157,-157.0
193,146,-146.0
194,87,-87.0
195,88,-88.0
196,162,-162.0
197,147,-147.0
198,137,-137.0
199,150,-150.0
200,89,-89.0
201,173,-173.0
202,140,-140.0
203,148,-148.0
204,95,-95.0
205,159,-159.0
206,171,-171.0
207,87,-87.0
208,93,-93.0
209,92,-92.0
210,143,-143.0
211,159,-159.0
212,200,-200.0
213,200,-200.0
214,85,-85.0
215,133,-133.0
216,153,-153.0
217,143,-143.0
218,89,-89.0
219,154,-154.0
220,105,-105.0
221,150,-150.0
222,149,-149.0
223,153,-153.0
224,86,-86.0
225,144,-144.0
226,147,-147.0
227,142,-142.0
228,138,-138.0
229,164,-164.0
230,173,-173.0
231,131,-131.0
232,93,-93.0
233,149,-149.0
234,119,-119.0
235,88,-88.0
236,200,-200.0
237,149,-149.0
238,88,-88.0
239,94,-94.0
240,94,-94.0
241,111,-111.0
242,133,-133.0
243,84,-84.0
244,156,-156.0
245,95,-95.0
246,152,-152.0
247,149,-149.0
248,200,-200.0
249,85,-85.0
250,143,-143.0
251,95,-95.0
252,159,-159.0
253,129,-129.0
254,85,-85.0
255,146,-146.0
256,143,-143.0
257,146,-146.0
258,106,-106.0
259,149,-149.0
260,141,-141.0
261,150,-150.0
262,132,-132.0
263,145,-145.0
264,92,-92.0
265,145,-145.0
266,98,-98.0
267,145,-145.0
268,148,-148.0
269,178,-178.0
270,135,-135.0
271,151,-151.0
272,147,-147.0
273,143,-143.0
274,109,-109.0
275,104,-104.0
276,148,-148.0
277,136,-136.0
278,143,-143.0
279,147,-147.0
280,92,-92.0
281,156,-156.0
282,145,-145.0
283,137,-137.0
284,90,-90.0
285,152,-152.0
286,90,-90.0
287,146,-146.0
288,99,-99.0
289,87,-87.0
290,85,-85.0
291,133,-133.0
292,87,-87.0
293,140,-140.0
294,93,-93.0
295,136,-136.0
296,147,-147.0
297,85,-85.0
298,134,-134.0
299,85,-85.0
300,143,-143.0
301,153,-153.0
302,151,-151.0
303,147,-147.0
304,142,-142.0
305,147,-147.0
306,147,-147.0
307,142,-142.0
308,87,-87.0
309,99,-99.0
310,149,-149.0
311,149,-149.0
312,150,-150.0
313,148,-148.0
314,144,-144.0
315,137,-137.0
316,141,-141.0
317,146,-146.0
318,155,-155.0
319,152,-152.0
320,148,-148.0
321,160,-160.0
322,139,-139.0
323,138,-138.0
324,200,-200.0
325,142,-142.0
326,87,-87.0
327,139,-139.0
328,151,-151.0
329,148,-148.0
330,147,-147.0
331,152,-152.0
332,164,-164.0
333,146,-146.0
334,108,-108.0
335,200,-200.0
336,152,-152.0
337,128,-128.0
338,86,-86.0
339,101,-101.0
340,156,-156.0
341,163,-163.0
342,94,-94.0
343,153,-153.0
344,159,-159.0
345,146,-146.0
346,156,-156.0
347,157,-157.0
348,151,-151.0
349,148,-148.0
350,200,-200.0
351,200,-200.0
352,147,-147.0
353,89,-89.0
354,143,-143.0
355,148,-148.0
356,145,-145.0
357,152,-152.0
358,87,-87.0
359,142,-142.0
360,147,-147.0
361,149,-149.0
362,153,-153.0
363,94,-94.0
364,200,-200.0
365,139,-139.0
366,149,-149.0
367,200,-200.0
368,154,-154.0
369,157,-157.0
370,141,-141.0
371,200,-200.0
372,156,-156.0
373,148,-148.0
374,149,-149.0
375,152,-152.0
376,149,-149.0
377,165,-165.0
378,152,-152.0
379,161,-161.0
380,146,-146.0
381,98,-98.0
382,146,-146.0
383,83,-83.0
384,155,-155.0
385,144,-144.0
386,157,-157.0
387,101,-101.0
388,92,-92.0
389,148,-148.0
390,163,-163.0
391,193,-193.0
392,86,-86.0
393,148,-148.0
394,151,-151.0
395,107,-107.0
396,153,-153.0
397,111,-111.0
398,144,-144.0
399,200,-200.0
400,154,-154.0
401,200,-200.0
402,200,-200.0
403,178,-178.0
404,149,-149.0
405,151,-151.0
406,94,-94.0
407,158,-158.0
408,158,-158.0
409,89,-89.0
410,163,-163.0
411,88,-88.0
412,200,-200.0
413,105,-105.0
414,142,-142.0
415,159,-159.0
416,94,-94.0
417,164,-164.0
418,150,-150.0
419,87,-87.0
420,145,-145.0
421,148,-148.0
422,99,-99.0
423,90,-90.0
424,89,-89.0
425,92,-92.0
426,159,-159.0
427,152,-152.0
428,87,-87.0
429,90,-90.0
430,100,-100.0
431,200,-200.0
432,155,-155.0
433,200,-200.0
434,152,-152.0
435,151,-151.0
436,85,-85.0
437,200,-200.0
438,200,-200.0
439,153,-153.0
440,152,-152.0
441,157,-157.0
442,92,-92.0
443,97,-97.0
444,200,-200.0
445,200,-200.0
446,92,-92.0
447,200,-200.0
448,89,-89.0
449,200,-200.0
450,159,-159.0
451,157,-157.0
452,200,-200.0
453,200,-200.0
454,101,-101.0
455,200,-200.0
456,189,-189.0
457,89,-89.0
458,157,-157.0
459,200,-200.0
460,158,-158.0
461,200,-200.0
462,158,-158.0
463,157,-157.0
464,200,-200.0
465,200,-200.0
466,90,-90.0
467,200,-200.0
468,92,-92.0
469,155,-155.0
470,149,-149.0
471,200,-200.0
472,159,-159.0
473,146,-146.0
474,200,-200.0
475,152,-152.0
476,168,-168.0
477,154,-154.0
478,129,-129.0
479,97,-97.0
480,161,-161.0
481,152,-152.0
482,200,-200.0
483,150,-150.0
484,146,-146.0
485,154,-154.0
486,175,-175.0
487,95,-95.0
488,147,-147.0
489,163,-163.0
490,160,-160.0
491,111,-111.0
492,84,-84.0
493,143,-143.0
494,147,-147.0
495,160,-160.0
496,200,-200.0
497,200,-200.0
498,170,-170.0
499,200,-200.0
500,152,-152.0
501,149,-149.0
502,153,-153.0
503,200,-200.0
504,145,-145.0
505,200,-200.0
506,90,-90.0
507,85,-85.0
508,146,-146.0
509,200,-200.0
510,94,-94.0
511,164,-164.0
512,200,-200.0
513,193,-193.0
514,182,-182.0
515,166,-166.0
516,155,-155.0
517,200,-200.0
518,150,-150.0
519,153,-153.0
520,200,-200.0
521,144,-144.0
522,143,-143.0
523,84,-84.0
524,154,-154.0
525,200,-200.0
526,158,-158.0
527,167,-167.0
528,200,-200.0
529,84,-84.0
530,101,-101.0
531,90,-90.0
532,84,-84.0
533,152,-152.0
534,136,-136.0
535,143,-143.0
536,176,-176.0
537,86,-86.0
538,97,-97.0
539,146,-146.0
540,86,-86.0
541,159,-159.0
542,98,-98.0
543,200,-200.0
544,160,-160.0
545,157,-157.0
546,146,-146.0
547,146,-146.0
548,86,-86.0
549,200,-200.0
550,152,-152.0
551,200,-200.0
552,148,-148.0
553,154,-154.0
554,174,-174.0
555,86,-86.0
556,177,-177.0
557,156,-156.0
558,200,-200.0
559,181,-181.0
560,100,-100.0
561,150,-150.0
562,156,-156.0
563,200,-200.0
564,153,-153.0
565,85,-85.0
566,200,-200.0
567,108,-108.0
568,151,-151.0
569,151,-151.0
570,145,-145.0
571,180,-180.0
572,199,-199.0
573,200,-200.0
574,93,-93.0
575,90,-90.0
576,87,-87.0
577,145,-145.0
578,184,-184.0
579,87,-87.0
580,149,-149.0
581,88,-88.0
582,163,-163.0
583,200,-200.0
584,200,-200.0
585,200,-200.0
586,137,-137.0
587,200,-200.0
588,87,-87.0
589,145,-145.0
590,200,-200.0
591,149,-149.0
592,200,-200.0
593,153,-153.0
594,87,-87.0
595,200,-200.0
596,96,-96.0
597,95,-95.0
598,96,-96.0
599,149,-149.0
600,150,-150.0
601,86,-86.0
602,154,-154.0
603,150,-150.0
604,87,-87.0
605,157,-157.0
606,150,-150.0
607,156,-156.0
608,151,-151.0
609,85,-85.0
610,153,-153.0
611,144,-144.0
612,146,-146.0
613,149,-149.0
614,149,-149.0
615,156,-156.0
616,94,-94.0
617,159,-159.0
618,157,-157.0
619,158,-158.0
620,151,-151.0
621,101,-101.0
622,151,-151.0
623,156,-156.0
624,200,-200.0
625,94,-94.0
626,151,-151.0
627,87,-87.0
628,154,-154.0
629,91,-91.0
630,200,-200.0
631,200,-200.0
632,166,-166.0
633,168,-168.0
634,85,-85.0
635,163,-163.0
636,157,-157.0
637,107,-107.0
638,163,-163.0
639,162,-162.0
640,200,-200.0
641,158,-158.0
642,164,-164.0
643,170,-170.0
644,87,-87.0
645,158,-158.0
646,148,-148.0
647,173,-173.0
648,158,-158.0
649,188,-188.0
650,95,-95.0
651,200,-200.0
652,148,-148.0
653,155,-155.0
654,157,-157.0
655,115,-115.0
656,153,-153.0
657,131,-131.0
658,153,-153.0
659,96,-96.0
660,90,-90.0
661,139,-139.0
662,153,-153.0
663,101,-101.0
664,184,-184.0
665,152,-152.0
666,105,-105.0
667,170,-170.0
668,160,-160.0
669,89,-89.0
670,149,-149.0
671,156,-156.0
672,158,-158.0
673,200,-200.0
674,151,-151.0
675,135,-135.0
676,154,-154.0
677,111,-111.0
678,155,-155.0
679,143,-143.0
680,149,-149.0
681,88,-88.0
682,200,-200.0
683,89,-89.0
684,160,-160.0
685,200,-200.0
686,88,-88.0
687,159,-159.0
688,98,-98.0
689,91,-91.0
690,85,-85.0
691,93,-93.0
692,92,-92.0
693,92,-92.0
694,155,-155.0
695,93,-93.0
696,159,-159.0
697,83,-83.0
698,94,-94.0
699,160,-160.0
700,189,-189.0
701,170,-170.0
702,93,-93.0
703,152,-152.0
704,161,-161.0
705,175,-175.0
706,154,-154.0
707,90,-90.0
708,86,-86.0
709,165,-165.0
710,153,-153.0
711,153,-153.0
712,164,-164.0
713,89,-89.0
714,159,-159.0
715,159,-159.0
716,157,-157.0
717,85,-85.0
718,171,-171.0
719,162,-162.0
720,93,-93.0
721,168,-168.0
722,162,-162.0
723,164,-164.0
724,200,-200.0
725,95,-95.0
726,161,-161.0
727,156,-156.0
728,162,-162.0
729,167,-167.0
730,150,-150.0
731,152,-152.0
732,151,-151.0
733,147,-147.0
734,196,-196.0
735,165,-165.0
736,155,-155.0
737,93,-93.0
738,157,-157.0
739,189,-189.0
740,157,-157.0
741,115,-115.0
742,92,-92.0
743,92,-92.0
744,200,-200.0
745,157,-157.0
746,155,-155.0
747,92,-92.0
748,149,-149.0
749,147,-147.0
750,143,-143.0
751,164,-164.0
752,91,-91.0
753,162,-162.0
754,151,-151.0
755,88,-88.0
756,83,-83.0
757,200,-200.0
758,105,-105.0
759,95,-95.0
760,200,-200.0
761,130,-130.0
762,89,-89.0
763,158,-158.0
764,123,-123.0
765,200,-200.0
766,87,-87.0
767,99,-99.0
768,152,-152.0
769,98,-98.0
770,161,-161.0
771,154,-154.0
772,154,-154.0
773,162,-162.0
774,158,-158.0
775,165,-165.0
776,160,-160.0
777,106,-106.0
778,152,-152.0
779,152,-152.0
780,155,-155.0
781,200,-200.0
782,148,-148.0
783,153,-153.0
784,161,-161.0
785,151,-151.0
786,96,-96.0
787,150,-150.0
788,149,-149.0
789,89,-89.0
790,89,-89.0
791,147,-147.0
792,149,-149.0
793,148,-148.0
794,146,-146.0
795,148,-148.0
796,139,-139.0
797,163,-163.0
798,91,-91.0
799,99,-99.0
800,200,-200.0
801,200,-200.0
802,98,-98.0
803,171,-171.0
804,200,-200.0
805,162,-162.0
806,172,-172.0
807,167,-167.0
808,146,-146.0
809,144,-144.0
810,139,-139.0
811,100,-100.0
812,152,-152.0
813,157,-157.0
814,89,-89.0
815,152,-152.0
816,165,-165.0
817,107,-107.0
818,85,-85.0
819,157,-157.0
820,89,-89.0
821,143,-143.0
822,147,-147.0
823,142,-142.0
824,96,-96.0
825,118,-118.0
826,155,-155.0
827,154,-154.0
828,161,-161.0
829,140,-140.0
830,139,-139.0
831,149,-149.0
832,144,-144.0
833,146,-146.0
834,148,-148.0
835,151,-151.0
836,152,-152.0
837,170,-170.0
838,91,-91.0
839,85,-85.0
840,165,-165.0
841,148,-148.0
842,182,-182.0
843,158,-158.0
844,200,-200.0
845,156,-156.0
846,155,-155.0
847,112,-112.0
848,200,-200.0
849,149,-149.0
850,200,-200.0
851,144,-144.0
852,154,-154.0
853,150,-150.0
854,146,-146.0
855,158,-158.0
856,152,-152.0
857,157,-157.0
858,152,-152.0
859,148,-148.0
860,140,-140.0
861,144,-144.0
862,153,-153.0
863,158,-158.0
864,143,-143.0
865,147,-147.0
866,146,-146.0
867,144,-144.0
868,113,-113.0
869,142,-142.0
870,153,-153.0
871,106,-106.0
872,99,-99.0
873,142,-142.0
874,149,-149.0
875,151,-151.0
876,139,-139.0
877,148,-148.0
878,90,-90.0
879,148,-148.0
880,153,-153.0
881,149,-149.0
882,141,-141.0
883,155,-155.0
884,160,-160.0
885,150,-150.0
886,98,-98.0
887,163,-163.0
888,99,-99.0
889,200,-200.0
890,99,-99.0
891,142,-142.0
892,143,-143.0
893,139,-139.0
894,149,-149.0
895,147,-147.0
896,89,-89.0
897,149,-149.0
898,165,-165.0
899,154,-154.0
900,172,-172.0
901,138,-138.0
902,90,-90.0
903,155,-155.0
904,172,-172.0
905,169,-169.0
906,159,-159.0
907,200,-200.0
908,131,-131.0
909,155,-155.0
910,163,-163.0
911,97,-97.0
912,94,-94.0
913,88,-88.0
914,151,-151.0
915,160,-160.0
916,151,-151.0
917,164,-164.0
918,161,-161.0
919,92,-92.0
920,144,-144.0
921,156,-156.0
922,165,-165.0
923,154,-154.0
924,137,-137.0
925,157,-157.0
926,168,-168.0
927,151,-151.0
928,164,-164.0
929,161,-161.0
930,153,-153.0
931,158,-158.0
932,150,-150.0
933,153,-153.0
934,151,-151.0
935,200,-200.0
936,155,-155.0
937,93,-93.0
938,169,-169.0
939,90,-90.0
940,200,-200.0
941,140,-140.0
942,152,-152.0
943,92,-92.0
944,160,-160.0
945,94,-94.0
946,152,-152.0
947,116,-116.0
948,150,-150.0
949,86,-86.0
950,152,-152.0
951,86,-86.0
952,149,-149.0
953,85,-85.0
954,88,-88.0
955,92,-92.0
956,187,-187.0
957,140,-140.0
958,148,-148.0
959,144,-144.0
960,143,-143.0
961,143,-143.0
962,140,-140.0
963,91,-91.0
964,156,-156.0
965,134,-134.0
966,160,-160.0
967,154,-154.0
968,176,-176.0
969,165,-165.0
970,99,-99.0
971,90,-90.0
972,151,-151.0
973,166,-166.0
974,89,-89.0
975,181,-181.0
976,86,-86.0
977,130,-130.0
978,167,-167.0
979,106,-106.0
980,90,-90.0
981,89,-89.0
982,136,-136.0
983,84,-84.0
984,88,-88.0
985,152,-152.0
986,94,-94.0
987,147,-147.0
988,142,-142.0
989,173,-173.0
990,143,-143.0
991,97,-97.0
992,155,-155.0
993,89,-89.0
994,171,-171.0
995,104,-104.0
996,151,-151.0
997,156,-156.0
998,149,-149.0
999,172,-172.0
1000,88,-88.0
1001,152,-152.0
1002,127,-127.0
1003,137,-137.0
1004,150,-150.0
1005,101,-101.0
1006,151,-151.0
1007,151,-151.0
1008,148,-148.0
1009,144,-144.0
1010,97,-97.0
1011,104,-104.0
1012,147,-147.0
1013,156,-156.0
1014,174,-174.0
1015,145,-145.0
1016,190,-190.0
1017,148,-148.0
1018,139,-139.0
1019,139,-139.0
1020,141,-141.0
1021,144,-144.0
1022,145,-145.0
1023,142,-142.0
1024,145,-145.0
1025,96,-96.0
1026,139,-139.0
1027,94,-94.0
1028,200,-200.0
1029,137,-137.0
1030,153,-153.0
1031,148,-148.0
1032,92,-92.0
1033,187,-187.0
1034,165,-165.0
1035,173,-173.0
1036,200,-200.0
1037,148,-148.0
1038,112,-112.0
1039,134,-134.0
1040,200,-200.0
1041,147,-147.0
1042,146,-146.0
1043,160,-160.0
1044,100,-100.0
1045,137,-137.0
1046,200,-200.0
1047,135,-135.0
1048,87,-87.0
1049,103,-103.0
1050,165,-165.0
1051,200,-200.0
1052,86,-86.0
1053,182,-182.0
1054,143,-143.0
1055,110,-110.0
1056,132,-132.0
1057,130,-130.0
1058,97,-97.0
1059,141,-141.0
1060,140,-140.0
1061,159,-159.0
1062,200,-200.0
1063,136,-136.0
1064,111,-111.0
1065,200,-200.0
1066,87,-87.0
1067,93,-93.0
1068,92,-92.0
1069,87,-87.0
1070,147,-147.0
1071,130,-130.0
1072,149,-149.0
1073,149,-149.0
1074,137,-137.0
1075,143,-143.0
1076,148,-148.0
1077,140,-140.0
1078,154,-154.0
1079,157,-157.0
1080,152,-152.0
1081,93,-93.0
1082,171,-171.0
1083,150,-150.0
1084,104,-104.0
1085,147,-147.0
1086,195,-195.0
1087,141,-141.0
1088,196,-196.0
1089,153,-153.0
1090,88,-88.0
1091,151,-151.0
1092,85,-85.0
1093,147,-147.0
1094,93,-93.0
1095,146,-146.0
1096,161,-161.0
1097,86,-86.0
1098,199,-199.0
1099,145,-145.0
1100,84,-84.0
1101,150,-150.0
1102,150,-150.0
1103,103,-103.0
1104,147,-147.0
1105,143,-143.0
1106,140,-140.0
1107,97,-97.0
1108,83,-83.0
1109,95,-95.0
1110,90,-90.0
1111,101,-101.0
1112,150,-150.0
1113,141,-141.0
1114,148,-148.0
1115,147,-147.0
1116,149,-149.0
1117,112,-112.0
1118,168,-168.0
1119,164,-164.0
1120,89,-89.0
1121,140,-140.0
1122,115,-115.0
1123,91,-91.0
1124,90,-90.0
1125,200,-200.0
1126,147,-147.0
1127,146,-146.0
1128,200,-200.0
1129,167,-167.0
1130,88,-88.0
1131,153,-153.0
1132,135,-135.0
1133,96,-96.0
1134,146,-146.0
1135,200,-200.0
1136,157,-157.0
1137,144,-144.0
1138,96,-96.0
1139,147,-147.0
1140,145,-145.0
1141,135,-135.0
1142,86,-86.0
1143,98,-98.0
1144,93,-93.0
1145,87,-87.0
1146,153,-153.0
1147,145,-145.0
1148,143,-143.0
1149,143,-143.0
1150,154,-154.0
1151,138,-138.0
1152,144,-144.0
1153,147,-147.0
1154,153,-153.0
1155,169,-169.0
1156,162,-162.0
1157,90,-90.0
1158,95,-95.0
1159,85,-85.0
1160,98,-98.0
1161,162,-162.0
1162,159,-159.0
1163,103,-103.0
1164,145,-145.0
1165,153,-153.0
1166,143,-143.0
1167,88,-88.0
1168,161,-161.0
1169,85,-85.0
1170,93,-93.0
1171,145,-145.0
1172,153,-153.0
1173,84,-84.0
1174,160,-160.0
1175,148,-148.0
1176,144,-144.0
1177,143,-143.0
1178,120,-120.0
1179,169,-169.0
1180,150,-150.0
1181,150,-150.0
1182,170,-170.0
1183,145,-145.0
1184,162,-162.0
1185,83,-83.0
1186,97,-97.0
1187,91,-91.0
1188,140,-140.0
1189,158,-158.0
1190,100,-100.0
1191,147,-147.0
1192,136,-136.0
1193,178,-178.0
1194,92,-92.0
1195,131,-131.0
1196,141,-141.0
1197,87,-87.0
1198,167,-167.0
1199,142,-142.0
1200,155,-155.0
1201,161,-161.0
1202,86,-86.0
1203,93,-93.0
1204,166,-166.0
1205,90,-90.0
1206,89,-89.0
1207,148,-148.0
1208,94,-94.0
1209,170,-170.0
1210,147,-147.0
1211,91,-91.0
1212,136,-136.0
1213,149,-149.0
1214,145,-145.0
1215,86,-86.0
1216,150,-150.0
1217,152,-152.0
1218,140,-140.0
1219,200,-200.0
1220,146,-146.0
1221,144,-144.0
1222,95,-95.0
1223,141,-141.0
1224,130,-130.0
1225,135,-135.0
1226,142,-142.0
1227,140,-140.0
1228,142,-142.0
1229,157,-157.0
1230,196,-196.0
1231,84,-84.0
1232,107,-107.0
1233,157,-157.0
1234,144,-144.0
1235,109,-109.0
1236,147,-147.0
1237,91,-91.0
1238,90,-90.0
1239,103,-103.0
1240,113,-113.0
1241,92,-92.0
1242,125,-125.0
1243,100,-100.0
1244,92,-92.0
1245,159,-159.0
1246,146,-146.0
1247,88,-88.0
1248,108,-108.0
1249,111,-111.0
1250,101,-101.0
1251,122,-122.0
1252,91,-91.0
1253,151,-151.0
1254,88,-88.0
1255,92,-92.0
1256,85,-85.0
1257,106,-106.0
1258,165,-165.0
1259,141,-141.0
1260,110,-110.0
1261,149,-149.0
1262,115,-115.0
1263,92,-92.0
1264,99,-99.0
1265,159,-159.0
1266,88,-88.0
1267,195,-195.0
1268,156,-156.0
1269,87,-87.0
1270,85,-85.0
1271,98,-98.0
1272,143,-143.0
1273,100,-100.0
1274,149,-149.0
1275,87,-87.0
1276,165,-165.0
1277,135,-135.0
1278,168,-168.0
1279,144,-144.0
1280,149,-149.0
1281,130,-130.0
1282,89,-89.0
1283,146,-146.0
1284,179,-179.0
1285,154,-154.0
1286,179,-179.0
1287,88,-88.0
1288,152,-152.0
1289,106,-106.0
1290,102,-102.0
1291,157,-157.0
1292,142,-142.0
1293,155,-155.0
1294,161,-161.0
1295,85,-85.0
1296,175,-175.0
1297,165,-165.0
1298,150,-150.0
1299,139,-139.0
1300,93,-93.0
1301,138,-138.0
1302,141,-141.0
1303,153,-153.0
1304,160,-160.0
1305,120,-120.0
1306,112,-112.0
1307,150,-150.0
1308,98,-98.0
1309,101,-101.0
1310,135,-135.0
1311,139,-139.0
1312,138,-138.0
1313,200,-200.0
1314,160,-160.0
1315,88,-88.0
1316,115,-115.0
1317,156,-156.0
1318,160,-160.0
1319,163,-163.0
1320,177,-177.0
1321,147,-147.0
1322,115,-115.0
1323,112,-112.0
1324,115,-115.0
1325,92,-92.0
1326,107,-107.0
1327,108,-108.0
1328,158,-158.0
1329,117,-117.0
1330,91,-91.0
1331,92,-92.0
1332,87,-87.0
1333,117,-117.0
1334,119,-119.0
1335,90,-90.0
1336,88,-88.0
1337,107,-107.0
1338,92,-92.0
1339,111,-111.0
1340,175,-175.0
1341,104,-104.0
1342,113,-113.0
1343,122,-122.0
1344,114,-114.0
1345,190,-190.0
1346,112,-112.0
1347,86,-86.0
1348,85,-85.0
1349,104,-104.0
1350,99,-99.0
1351,194,-194.0
1352,163,-163.0
1353,105,-105.0
1354,105,-105.0
1355,93,-93.0
1356,106,-106.0
1357,89,-89.0
1358,104,-104.0
1359,130,-130.0
1360,107,-107.0
1361,89,-89.0
1362,141,-141.0
1363,144,-144.0
1364,112,-112.0
1365,112,-112.0
1366,110,-110.0
1367,140,-140.0
1368,106,-106.0
1369,109,-109.0
1370,103,-103.0
1371,106,-106.0
1372,92,-92.0
1373,106,-106.0
1374,138,-138.0
1375,108,-108.0
1376,89,-89.0
1377,140,-140.0
1378,137,-137.0
1379,167,-167.0
1380,105,-105.0
1381,104,-104.0
1382,105,-105.0
1383,160,-160.0
1384,152,-152.0
1385,174,-174.0
1386,85,-85.0
1387,106,-106.0
1388,106,-106.0
1389,85,-85.0
1390,105,-105.0
1391,104,-104.0
1392,83,-83.0
1393,168,-168.0
1394,106,-106.0
1395,119,-119.0
1396,99,-99.0
1397,102,-102.0
1398,90,-90.0
1399,102,-102.0
1400,103,-103.0
1401,102,-102.0
1402,112,-112.0
1403,83,-83.0
1404,112,-112.0
1405,107,-107.0
1406,105,-105.0
1407,106,-106.0
1408,107,-107.0
1409,105,-105.0
1410,102,-102.0
1411,105,-105.0
1412,149,-149.0
1413,86,-86.0
1414,107,-107.0
1415,103,-103.0
1416,108,-108.0
1417,106,-106.0
1418,104,-104.0
1419,84,-84.0
1420,105,-105.0
1421,109,-109.0
1422,85,-85.0
1423,110,-110.0
1424,105,-105.0
1425,111,-111.0
1426,151,-151.0
1427,167,-167.0
1428,108,-108.0
1429,107,-107.0
1430,107,-107.0
1431,167,-167.0
1432,108,-108.0
1433,103,-103.0
1434,109,-109.0
1435,107,-107.0
1436,85,-85.0
1437,156,-156.0
1438,167,-167.0
1439,103,-103.0
1440,84,-84.0
1441,104,-104.0
1442,96,-96.0
1443,107,-107.0
1444,105,-105.0
1445,111,-111.0
1446,108,-108.0
1447,200,-200.0
1448,108,-108.0
1449,105,-105.0
1450,99,-99.0
1451,109,-109.0
1452,135,-135.0
1453,110,-110.0
1454,143,-143.0
1455,111,-111.0
1456,105,-105.0
1457,171,-171.0
1458,179,-179.0
1459,112,-112.0
1460,140,-140.0
1461,143,-143.0
1462,139,-139.0
1463,141,-141.0
1464,143,-143.0
1465,150,-150.0
1466,141,-141.0
1467,144,-144.0
1468,144,-144.0
1469,108,-108.0
1470,105,-105.0
1471,106,-106.0
1472,94,-94.0
1473,140,-140.0
1474,139,-139.0
1475,92,-92.0
1476,145,-145.0
1477,89,-89.0
1478,108,-108.0
1479,103,-103.0
1480,106,-106.0
1481,107,-107.0
1482,104,-104.0
1483,88,-88.0
1484,104,-104.0
1485,92,-92.0
1486,86,-86.0
1487,106,-106.0
1488,100,-100.0
1489,108,-108.0
1490,142,-142.0
1491,148,-148.0
1492,159,-159.0
1493,152,-152.0
1494,86,-86.0
1495,104,-104.0
1496,157,-157.0
1497,147,-147.0
1498,107,-107.0
1499,159,-159.0
1500,88,-88.0
1501,107,-107.0
1502,84,-84.0
1503,88,-88.0
1504,90,-90.0
1505,88,-88.0
1506,106,-106.0
1507,93,-93.0
1508,108,-108.0
1509,111,-111.0
1510,106,-106.0
1511,105,-105.0
1512,105,-105.0
1513,109,-109.0
1514,110,-110.0
1515,164,-164.0
1516,120,-120.0
1517,107,-107.0
1518,104,-104.0
1519,103,-103.0
1520,129,-129.0
1521,85,-85.0
1522,105,-105.0
1523,200,-200.0
1524,104,-104.0
1525,104,-104.0
1526,153,-153.0
1527,85,-85.0
1528,117,-117.0
1529,88,-88.0
1530,103,-103.0
1531,101,-101.0
1532,104,-104.0
1533,103,-103.0
1534,106,-106.0
1535,105,-105.0
1536,152,-152.0
1537,200,-200.0
1538,93,-93.0
1539,105,-105.0
1540,177,-177.0
1541,87,-87.0
1542,109,-109.0
1543,108,-108.0
1544,106,-106.0
1545,103,-103.0
1546,110,-110.0
1547,106,-106.0
1548,119,-119.0
1549,108,-108.0
1550,92,-92.0
