episodes,steps,rewards
0,94,-134.99061716654643
1,97,-151.70339814731062
2,107,-193.45118107219272
3,84,-163.026152200674
4,127,-300.3191154216506
5,149,19.57872512832155
6,151,-69.63253058649269
7,171,-333.66812211376407
8,78,-468.070097857029
9,630,-438.6225081688797
10,1000,-109.10434469252833
11,1000,-93.31791990452416
12,796,-295.5813934961668
13,1000,-105.76166407715446
14,1000,-93.28085029973238
15,1000,-73.69550485712304
16,1000,-58.61303844615631
17,1000,-47.6142487200368
18,518,189.6957546986293
19,408,-169.30085584114858
20,292,-152.30073570301334
21,329,28.808009162522637
22,749,-71.90214127967185
23,70,-160.78742073194044
24,1000,6.240445200841129
25,495,-138.78004045905888
26,1000,-5.1197006560097025
27,1000,-2.82594810796606
28,1000,-68.97140049218918
29,329,-511.0171482511373
30,1000,-16.050861952219527
31,1000,-40.43886164179263
32,1000,-74.8915091646127
33,987,-255.87034615702675
34,128,-43.22627237365205
35,594,-174.40671410632174
36,738,-132.40373525662272
37,1000,11.338668214922405
38,1000,32.0047886348585
39,144,-219.15703413216664
40,743,121.0560532907198
41,152,-226.89498753880463
42,195,-190.60578941872387
43,1000,24.478951409735682
44,1000,11.764274976655622
45,1000,-88.94489486191233
46,966,141.56028007950565
47,1000,-55.85796480704477
48,1000,-25.874747711821026
49,1000,18.433934035574687
50,1000,-13.28600053252774
51,1000,63.59063623510564
52,1000,-28.84664420931076
53,372,214.67917533304566
54,519,155.47629670939358
55,349,222.117714083403
56,414,-23.202165746215158
57,1000,13.126408545953197
58,1000,-28.25769371171998
59,884,187.21909355926974
60,697,215.18585370644715
61,1000,89.04973623813939
62,911,191.3564675638714
63,278,244.57478730484866
64,735,212.1451735089727
65,309,-92.28394152914171
66,1000,49.2967681428087
67,671,240.74679392190356
68,897,238.12149649336962
69,926,195.4051706448886
70,1000,42.664428405720486
71,1000,-3.3696063320545226
72,118,-132.69952002257642
73,308,228.58379869983298
74,1000,69.32917723288791
75,312,212.3038554989816
76,244,236.09048349422068
77,1000,114.27893997811098
78,235,303.8384259176709
79,415,261.87967899310473
80,191,-14.113394572599987
81,95,-97.07979824894049
82,572,208.8803939772598
83,343,274.630052070284
84,150,23.46655146449524
85,234,-104.1545428487619
86,343,232.52493423168562
87,480,278.95647330951147
88,248,252.4706470482456
89,330,281.04484791861364
90,482,211.7169332422072
91,303,214.49974043196045
92,750,220.24441769794743
93,884,190.66665756887414
94,160,32.967160562425875
95,317,222.86069579869832
96,213,244.55140162322843
97,397,256.9605219555803
98,215,251.06788335332507
99,351,275.190931652918
100,283,263.7798625879883
101,269,260.77086660022684
102,267,254.84442904011817
103,111,-89.83328636153243
104,104,-8.703559845842022
105,172,283.4726395987308
106,225,-57.129320633782804
107,212,37.29599635201089
108,175,-248.78411105511543
109,374,267.6998577792985
110,481,205.1724318464859
111,476,202.96402426569065
112,554,-108.96911141106781
113,256,215.9494500546926
114,324,226.85889855186872
115,377,248.51069060981774
116,748,179.26231351937835
117,629,171.08315649918796
118,288,255.17359314593574
119,256,-251.3769667427132
120,131,-175.8772009990281
121,538,199.6251161377349
122,236,-99.60697029142796
123,462,209.44272988724003
124,238,262.13485987127297
125,377,231.14890498096014
126,283,250.80031042459544
127,294,229.43054371913064
128,146,-29.089778897693208
129,436,221.78135991988725
130,225,269.20456368605153
131,208,235.00247630633294
132,310,253.02074120290763
133,606,183.45476629392851
134,450,257.8729292531773
135,247,257.6098445045752
136,435,256.42794585258935
137,384,246.68919712668543
138,623,235.9036108685793
139,146,-127.10911854348808
140,413,232.71778631576888
141,212,-28.94274472138696
142,302,252.5920394415836
143,1000,67.878472159168
144,201,304.4459126337108
145,253,229.58092395513685
146,277,286.1477401714111
147,276,260.6519612007721
148,319,246.03393152039698
149,247,269.816624325329
150,283,259.54737437782023
151,289,250.21162117497968
152,271,260.134603799164
153,264,227.78876951095938
154,258,244.78002399875336
155,229,267.3708257726886
156,192,225.78647730998847
157,109,4.994789634288992
158,252,261.74337799570765
159,249,292.90811838313607
160,247,250.26361385544732
161,262,253.27529149572717
162,119,8.093991565134914
163,183,277.9360175645061
164,241,308.1218107820263
165,560,159.2877215406233
166,305,-207.1483198222719
167,200,260.0401671910814
168,284,276.0870521856672
169,236,243.66223600463948
170,258,277.5725824903899
171,230,291.99095018362584
172,242,281.2640149274722
173,201,277.55830200842956
174,507,226.80810435181075
175,146,45.83778254431934
176,336,234.6985787848855
177,318,235.6123452775202
178,332,251.50299375513126
179,360,279.56588796351764
180,199,249.24623644493784
181,283,258.5321896017052
182,221,300.87918639712035
183,313,272.65938574589563
184,238,298.96042166062637
185,300,246.81159753281747
186,265,308.6627071870254
187,204,261.82674551425987
188,465,272.93290852073983
189,295,213.9792213557935
190,560,243.15759235999548
191,212,-101.26723085850263
192,313,231.50732628052504
193,115,34.72049016236153
194,320,253.23576551915406
195,238,297.5352073941058
196,190,-89.69531501192282
197,191,240.16544716300965
198,203,268.3037153328253
199,174,262.5472448542829
200,284,274.6244396105592
201,328,237.69328959937263
202,261,251.70369486558823
203,273,240.04815423005752
204,185,282.06902118864855
205,223,282.17567547592546
206,206,256.3921693228965
207,438,256.32621353009347
208,185,4.433923760042418
209,353,257.41367567894486
