episodes,steps,rewards
0,200,-200.0
1,200,-200.0
2,200,-200.0
3,200,-200.0
4,200,-200.0
5,200,-200.0
6,200,-200.0
7,200,-200.0
8,200,-200.0
9,200,-200.0
10,200,-200.0
11,200,-200.0
12,200,-200.0
13,200,-200.0
14,200,-200.0
15,200,-200.0
16,200,-200.0
17,200,-200.0
18,200,-200.0
19,200,-200.0
20,200,-200.0
21,200,-200.0
22,200,-200.0
23,200,-200.0
24,200,-200.0
25,200,-200.0
26,200,-200.0
27,200,-200.0
28,200,-200.0
29,200,-200.0
30,200,-200.0
31,200,-200.0
32,200,-200.0
33,200,-200.0
34,200,-200.0
35,200,-200.0
36,200,-200.0
37,200,-200.0
38,200,-200.0
39,200,-200.0
40,200,-200.0
41,200,-200.0
42,200,-200.0
43,200,-200.0
44,200,-200.0
45,200,-200.0
46,200,-200.0
47,200,-200.0
48,200,-200.0
49,200,-200.0
50,200,-200.0
51,200,-200.0
52,200,-200.0
53,200,-200.0
54,200,-200.0
55,200,-200.0
56,200,-200.0
57,200,-200.0
58,200,-200.0
59,200,-200.0
60,200,-200.0
61,200,-200.0
62,200,-200.0
63,200,-200.0
64,200,-200.0
65,200,-200.0
66,200,-200.0
67,200,-200.0
68,200,-200.0
69,200,-200.0
70,200,-200.0
71,200,-200.0
72,200,-200.0
73,200,-200.0
74,200,-200.0
75,200,-200.0
76,200,-200.0
77,200,-200.0
78,200,-200.0
79,200,-200.0
80,200,-200.0
81,200,-200.0
82,200,-200.0
83,200,-200.0
84,200,-200.0
85,200,-200.0
86,200,-200.0
87,200,-200.0
88,200,-200.0
89,200,-200.0
90,200,-200.0
91,200,-200.0
92,200,-200.0
93,200,-200.0
94,200,-200.0
95,191,-191.0
96,200,-200.0
97,200,-200.0
98,200,-200.0
99,200,-200.0
100,200,-200.0
101,200,-200.0
102,200,-200.0
103,200,-200.0
104,200,-200.0
105,200,-200.0
106,200,-200.0
107,200,-200.0
108,200,-200.0
109,200,-200.0
110,200,-200.0
111,200,-200.0
112,200,-200.0
113,200,-200.0
114,200,-200.0
115,200,-200.0
116,186,-186.0
117,200,-200.0
118,200,-200.0
119,200,-200.0
120,200,-200.0
121,200,-200.0
122,133,-133.0
123,186,-186.0
124,200,-200.0
125,200,-200.0
126,200,-200.0
127,200,-200.0
128,146,-146.0
129,129,-129.0
130,200,-200.0
131,200,-200.0
132,200,-200.0
133,200,-200.0
134,200,-200.0
135,144,-144.0
136,200,-200.0
137,166,-166.0
138,200,-200.0
139,100,-100.0
140,87,-87.0
141,180,-180.0
142,180,-180.0
143,184,-184.0
144,200,-200.0
145,200,-200.0
146,155,-155.0
147,170,-170.0
148,200,-200.0
149,130,-130.0
150,175,-175.0
151,200,-200.0
152,149,-149.0
153,200,-200.0
154,172,-172.0
155,151,-151.0
156,141,-141.0
157,117,-117.0
158,143,-143.0
159,169,-169.0
160,155,-155.0
161,137,-137.0
162,200,-200.0
163,171,-171.0
164,147,-147.0
165,132,-132.0
166,147,-147.0
167,148,-148.0
168,112,-112.0
169,146,-146.0
170,148,-148.0
171,146,-146.0
172,192,-192.0
173,197,-197.0
174,135,-135.0
175,136,-136.0
176,188,-188.0
177,139,-139.0
178,150,-150.0
179,151,-151.0
180,140,-140.0
181,151,-151.0
182,138,-138.0
183,139,-139.0
184,149,-149.0
185,157,-157.0
186,142,-142.0
187,157,-157.0
188,170,-170.0
189,170,-170.0
190,200,-200.0
191,163,-163.0
192,169,-169.0
193,172,-172.0
194,163,-163.0
195,152,-152.0
196,117,-117.0
197,155,-155.0
198,110,-110.0
199,167,-167.0
200,115,-115.0
201,141,-141.0
202,154,-154.0
203,88,-88.0
204,170,-170.0
205,153,-153.0
206,173,-173.0
207,114,-114.0
208,101,-101.0
209,162,-162.0
210,133,-133.0
211,151,-151.0
212,153,-153.0
213,178,-178.0
214,167,-167.0
215,158,-158.0
216,142,-142.0
217,115,-115.0
218,87,-87.0
219,155,-155.0
220,139,-139.0
221,137,-137.0
222,178,-178.0
223,111,-111.0
224,113,-113.0
225,114,-114.0
226,147,-147.0
227,155,-155.0
228,157,-157.0
229,88,-88.0
230,118,-118.0
231,169,-169.0
232,107,-107.0
233,147,-147.0
234,106,-106.0
235,191,-191.0
236,113,-113.0
237,109,-109.0
238,100,-100.0
239,168,-168.0
240,174,-174.0
241,101,-101.0
242,135,-135.0
243,176,-176.0
244,172,-172.0
245,105,-105.0
246,111,-111.0
247,158,-158.0
248,143,-143.0
249,124,-124.0
250,108,-108.0
251,140,-140.0
252,142,-142.0
253,126,-126.0
254,151,-151.0
255,121,-121.0
256,114,-114.0
257,157,-157.0
258,120,-120.0
259,100,-100.0
260,160,-160.0
261,150,-150.0
262,117,-117.0
263,111,-111.0
264,117,-117.0
265,158,-158.0
266,152,-152.0
267,149,-149.0
268,157,-157.0
269,111,-111.0
270,175,-175.0
271,141,-141.0
272,106,-106.0
273,119,-119.0
274,143,-143.0
275,107,-107.0
276,149,-149.0
277,140,-140.0
278,108,-108.0
279,142,-142.0
280,177,-177.0
281,113,-113.0
282,176,-176.0
283,136,-136.0
284,168,-168.0
285,180,-180.0
286,191,-191.0
287,123,-123.0
288,115,-115.0
289,114,-114.0
290,200,-200.0
291,106,-106.0
292,96,-96.0
293,148,-148.0
294,177,-177.0
295,144,-144.0
296,159,-159.0
297,136,-136.0
298,164,-164.0
299,171,-171.0
300,155,-155.0
301,91,-91.0
302,108,-108.0
303,157,-157.0
304,104,-104.0
305,109,-109.0
306,125,-125.0
307,101,-101.0
308,119,-119.0
309,139,-139.0
310,126,-126.0
311,183,-183.0
312,89,-89.0
313,153,-153.0
314,156,-156.0
315,114,-114.0
316,150,-150.0
317,144,-144.0
318,151,-151.0
319,100,-100.0
320,152,-152.0
321,97,-97.0
322,146,-146.0
323,161,-161.0
324,95,-95.0
325,159,-159.0
326,153,-153.0
327,166,-166.0
328,116,-116.0
329,102,-102.0
330,101,-101.0
331,91,-91.0
332,151,-151.0
333,90,-90.0
334,116,-116.0
335,159,-159.0
336,85,-85.0
337,133,-133.0
338,166,-166.0
339,117,-117.0
340,165,-165.0
341,89,-89.0
342,139,-139.0
343,96,-96.0
344,145,-145.0
345,116,-116.0
346,139,-139.0
347,164,-164.0
348,156,-156.0
349,147,-147.0
350,84,-84.0
351,147,-147.0
352,147,-147.0
353,148,-148.0
354,151,-151.0
355,149,-149.0
356,150,-150.0
357,110,-110.0
358,84,-84.0
359,142,-142.0
360,171,-171.0
361,110,-110.0
362,116,-116.0
363,90,-90.0
364,109,-109.0
365,139,-139.0
366,114,-114.0
367,84,-84.0
368,113,-113.0
369,87,-87.0
370,155,-155.0
371,136,-136.0
372,149,-149.0
373,149,-149.0
374,145,-145.0
375,136,-136.0
376,118,-118.0
377,166,-166.0
378,166,-166.0
379,146,-146.0
380,152,-152.0
381,106,-106.0
382,150,-150.0
383,200,-200.0
384,147,-147.0
385,122,-122.0
386,118,-118.0
387,154,-154.0
388,180,-180.0
389,135,-135.0
390,183,-183.0
391,152,-152.0
392,101,-101.0
393,137,-137.0
394,117,-117.0
395,149,-149.0
396,152,-152.0
397,155,-155.0
398,141,-141.0
399,138,-138.0
400,141,-141.0
401,182,-182.0
402,140,-140.0
403,123,-123.0
404,188,-188.0
405,142,-142.0
406,94,-94.0
407,111,-111.0
408,131,-131.0
409,168,-168.0
410,160,-160.0
411,108,-108.0
412,179,-179.0
413,158,-158.0
414,142,-142.0
415,115,-115.0
416,138,-138.0
417,92,-92.0
418,130,-130.0
419,147,-147.0
420,144,-144.0
421,124,-124.0
422,125,-125.0
423,85,-85.0
424,132,-132.0
425,192,-192.0
426,154,-154.0
427,162,-162.0
428,144,-144.0
429,155,-155.0
430,120,-120.0
431,151,-151.0
432,191,-191.0
433,149,-149.0
434,144,-144.0
435,139,-139.0
436,182,-182.0
437,149,-149.0
438,137,-137.0
439,164,-164.0
440,174,-174.0
441,153,-153.0
442,158,-158.0
443,192,-192.0
444,145,-145.0
445,157,-157.0
446,155,-155.0
447,158,-158.0
448,111,-111.0
449,142,-142.0
450,116,-116.0
451,192,-192.0
452,142,-142.0
453,188,-188.0
454,195,-195.0
455,109,-109.0
456,135,-135.0
457,115,-115.0
458,151,-151.0
459,151,-151.0
460,119,-119.0
461,142,-142.0
462,83,-83.0
463,144,-144.0
464,139,-139.0
465,126,-126.0
466,160,-160.0
467,152,-152.0
468,175,-175.0
469,148,-148.0
470,151,-151.0
471,147,-147.0
472,110,-110.0
473,150,-150.0
474,150,-150.0
475,149,-149.0
476,152,-152.0
477,165,-165.0
478,166,-166.0
479,148,-148.0
480,151,-151.0
481,134,-134.0
482,153,-153.0
483,88,-88.0
484,139,-139.0
485,152,-152.0
486,157,-157.0
487,84,-84.0
488,142,-142.0
489,164,-164.0
490,151,-151.0
491,109,-109.0
492,155,-155.0
493,143,-143.0
494,94,-94.0
495,141,-141.0
496,179,-179.0
497,134,-134.0
498,140,-140.0
499,134,-134.0
500,145,-145.0
501,118,-118.0
502,146,-146.0
503,111,-111.0
504,112,-112.0
505,157,-157.0
506,132,-132.0
507,148,-148.0
508,143,-143.0
509,144,-144.0
510,124,-124.0
511,125,-125.0
512,162,-162.0
513,145,-145.0
514,151,-151.0
515,117,-117.0
516,90,-90.0
517,110,-110.0
518,114,-114.0
519,130,-130.0
520,125,-125.0
521,155,-155.0
522,142,-142.0
523,101,-101.0
524,90,-90.0
525,122,-122.0
526,122,-122.0
527,99,-99.0
528,105,-105.0
529,143,-143.0
530,109,-109.0
531,102,-102.0
532,122,-122.0
533,120,-120.0
534,110,-110.0
535,173,-173.0
536,167,-167.0
537,106,-106.0
538,122,-122.0
539,140,-140.0
540,142,-142.0
541,160,-160.0
542,160,-160.0
543,154,-154.0
544,147,-147.0
545,140,-140.0
546,168,-168.0
547,89,-89.0
548,109,-109.0
549,156,-156.0
550,152,-152.0
551,113,-113.0
552,113,-113.0
553,167,-167.0
554,200,-200.0
555,107,-107.0
556,139,-139.0
557,113,-113.0
558,109,-109.0
559,109,-109.0
560,190,-190.0
561,110,-110.0
562,132,-132.0
563,153,-153.0
564,147,-147.0
565,109,-109.0
566,147,-147.0
567,162,-162.0
568,148,-148.0
569,114,-114.0
570,130,-130.0
571,160,-160.0
572,158,-158.0
573,132,-132.0
574,138,-138.0
575,90,-90.0
576,116,-116.0
577,141,-141.0
578,140,-140.0
579,138,-138.0
580,91,-91.0
581,132,-132.0
582,166,-166.0
583,126,-126.0
584,163,-163.0
585,150,-150.0
586,127,-127.0
587,185,-185.0
588,113,-113.0
589,136,-136.0
590,142,-142.0
591,148,-148.0
592,149,-149.0
593,148,-148.0
594,149,-149.0
595,144,-144.0
596,200,-200.0
597,92,-92.0
598,144,-144.0
599,150,-150.0
600,147,-147.0
