episodes,steps,rewards
0,200,-200.0
1,200,-200.0
2,200,-200.0
3,200,-200.0
4,200,-200.0
5,200,-200.0
6,200,-200.0
7,200,-200.0
8,200,-200.0
9,93,-93.0
10,200,-200.0
11,200,-200.0
12,200,-200.0
13,200,-200.0
14,200,-200.0
15,200,-200.0
16,200,-200.0
17,200,-200.0
18,200,-200.0
19,200,-200.0
20,200,-200.0
21,200,-200.0
22,200,-200.0
23,200,-200.0
24,200,-200.0
25,200,-200.0
26,167,-167.0
27,200,-200.0
28,180,-180.0
29,176,-176.0
30,167,-167.0
31,200,-200.0
32,111,-111.0
33,200,-200.0
34,94,-94.0
35,171,-171.0
36,181,-181.0
37,199,-199.0
38,89,-89.0
39,163,-163.0
40,200,-200.0
41,200,-200.0
42,126,-126.0
43,200,-200.0
44,143,-143.0
45,105,-105.0
46,151,-151.0
47,200,-200.0
48,173,-173.0
49,200,-200.0
50,116,-116.0
51,169,-169.0
52,193,-193.0
53,200,-200.0
54,100,-100.0
55,139,-139.0
56,96,-96.0
57,169,-169.0
58,128,-128.0
59,193,-193.0
60,200,-200.0
61,180,-180.0
62,200,-200.0
63,200,-200.0
64,180,-180.0
65,126,-126.0
66,104,-104.0
67,184,-184.0
68,170,-170.0
69,200,-200.0
70,200,-200.0
71,140,-140.0
72,178,-178.0
73,156,-156.0
74,200,-200.0
75,193,-193.0
76,148,-148.0
77,156,-156.0
78,109,-109.0
79,162,-162.0
80,149,-149.0
81,200,-200.0
82,200,-200.0
83,163,-163.0
84,158,-158.0
85,200,-200.0
86,200,-200.0
87,200,-200.0
88,151,-151.0
89,173,-173.0
90,193,-193.0
91,200,-200.0
92,130,-130.0
93,200,-200.0
94,200,-200.0
95,200,-200.0
96,200,-200.0
97,200,-200.0
98,200,-200.0
99,200,-200.0
100,179,-179.0
101,140,-140.0
102,133,-133.0
103,171,-171.0
104,169,-169.0
105,166,-166.0
106,200,-200.0
107,112,-112.0
108,127,-127.0
109,193,-193.0
110,122,-122.0
111,200,-200.0
112,189,-189.0
113,200,-200.0
114,200,-200.0
115,105,-105.0
116,200,-200.0
117,200,-200.0
118,168,-168.0
119,200,-200.0
120,106,-106.0
121,160,-160.0
122,116,-116.0
123,152,-152.0
124,102,-102.0
125,147,-147.0
126,155,-155.0
127,106,-106.0
128,182,-182.0
129,200,-200.0
130,147,-147.0
131,177,-177.0
132,174,-174.0
133,149,-149.0
134,106,-106.0
135,114,-114.0
136,170,-170.0
137,139,-139.0
138,96,-96.0
139,138,-138.0
140,181,-181.0
141,147,-147.0
142,132,-132.0
143,158,-158.0
144,187,-187.0
145,163,-163.0
146,110,-110.0
147,140,-140.0
148,153,-153.0
149,140,-140.0
150,134,-134.0
151,176,-176.0
152,154,-154.0
153,121,-121.0
154,120,-120.0
155,149,-149.0
156,134,-134.0
157,129,-129.0
158,136,-136.0
159,148,-148.0
160,157,-157.0
161,200,-200.0
162,115,-115.0
163,140,-140.0
164,142,-142.0
165,200,-200.0
166,127,-127.0
167,133,-133.0
168,141,-141.0
169,147,-147.0
170,157,-157.0
171,166,-166.0
172,120,-120.0
173,139,-139.0
174,139,-139.0
175,159,-159.0
176,146,-146.0
177,131,-131.0
178,200,-200.0
179,145,-145.0
180,134,-134.0
181,152,-152.0
182,138,-138.0
183,127,-127.0
184,145,-145.0
185,87,-87.0
186,149,-149.0
187,200,-200.0
188,166,-166.0
189,124,-124.0
190,146,-146.0
191,133,-133.0
192,149,-149.0
193,162,-162.0
194,162,-162.0
195,158,-158.0
196,142,-142.0
197,200,-200.0
198,200,-200.0
199,135,-135.0
200,183,-183.0
201,151,-151.0
202,130,-130.0
203,141,-141.0
204,107,-107.0
205,147,-147.0
206,146,-146.0
207,200,-200.0
208,111,-111.0
209,148,-148.0
210,143,-143.0
211,151,-151.0
212,173,-173.0
213,200,-200.0
214,146,-146.0
215,87,-87.0
216,157,-157.0
217,147,-147.0
218,89,-89.0
219,152,-152.0
220,123,-123.0
221,138,-138.0
222,128,-128.0
223,117,-117.0
224,108,-108.0
225,91,-91.0
226,181,-181.0
227,147,-147.0
228,152,-152.0
229,141,-141.0
230,154,-154.0
231,84,-84.0
232,109,-109.0
233,87,-87.0
234,138,-138.0
235,161,-161.0
236,152,-152.0
237,129,-129.0
238,160,-160.0
239,145,-145.0
240,164,-164.0
241,153,-153.0
242,92,-92.0
243,93,-93.0
244,167,-167.0
245,99,-99.0
246,143,-143.0
247,88,-88.0
248,93,-93.0
249,145,-145.0
250,154,-154.0
251,90,-90.0
252,178,-178.0
253,152,-152.0
254,117,-117.0
255,155,-155.0
256,155,-155.0
257,100,-100.0
258,155,-155.0
259,170,-170.0
260,151,-151.0
261,99,-99.0
262,163,-163.0
263,154,-154.0
264,167,-167.0
265,173,-173.0
266,161,-161.0
267,162,-162.0
268,148,-148.0
269,143,-143.0
270,153,-153.0
271,170,-170.0
272,190,-190.0
273,146,-146.0
274,150,-150.0
275,93,-93.0
276,153,-153.0
277,147,-147.0
278,104,-104.0
279,163,-163.0
280,152,-152.0
281,120,-120.0
282,153,-153.0
283,84,-84.0
284,92,-92.0
285,148,-148.0
286,147,-147.0
287,145,-145.0
288,153,-153.0
289,145,-145.0
290,113,-113.0
291,155,-155.0
292,146,-146.0
293,146,-146.0
294,149,-149.0
295,145,-145.0
296,159,-159.0
297,153,-153.0
298,147,-147.0
299,139,-139.0
300,148,-148.0
301,145,-145.0
302,145,-145.0
303,146,-146.0
304,140,-140.0
305,141,-141.0
306,144,-144.0
307,148,-148.0
308,139,-139.0
309,143,-143.0
310,140,-140.0
311,173,-173.0
312,146,-146.0
313,104,-104.0
314,148,-148.0
315,87,-87.0
316,87,-87.0
317,141,-141.0
318,139,-139.0
319,104,-104.0
320,85,-85.0
321,105,-105.0
322,96,-96.0
323,147,-147.0
324,90,-90.0
325,136,-136.0
326,110,-110.0
327,140,-140.0
328,86,-86.0
329,141,-141.0
330,150,-150.0
331,200,-200.0
332,169,-169.0
333,83,-83.0
334,138,-138.0
335,86,-86.0
336,85,-85.0
337,137,-137.0
338,155,-155.0
339,144,-144.0
340,153,-153.0
341,152,-152.0
342,173,-173.0
343,151,-151.0
344,152,-152.0
345,100,-100.0
346,122,-122.0
347,145,-145.0
348,122,-122.0
349,151,-151.0
350,151,-151.0
351,142,-142.0
352,163,-163.0
353,87,-87.0
354,94,-94.0
355,149,-149.0
356,120,-120.0
357,151,-151.0
358,158,-158.0
359,167,-167.0
360,107,-107.0
361,155,-155.0
362,107,-107.0
363,110,-110.0
364,107,-107.0
365,109,-109.0
366,89,-89.0
367,181,-181.0
368,195,-195.0
369,96,-96.0
370,168,-168.0
371,174,-174.0
372,164,-164.0
373,147,-147.0
374,87,-87.0
375,170,-170.0
376,95,-95.0
377,91,-91.0
378,103,-103.0
379,200,-200.0
380,177,-177.0
381,167,-167.0
382,137,-137.0
383,161,-161.0
384,164,-164.0
385,154,-154.0
386,145,-145.0
387,200,-200.0
388,86,-86.0
389,154,-154.0
390,183,-183.0
391,86,-86.0
392,161,-161.0
393,200,-200.0
394,92,-92.0
395,92,-92.0
396,147,-147.0
397,138,-138.0
398,200,-200.0
399,197,-197.0
400,127,-127.0
401,188,-188.0
402,186,-186.0
403,104,-104.0
404,105,-105.0
405,130,-130.0
406,171,-171.0
407,200,-200.0
408,200,-200.0
409,200,-200.0
410,154,-154.0
411,141,-141.0
412,200,-200.0
413,200,-200.0
414,122,-122.0
415,200,-200.0
416,200,-200.0
417,200,-200.0
418,200,-200.0
419,200,-200.0
420,200,-200.0
421,200,-200.0
422,200,-200.0
423,200,-200.0
424,200,-200.0
425,200,-200.0
426,200,-200.0
427,200,-200.0
428,200,-200.0
429,200,-200.0
430,200,-200.0
431,200,-200.0
432,139,-139.0
433,200,-200.0
434,123,-123.0
435,200,-200.0
436,200,-200.0
437,200,-200.0
438,200,-200.0
439,200,-200.0
440,121,-121.0
441,179,-179.0
442,187,-187.0
443,132,-132.0
444,200,-200.0
445,183,-183.0
446,135,-135.0
447,180,-180.0
448,94,-94.0
449,117,-117.0
450,200,-200.0
451,108,-108.0
452,109,-109.0
453,200,-200.0
454,200,-200.0
455,182,-182.0
456,144,-144.0
457,111,-111.0
458,200,-200.0
459,119,-119.0
460,119,-119.0
461,186,-186.0
462,186,-186.0
463,86,-86.0
464,108,-108.0
465,89,-89.0
466,109,-109.0
467,116,-116.0
468,92,-92.0
469,111,-111.0
470,192,-192.0
471,108,-108.0
472,200,-200.0
473,94,-94.0
474,113,-113.0
475,181,-181.0
476,84,-84.0
477,200,-200.0
478,121,-121.0
479,123,-123.0
480,122,-122.0
481,95,-95.0
482,112,-112.0
483,113,-113.0
484,181,-181.0
485,113,-113.0
486,190,-190.0
487,165,-165.0
488,107,-107.0
489,200,-200.0
490,115,-115.0
491,104,-104.0
492,118,-118.0
493,109,-109.0
494,124,-124.0
495,111,-111.0
496,91,-91.0
497,119,-119.0
498,105,-105.0
499,109,-109.0
500,108,-108.0
501,111,-111.0
502,177,-177.0
503,117,-117.0
504,106,-106.0
505,98,-98.0
506,106,-106.0
507,107,-107.0
508,115,-115.0
509,117,-117.0
510,103,-103.0
511,200,-200.0
512,175,-175.0
513,106,-106.0
514,107,-107.0
515,179,-179.0
516,180,-180.0
517,128,-128.0
518,105,-105.0
519,111,-111.0
520,92,-92.0
521,200,-200.0
522,110,-110.0
523,92,-92.0
524,116,-116.0
525,112,-112.0
526,114,-114.0
527,121,-121.0
528,113,-113.0
529,109,-109.0
530,118,-118.0
531,89,-89.0
532,122,-122.0
533,94,-94.0
534,118,-118.0
535,89,-89.0
536,90,-90.0
537,119,-119.0
538,120,-120.0
539,106,-106.0
540,159,-159.0
541,156,-156.0
542,192,-192.0
543,178,-178.0
544,132,-132.0
545,116,-116.0
546,122,-122.0
547,169,-169.0
548,89,-89.0
549,155,-155.0
550,104,-104.0
551,90,-90.0
552,107,-107.0
553,108,-108.0
554,125,-125.0
555,159,-159.0
556,92,-92.0
557,112,-112.0
558,106,-106.0
559,121,-121.0
560,106,-106.0
561,126,-126.0
562,189,-189.0
563,112,-112.0
564,145,-145.0
565,107,-107.0
566,153,-153.0
567,116,-116.0
568,113,-113.0
569,148,-148.0
570,157,-157.0
571,153,-153.0
572,104,-104.0
573,122,-122.0
574,109,-109.0
575,196,-196.0
576,150,-150.0
577,119,-119.0
578,145,-145.0
579,111,-111.0
580,159,-159.0
581,149,-149.0
582,160,-160.0
583,184,-184.0
584,124,-124.0
585,200,-200.0
586,125,-125.0
587,115,-115.0
588,119,-119.0
589,181,-181.0
590,110,-110.0
591,107,-107.0
592,191,-191.0
593,150,-150.0
594,119,-119.0
595,119,-119.0
596,124,-124.0
597,108,-108.0
598,114,-114.0
599,88,-88.0
600,114,-114.0
601,118,-118.0
602,117,-117.0
603,117,-117.0
604,151,-151.0
605,85,-85.0
606,111,-111.0
607,165,-165.0
608,133,-133.0
609,123,-123.0
610,162,-162.0
611,105,-105.0
612,140,-140.0
613,107,-107.0
614,156,-156.0
615,108,-108.0
616,165,-165.0
617,142,-142.0
618,157,-157.0
619,182,-182.0
620,112,-112.0
621,154,-154.0
622,111,-111.0
623,123,-123.0
624,134,-134.0
625,123,-123.0
626,113,-113.0
627,117,-117.0
628,96,-96.0
629,200,-200.0
630,145,-145.0
631,151,-151.0
632,91,-91.0
633,107,-107.0
634,146,-146.0
635,90,-90.0
636,154,-154.0
637,85,-85.0
638,156,-156.0
639,152,-152.0
640,107,-107.0
641,109,-109.0
642,111,-111.0
643,168,-168.0
644,106,-106.0
645,108,-108.0
646,114,-114.0
647,104,-104.0
648,84,-84.0
649,90,-90.0
650,95,-95.0
