episodes,steps,rewards
0,87,-38.15982778091018
1,101,-104.13190663675257
2,149,-141.39447278173066
3,103,-370.80665057267686
4,157,-87.19939818729092
5,217,-290.3350223707129
6,132,-212.47059171512882
7,168,-168.45026133368205
8,375,-191.88556388636974
9,303,-140.33830449970833
10,302,-131.65844521238049
11,169,-89.4521615692916
12,291,-272.0917134394015
13,132,-156.65649495781565
14,170,-196.3180392830975
15,318,-265.59072720692154
16,1000,-183.84887877725805
17,1000,-78.68989855944004
18,675,-302.7313470461544
19,1000,-46.54088237593282
20,1000,-101.10325667022995
21,1000,-117.99608863503865
22,999,-123.91725978161026
23,1000,-154.29808022035948
24,1000,-106.24107019033588
25,1000,-81.9795392256367
26,1000,-113.65037099437502
27,1000,-35.84740483674419
28,172,-186.44346913772569
29,1000,-45.88149457531688
30,1000,-8.302421085138322
31,1000,-33.56686500745573
32,1000,-10.891859122906478
33,135,-62.475057954621725
34,1000,-51.22617577472228
35,1000,-31.410327206049253
36,1000,-31.3413370584668
37,209,17.348498036439295
38,271,-84.47921296642347
39,1000,-55.8877659445348
40,1000,-62.97643080185088
41,1000,-62.13594833125998
42,1000,-41.35563301013531
43,1000,-74.53116048568886
44,1000,-28.453216367008864
45,1000,-39.96786139705689
46,1000,-29.957913796635527
47,1000,-25.61853893958547
48,695,-61.85530258297662
49,1000,-59.36554447359462
50,1000,-12.337348203663554
51,754,-218.7517830735162
52,123,-116.85285389831706
53,1000,-82.40079505955873
54,1000,-68.50469668401105
55,1000,-73.60790361875925
56,1000,-95.35844758097176
57,1000,-87.06045834027884
58,1000,-43.413981603515566
59,1000,-32.20661411313726
60,1000,-130.7689669682435
61,1000,-38.02257638666384
62,1000,-138.04096827022204
63,225,-137.70152233108004
64,1000,-210.41027158037286
65,1000,-35.27972407670331
66,1000,-40.70070163362606
67,189,-223.05459610029527
68,1000,-11.983923479521565
69,1000,-56.15302955294651
70,1000,18.04572241034866
71,1000,-7.257225112282707
72,127,-47.84719532490165
73,1000,-15.719974519545081
74,1000,-34.358439534536494
75,1000,-57.948949384395895
76,121,58.421716383796166
77,1000,-11.943006075927117
78,1000,-38.95306581186055
79,1000,11.140801508432505
80,1000,1.9967299334975879
81,1000,-35.88440169907573
82,1000,-35.01010973391207
83,1000,-2.701612225267665
84,1000,-51.2692695609127
85,1000,-41.204199038421294
86,1000,-10.918347232053149
87,1000,-43.140254361180624
88,1000,-2.442199026718561
89,1000,-2.1076937037331778
90,1000,-38.97730761681947
91,1000,-6.768113285340549
92,1000,-22.61222374736362
93,366,-4.413060603595724
94,1000,-38.1938242490944
95,1000,-16.580222970942895
96,1000,-69.7205756555835
97,1000,-43.59373002190421
98,1000,-39.733598102142835
99,1000,-75.99394664680612
100,1000,-15.183961591201586
101,1000,-35.177573176983294
102,1000,-16.6001665088663
103,1000,-65.60550061607641
104,1000,-45.70749021589612
105,116,6.9833878989852
106,347,-73.61837599957633
107,737,-267.2059366507449
108,534,-333.33743410811667
109,1000,-98.7866433980405
110,1000,-0.6688491235479324
111,1000,-42.93371572429248
112,1000,-130.88538829536807
113,1000,-20.917053985943888
114,1000,-1.250860420788334
115,1000,-2.2649418615704917
116,238,-53.41694081864669
117,1000,9.250049706741773
118,96,-157.2595769362908
119,91,-70.04824131059718
120,105,-61.81524087621408
121,1000,-125.57211009292168
122,1000,-50.94835338250862
123,281,-154.24074105856994
124,1000,-47.90578618353024
125,254,-147.0978897650777
126,363,-148.44416022783716
127,140,-43.72015182855672
128,359,-56.40846274350219
129,551,-125.66201338024297
130,314,-181.10403971635247
131,438,-115.24854722818773
132,421,-68.97497785952352
133,1000,-94.64433355555624
134,1000,-177.4017340182543
135,760,-125.38420637256138
136,1000,23.912835812481465
137,1000,11.693141025984007
138,1000,-4.618529708854637
139,1000,24.747259177264528
140,1000,8.31566303404837
141,521,-247.37286140296362
142,1000,14.668351294868877
143,1000,-41.07451308479853
144,1000,-60.56849008609895
145,1000,-14.519055097964596
146,1000,-73.11630010104022
147,711,-155.52858068079803
148,403,-134.65439248100648
149,1000,-32.26020489724758
150,1000,-64.32443199825418
