episodes,steps,rewards
0,123,-92.21864600807282
1,116,-206.92031130086724
2,73,-150.25020611549303
3,120,-215.8931944137367
4,84,-128.41320847958394
5,78,-96.18524573066568
6,100,-107.03295710081441
7,102,-286.09683825305115
8,90,-214.7928810409772
9,108,-208.31135688184702
10,74,-65.56390007803587
11,103,-171.2493253805738
12,272,-503.49514022938945
13,84,-369.26548094638036
14,114,-429.7209283447734
15,151,-104.6994875900664
16,365,-156.47657681709518
17,668,-173.5276380698223
18,206,-115.45208332933349
19,92,-118.0553249103773
20,96,-170.05932998086854
21,142,-156.56276177092752
22,103,-188.06197612138817
23,259,-83.7232099813314
24,373,-121.40850499136681
25,138,-210.83867328136523
26,258,-184.6383280696627
27,133,-191.38256361998504
28,139,-195.4868513278384
29,135,-108.09127723633073
30,142,-110.09613028959666
31,119,-277.0503393747059
32,141,-249.93757559612214
33,179,-219.43962876843983
34,157,-342.7176699907238
35,363,-258.25269704045127
36,1000,-137.25545036899626
37,1000,-95.84242347026672
38,1000,-137.48938602976938
39,850,-314.3352286920124
40,337,-221.10400498963844
41,354,-194.80792730331677
42,333,-251.47418600098177
43,260,-178.7826681718845
44,895,-272.9367790122151
45,420,-211.55617711554618
46,1000,-228.670556601776
47,1000,-254.50984876429706
48,1000,-160.58119510297547
49,1000,-179.26598207709483
50,322,-257.5749587172688
51,1000,-169.46059716080563
52,463,-213.35053907084085
53,1000,-187.3866393860793
54,1000,-193.33403958613283
55,1000,-193.1139521595387
56,1000,-147.82238234105736
57,1000,-148.44033901475453
58,1000,-194.0910470206291
59,1000,-143.7098236318674
60,1000,-171.26520515066503
61,1000,-141.52669287604846
62,311,-664.0596842188252
63,1000,-193.19941335238508
64,1000,-194.68151896803806
65,1000,-166.01401851603526
66,1000,-193.26238816679495
67,1000,-254.11096819880916
68,1000,-208.43026460937125
69,1000,-186.3776893885978
70,1000,-198.7838221833953
71,1000,-214.7257072459428
72,1000,-223.25408544343364
73,950,-416.33275074828464
74,743,-310.41852074903335
75,1000,-253.83721270848866
76,865,-345.1634539781588
77,1000,-266.0305937482872
78,157,-197.8349789690222
79,1000,-161.94840107437736
80,979,-318.4476425892378
81,1000,-179.43603896041725
82,1000,-178.49355952898827
83,1000,-217.52035709109882
84,426,-232.93701023100886
85,429,-267.35945978221093
86,182,-146.10591528298363
87,1000,-324.1885183065491
88,1000,-151.44642471881693
89,99,-287.12832851590144
90,1000,-189.422833913736
91,1000,-209.72888868244118
92,523,-221.01937588982344
93,1000,-185.50039221791477
94,795,-257.119292325178
95,1000,-201.38793206025335
96,1000,-226.34629551929152
97,982,-345.8253825682836
98,1000,-192.6609034997603
99,856,-269.75091533320165
100,1000,-167.29605285146857
101,1000,-137.98125312034065
102,1000,-152.18505091746275
103,1000,-167.4279426126026
104,1000,-266.21001423211555
105,1000,-205.4011115321367
106,1000,-181.5748776577328
107,1000,-190.57386819097385
108,1000,-274.7591586725827
109,1000,-143.2921285798515
110,1000,-168.69483939506338
111,1000,-110.42271519245931
112,1000,-220.15176223250702
113,1000,-136.03160297814816
114,175,-316.50530101584235
115,1000,-132.80887019706043
116,484,-108.90671602032191
117,1000,-148.20000111675338
118,1000,-128.98356097988125
119,1000,-93.3970233377804
120,543,-240.7051323574284
121,247,-225.11331030556227
122,1000,-53.27533578772473
123,1000,-113.60438452643501
124,515,-177.0359540179009
125,970,72.63144385356934
126,100,-133.59122960636645
127,327,-107.37891842434546
128,1000,-65.23029300790579
129,1000,-17.41003579289576
130,1000,-87.7608393256488
131,1000,-72.73147540410834
132,1000,-49.41521628188254
133,1000,-126.54762118919695
134,1000,-84.14568415184925
135,1000,-91.78225040634248
136,1000,-147.62310093139098
137,1000,-151.44406739247043
138,1000,-109.90317412457304
139,1000,-158.2336630098855
140,1000,-192.91571881141414
141,1000,-161.8637489887551
142,723,-195.7964261184116
143,1000,-99.45330658911028
144,496,-188.42683089059085
145,474,-191.82779573987824
146,319,-116.63397317002676
147,1000,-725.6105371648257
148,62,-160.4414426240483
149,1000,-625.9688508966428
150,1000,-422.0285831093937
