episodes,steps,rewards
0,200,-200.0
1,200,-200.0
2,200,-200.0
3,200,-200.0
4,200,-200.0
5,200,-200.0
6,200,-200.0
7,200,-200.0
8,200,-200.0
9,200,-200.0
10,185,-185.0
11,200,-200.0
12,200,-200.0
13,200,-200.0
14,200,-200.0
15,200,-200.0
16,200,-200.0
17,200,-200.0
18,200,-200.0
19,190,-190.0
20,200,-200.0
21,200,-200.0
22,200,-200.0
23,200,-200.0
24,200,-200.0
25,162,-162.0
26,200,-200.0
27,200,-200.0
28,200,-200.0
29,200,-200.0
30,200,-200.0
31,200,-200.0
32,200,-200.0
33,200,-200.0
34,200,-200.0
35,200,-200.0
36,200,-200.0
37,200,-200.0
38,200,-200.0
39,200,-200.0
40,200,-200.0
41,200,-200.0
42,200,-200.0
43,200,-200.0
44,200,-200.0
45,200,-200.0
46,200,-200.0
47,200,-200.0
48,200,-200.0
49,200,-200.0
50,200,-200.0
51,200,-200.0
52,200,-200.0
53,200,-200.0
54,200,-200.0
55,200,-200.0
56,200,-200.0
57,158,-158.0
58,200,-200.0
59,196,-196.0
60,200,-200.0
61,200,-200.0
62,200,-200.0
63,200,-200.0
64,200,-200.0
65,196,-196.0
66,200,-200.0
67,115,-115.0
68,179,-179.0
69,146,-146.0
70,179,-179.0
71,200,-200.0
72,200,-200.0
73,200,-200.0
74,101,-101.0
75,163,-163.0
76,93,-93.0
77,171,-171.0
78,200,-200.0
79,166,-166.0
80,200,-200.0
81,86,-86.0
82,195,-195.0
83,199,-199.0
84,200,-200.0
85,177,-177.0
86,200,-200.0
87,102,-102.0
88,198,-198.0
89,183,-183.0
90,154,-154.0
91,200,-200.0
92,188,-188.0
93,84,-84.0
94,200,-200.0
95,200,-200.0
96,200,-200.0
97,160,-160.0
98,200,-200.0
99,119,-119.0
100,192,-192.0
101,197,-197.0
102,119,-119.0
103,190,-190.0
104,193,-193.0
105,158,-158.0
106,200,-200.0
107,192,-192.0
108,128,-128.0
109,159,-159.0
110,175,-175.0
111,169,-169.0
112,200,-200.0
113,200,-200.0
114,200,-200.0
115,200,-200.0
116,150,-150.0
117,200,-200.0
118,180,-180.0
119,200,-200.0
120,187,-187.0
121,178,-178.0
122,153,-153.0
123,186,-186.0
124,87,-87.0
125,152,-152.0
126,114,-114.0
127,120,-120.0
128,106,-106.0
129,162,-162.0
130,147,-147.0
131,124,-124.0
132,168,-168.0
133,91,-91.0
134,168,-168.0
135,92,-92.0
136,165,-165.0
137,93,-93.0
138,171,-171.0
139,112,-112.0
140,174,-174.0
141,128,-128.0
142,170,-170.0
143,167,-167.0
144,173,-173.0
145,165,-165.0
146,155,-155.0
147,106,-106.0
148,119,-119.0
149,108,-108.0
150,131,-131.0
151,174,-174.0
152,190,-190.0
153,127,-127.0
154,130,-130.0
155,113,-113.0
156,144,-144.0
157,120,-120.0
158,140,-140.0
159,157,-157.0
160,107,-107.0
161,178,-178.0
162,89,-89.0
163,106,-106.0
164,115,-115.0
165,151,-151.0
166,124,-124.0
167,154,-154.0
168,116,-116.0
169,156,-156.0
170,152,-152.0
171,114,-114.0
172,140,-140.0
173,116,-116.0
174,157,-157.0
175,166,-166.0
176,109,-109.0
177,147,-147.0
178,121,-121.0
179,152,-152.0
180,156,-156.0
181,148,-148.0
182,110,-110.0
183,149,-149.0
184,147,-147.0
185,88,-88.0
186,146,-146.0
187,149,-149.0
188,144,-144.0
189,83,-83.0
190,86,-86.0
191,90,-90.0
192,152,-152.0
193,161,-161.0
194,143,-143.0
195,151,-151.0
196,161,-161.0
197,155,-155.0
198,139,-139.0
199,148,-148.0
200,139,-139.0
201,176,-176.0
202,155,-155.0
203,148,-148.0
204,165,-165.0
205,137,-137.0
206,175,-175.0
207,147,-147.0
208,157,-157.0
209,154,-154.0
210,146,-146.0
211,153,-153.0
212,195,-195.0
213,158,-158.0
214,138,-138.0
215,98,-98.0
216,162,-162.0
217,148,-148.0
218,135,-135.0
219,148,-148.0
220,175,-175.0
221,154,-154.0
222,94,-94.0
223,132,-132.0
224,95,-95.0
225,102,-102.0
226,158,-158.0
227,161,-161.0
228,87,-87.0
229,141,-141.0
230,175,-175.0
231,175,-175.0
232,157,-157.0
233,99,-99.0
234,142,-142.0
235,166,-166.0
236,163,-163.0
237,87,-87.0
238,146,-146.0
239,158,-158.0
240,159,-159.0
241,98,-98.0
242,172,-172.0
243,151,-151.0
244,156,-156.0
245,150,-150.0
246,85,-85.0
247,182,-182.0
248,149,-149.0
249,182,-182.0
250,149,-149.0
251,155,-155.0
252,155,-155.0
253,200,-200.0
254,91,-91.0
255,151,-151.0
256,110,-110.0
257,167,-167.0
258,111,-111.0
259,87,-87.0
260,107,-107.0
261,92,-92.0
262,145,-145.0
263,106,-106.0
264,180,-180.0
265,168,-168.0
266,151,-151.0
267,87,-87.0
268,87,-87.0
269,141,-141.0
270,154,-154.0
271,104,-104.0
272,85,-85.0
273,137,-137.0
274,85,-85.0
275,156,-156.0
276,87,-87.0
277,108,-108.0
278,152,-152.0
279,164,-164.0
280,158,-158.0
281,87,-87.0
282,165,-165.0
283,151,-151.0
284,86,-86.0
285,138,-138.0
286,86,-86.0
287,95,-95.0
288,169,-169.0
289,155,-155.0
290,94,-94.0
291,93,-93.0
292,100,-100.0
293,161,-161.0
294,135,-135.0
295,156,-156.0
296,142,-142.0
297,89,-89.0
298,85,-85.0
299,127,-127.0
300,93,-93.0
301,85,-85.0
302,155,-155.0
303,158,-158.0
304,113,-113.0
305,91,-91.0
306,102,-102.0
307,87,-87.0
308,138,-138.0
309,86,-86.0
310,90,-90.0
311,125,-125.0
312,157,-157.0
313,142,-142.0
314,96,-96.0
315,158,-158.0
316,135,-135.0
317,144,-144.0
318,138,-138.0
319,150,-150.0
320,88,-88.0
321,87,-87.0
322,153,-153.0
323,131,-131.0
324,85,-85.0
325,144,-144.0
326,87,-87.0
327,115,-115.0
328,200,-200.0
329,169,-169.0
330,91,-91.0
331,145,-145.0
332,148,-148.0
333,146,-146.0
334,154,-154.0
335,90,-90.0
336,171,-171.0
337,133,-133.0
338,100,-100.0
339,142,-142.0
340,147,-147.0
341,154,-154.0
342,85,-85.0
343,104,-104.0
344,112,-112.0
345,153,-153.0
346,169,-169.0
347,148,-148.0
348,139,-139.0
349,200,-200.0
350,146,-146.0
