{
    "model_info": "common32x32",
    "episodes": [
        34,
        75,
        19,
        8,
        10,
        9,
        10,
        10,
        10,
        10,
        10,
        11,
        13,
        10,
        12,
        10,
        11,
        12,
        12,
        17,
        11,
        13,
        9,
        11,
        12,
        8,
        11,
        10,
        15,
        12,
        13,
        16,
        11,
        9,
        9,
        13,
        16,
        19,
        11,
        23,
        20,
        25,
        15,
        13,
        40,
        36,
        74,
        29,
        27,
        19,
        18,
        13,
        11,
        13,
        12,
        10,
        11,
        10,
        13,
        15,
        20,
        11,
        12,
        9,
        16,
        13,
        12,
        13,
        14,
        12,
        15,
        11,
        10,
        15,
        11,
        10,
        10,
        9,
        13,
        12,
        12,
        14,
        13,
        10,
        19,
        11,
        10,
        10,
        12,
        10,
        11,
        9,
        12,
        11,
        13,
        11,
        19,
        10,
        10,
        9,
        13,
        9,
        11,
        12,
        9,
        11,
        10,
        12,
        10,
        15,
        9,
        15,
        12,
        13,
        12,
        16,
        11,
        12,
        11,
        10,
        24,
        12,
        24,
        27,
        29,
        29,
        27,
        15,
        17,
        15,
        17,
        33,
        34,
        33,
        48,
        37,
        59,
        52,
        34,
        49,
        65,
        63,
        69,
        65,
        64,
        81,
        81,
        84,
        110,
        141,
        127,
        126,
        127,
        139,
        139,
        156,
        152,
        207,
        197,
        133,
        119,
        44,
        56,
        96,
        63,
        103,
        114,
        121,
        137,
        146,
        121,
        141,
        148,
        203,
        318,
        208,
        96,
        107,
        99,
        56,
        53,
        62,
        52,
        31,
        42,
        38,
        29,
        39,
        40,
        22,
        25,
        30,
        34,
        36,
        36,
        28,
        44,
        43,
        37,
        55,
        70,
        66,
        54,
        69,
        85,
        107,
        168,
        188,
        500,
        500,
        500,
        500,
        500,
        500,
        500,
        500,
        500,
        500,
        500,
        500,
        500,
        500,
        500,
        500,
        500,
        500,
        500,
        500,
        500,
        500,
        500,
        500,
        500,
        500,
        128,
        102,
        117,
        500,
        500,
        500,
        500,
        500,
        500,
        500,
        500,
        500,
        500,
        500,
        500,
        500,
        500,
        500,
        500,
        500,
        500,
        500,
        500,
        500,
        500,
        500,
        500,
        500,
        500,
        500,
        500,
        500,
        500,
        500,
        500,
        500,
        500,
        500,
        500,
        500,
        500,
        500,
        500,
        500,
        500,
        500,
        500,
        500,
        500,
        500,
        500,
        500,
        500,
        403,
        500,
        500,
        500,
        306,
        427,
        500,
        500,
        500,
        440,
        159,
        500,
        500,
        500,
        500,
        500,
        500,
        500,
        500,
        500
    ],
    "durations": [
        1.464984,
        0.021999,
        0.006,
        0.003,
        0.003,
        0.003001,
        0.003999,
        0.002999,
        0.003,
        0.003003,
        0.002998,
        0.003002,
        0.004998,
        0.002999,
        0.004004,
        0.002996,
        0.004002,
        0.003998,
        0.004002,
        0.004998,
        0.003001,
        0.003,
        0.002001,
        0.003,
        0.004,
        0.003,
        0.003,
        0.003,
        0.004001,
        0.004001,
        0.002998,
        0.004,
        0.003999,
        0.003001,
        0.002999,
        0.004,
        0.005,
        0.005002,
        0.003001,
        0.005999,
        0.005,
        0.007,
        0.004001,
        0.004,
        0.01,
        0.009999,
        0.021,
        0.009,
        0.008001,
        0.005001,
        0.005001,
        0.004,
        0.004,
        0.003999,
        0.003002,
        0.003,
        0.003,
        0.002999,
        0.003,
        0.005002,
        0.005999,
        0.002999,
        0.003,
        0.003001,
        0.005,
        0.003999,
        0.004001,
        0.003007,
        0.004,
        0.004999,
        0.005,
        0.003001,
        0.003001,
        0.004998,
        0.003001,
        0.002999,
        0.003002,
        0.002999,
        0.004,
        0.003007,
        0.004,
        0.004001,
        0.004001,
        0.002999,
        0.006,
        0.002999,
        0.003,
        0.003,
        0.004,
        0.003,
        0.002999,
        0.002,
        0.003003,
        0.003002,
        0.003999,
        0.002999,
        0.005003,
        0.003998,
        0.002999,
        0.003,
        0.004,
        0.002999,
        0.003001,
        0.003999,
        0.003001,
        0.003,
        0.003,
        0.003999,
        0.002999,
        0.004002,
        0.004001,
        0.003999,
        0.003999,
        0.004002,
        0.003998,
        0.004001,
        0.003001,
        0.004,
        0.002999,
        0.003,
        0.007,
        0.003,
        0.006001,
        0.007999,
        0.009001,
        0.007999,
        0.008001,
        0.004,
        0.005001,
        0.004,
        0.004001,
        0.009999,
        0.01,
        0.009,
        0.013,
        0.010001,
        0.017,
        0.015,
        0.01,
        0.013999,
        0.019001,
        0.018,
        0.019001,
        0.017999,
        0.018,
        0.023002,
        0.022998,
        0.023,
        0.031,
        0.039,
        0.034999,
        0.034,
        0.035,
        0.038003,
        0.038,
        0.042999,
        0.041999,
        0.057,
        0.055001,
        0.036999,
        0.033999,
        0.012,
        0.016,
        0.026001,
        0.017003,
        0.027986,
        0.031,
        0.034999,
        0.037999,
        0.04,
        0.032997,
        0.039003,
        0.040999,
        0.057,
        0.089002,
        0.057998,
        0.027001,
        0.029,
        0.028,
        0.016001,
        0.015999,
        0.017001,
        0.014001,
        0.008998,
        0.013,
        0.011,
        0.009004,
        0.010998,
        0.011003,
        0.005996,
        0.007003,
        0.007999,
        0.010002,
        0.009999,
        0.01,
        0.007999,
        0.013,
        0.012001,
        0.010999,
        0.015,
        0.020003,
        0.018983,
        0.014999,
        0.019002,
        0.024001,
        0.03,
        0.045999,
        0.051953,
        0.141998,
        0.140002,
        0.141997,
        0.139003,
        0.142001,
        0.141998,
        0.143002,
        0.139001,
        0.141,
        0.139999,
        0.139999,
        0.139987,
        0.142998,
        0.140001,
        0.141,
        0.141001,
        0.139986,
        0.140001,
        0.143,
        0.141002,
        0.140998,
        0.141001,
        0.14,
        0.141001,
        0.141999,
        0.140001,
        0.035,
        0.028,
        0.033,
        0.143,
        0.139999,
        0.141,
        0.141,
        0.139998,
        0.140999,
        0.143,
        0.14,
        0.140002,
        0.140999,
        0.140001,
        0.142002,
        0.142999,
        0.142002,
        0.142996,
        0.140999,
        0.139998,
        0.140001,
        0.139999,
        0.142,
        0.139988,
        0.140985,
        0.141002,
        0.146,
        0.140002,
        0.138998,
        0.138999,
        0.141,
        0.138,
        0.136999,
        0.136004,
        0.138001,
        0.137999,
        0.136997,
        0.144001,
        0.138,
        0.137001,
        0.138,
        0.136002,
        0.137002,
        0.135001,
        0.138,
        0.137001,
        0.139001,
        0.137999,
        0.137001,
        0.135996,
        0.137,
        0.136001,
        0.138,
        0.107999,
        0.136003,
        0.136998,
        0.136999,
        0.082,
        0.114998,
        0.136987,
        0.137002,
        0.138,
        0.119001,
        0.042,
        0.137999,
        0.135999,
        0.136,
        0.137999,
        0.139002,
        0.139999,
        0.136999,
        0.138003,
        0.136998
    ]
}