episodes,steps,rewards
0,93,-122.33106737312073
1,78,-86.31689527064002
2,67,-123.45928362902713
3,82,-153.49515980542816
4,105,-69.57764044691197
5,103,-411.8588240085489
6,65,-109.37751253871538
7,139,-150.97429698706097
8,142,-140.41493282771683
9,87,-246.65114474866823
10,105,-148.38595348932756
11,121,-96.38858771346513
12,188,-628.4493958709787
13,156,-269.23491898072075
14,93,-133.3676913709365
15,144,-241.72855679425106
16,196,-257.0117135043629
17,1000,-202.6214514249914
18,1000,-36.4939125768785
19,193,-143.66793455125833
20,1000,-118.58984251689817
21,127,-153.65644243933428
22,101,-218.70305568492216
23,130,-94.80367889699724
24,158,-268.5679249214338
25,119,-327.4999817438645
26,107,-308.44264799706616
27,529,-299.3376230786245
28,87,-295.8282118121946
29,94,-236.93677873411107
30,1000,-256.91288509803184
31,457,-260.3754788504816
32,335,-280.66147332525827
33,185,-338.69783506489125
34,263,-249.44964138107815
35,217,-231.2678087945807
36,220,-244.61988875666538
37,153,-229.1083527966032
38,110,-220.7329491698287
39,609,-340.3655249689803
40,446,-264.1973727162453
41,392,-288.53627172871984
42,920,-309.5056592709529
43,598,-301.435840677069
44,654,-204.14673509100186
45,131,-488.732539959889
46,718,-305.26149430390154
47,643,-314.62581105188696
48,298,-232.69375470788435
49,149,-169.64795617656515
50,256,-194.31196517264317
51,823,-321.87610790951294
52,330,-181.1319792440305
53,373,-245.98701928485855
54,368,-208.24284684772994
55,452,-259.51988391157056
56,255,-135.42743329022568
57,253,-178.09972713718457
58,274,-224.6917398657903
59,1000,-210.10619779705408
60,1000,-211.78917048468693
61,1000,-165.88549620437448
62,1000,-143.29628230842692
63,1000,-175.4536974743509
64,1000,-162.41486569849442
65,1000,-75.27132669295995
66,1000,-106.63992501332304
67,766,-212.41489967172743
68,1000,-130.47686969668467
69,1000,-112.09169666186492
70,1000,-172.7466368160257
71,1000,-169.19796069605204
72,1000,-136.34621818593357
73,1000,-141.00699205628777
74,1000,-132.00517758320612
75,1000,-117.92101374245978
76,693,-178.48826463564023
77,1000,-143.94312466106837
78,1000,-119.5496686695335
79,1000,-151.5321157307141
80,1000,-131.03917156066458
81,1000,-161.09280363584378
82,1000,-174.21061645093425
83,313,-177.45199150130946
84,206,-129.588496360146
85,160,-142.31199638308587
86,1000,-135.08811873541117
87,1000,-94.11399244583222
88,787,-147.97425940763756
89,147,-105.68521249490385
90,1000,-111.1842451027657
91,1000,-121.18178277208615
92,433,-171.80222164518875
93,138,-121.86227428634962
94,112,-146.0672410381123
95,113,-143.60196465829304
96,922,-316.52076665923937
97,533,-158.6870985747902
98,715,-244.03993741677502
99,1000,-145.43623462162415
100,1000,-88.09957721907756
101,1000,-125.09545065636634
102,1000,-34.93744910215338
103,1000,-114.43768605165977
104,977,-325.40869483516235
105,326,-149.32081210334803
106,271,-220.5885619959828
107,190,-185.6234488402375
108,221,-205.20301444979395
109,344,-172.49719926662817
110,388,-126.13014940735498
111,1000,-122.7279893964472
112,1000,-64.42285808097563
113,1000,-104.09200845235264
114,965,-343.1288310355296
115,1000,-142.5688987847691
116,708,-198.09296458707638
117,539,-204.98278970299828
118,413,-206.10380378735744
119,1000,-101.48412745954194
120,1000,-108.38224507471445
121,1000,-61.039295838608744
122,105,-205.02675268332501
123,1000,-71.54979768960644
124,1000,-180.42650825700804
125,842,-210.86501623916035
126,488,-147.01747629486442
127,1000,-160.25007280431444
128,1000,-129.29295733066738
129,1000,-96.18313719061571
130,738,-210.62809568390162
131,1000,-133.71902635598806
132,1000,-155.73859622210145
133,1000,-178.2491198693792
134,1000,-118.54586799004653
135,1000,-159.90925590689508
136,1000,-168.4707433397338
137,1000,-102.75296229186583
138,1000,-89.68686967714861
139,1000,-110.91839872157996
140,1000,-110.23805355086071
141,1000,-114.63344806308196
142,1000,-129.763200949032
143,1000,-134.6445416303874
144,157,-220.27228204548072
145,1000,-121.18756946412515
146,1000,-113.44150190942713
147,1000,-45.63186476116091
148,1000,-74.79321670008588
149,371,-162.05813684288756
150,584,-248.87753942755916
151,1000,-92.4993713686463
152,172,-180.00024902737323
153,1000,-143.44150447359175
154,381,-194.66640400296006
155,476,-191.15751142520799
156,401,-146.41540711287323
157,689,-178.62413085163934
158,453,-195.46203504208304
159,532,-180.3638873945784
160,717,-202.7506307316943
161,1000,-66.10433914091662
162,901,-90.37678797507641
163,418,164.30263942132984
164,369,-121.54651191919669
165,380,-158.87788373583064
166,223,-247.4343571385293
167,101,-139.97710492184927
168,140,-169.98524173381367
169,522,-138.72883963784585
170,513,-238.2205041906546
171,1000,-48.673433271530634
172,1000,-67.31525606699115
173,1000,-89.43991715355592
174,348,-116.09787980333945
175,1000,-46.16642616680012
176,1000,-51.704019540823005
177,1000,-57.119442338382996
178,136,-79.63015622071656
179,1000,-47.01724591647313
180,1000,-39.39313570287339
181,1000,-26.250494189744842
182,215,-82.84266436953163
183,452,-133.3527239122183
184,348,-83.06398149498027
185,347,-56.317716162627335
186,1000,-101.17926052876936
187,1000,-104.8431842439788
188,1000,-111.2806082916235
189,1000,-116.11732025826151
190,1000,-83.47637618437034
191,1000,-70.15241879191959
192,1000,12.21296804274677
193,500,-258.47207519723656
194,954,133.46182924324634
195,1000,-48.077169836041826
196,1000,-99.41888860984943
197,666,-129.73756903076446
198,955,-411.1849401167082
199,1000,5.3592589541941855
200,976,-174.1264623926603
201,173,-179.15158740306754
202,1000,-6.709300721616508
203,529,-182.15376243197645
204,1000,-14.981907393711431
205,1000,-130.34065658220194
206,1000,-84.19048746265638
207,1000,-89.2604830382412
208,1000,-119.41920402536392
209,1000,-72.03099499374913
210,569,-50.334601982354286
211,669,-101.12971992867512
212,552,-188.60128876062106
213,298,-48.444768648409124
214,1000,-87.59733342277282
215,806,-306.2247660375906
216,204,1.4462397706413697
217,203,-13.445016740778541
218,980,107.07926451087111
219,185,-85.7353199022501
220,348,-109.74765597863794
221,191,-27.67451335385772
222,280,-283.2426149013409
223,494,-368.8250035122636
224,218,-223.292676846471
225,191,-194.80428132913372
226,1000,-60.89501595200814
227,1000,-93.2157907194355
228,1000,-103.15129790779748
229,778,-399.6634503206385
230,1000,-106.98147549658395
231,144,-184.71640028357427
232,1000,-74.28913668770893
233,1000,-142.92430828680943
234,1000,-153.88225151590183
235,743,-414.5428601063937
236,254,-285.29782025221743
237,1000,-153.0408518677458
238,1000,-64.04644682618257
239,237,-292.39495561218575
240,189,-233.05499728142138
241,1000,-103.24816062561928
242,303,-329.19817126402063
243,392,-692.2828323965713
244,1000,-240.88569309451705
245,1000,-141.0854458663204
246,1000,-152.3493155365474
247,1000,-125.7687359092683
248,1000,-123.267631274199
249,1000,-147.67149796135968
250,1000,-100.45145636706896
251,1000,-97.94347425718644
252,1000,-61.06639568089705
253,122,-256.0359386997054
254,1000,-89.23566549041495
255,1000,-151.95648478533298
256,802,-289.5158733826412
257,1000,-112.63350546209566
258,1000,-79.44319477482598
259,1000,-127.66107708115548
260,1000,-58.47953411038847
261,1000,-86.81394959248341
262,1000,-148.39754706981995
263,1000,-87.14668540806817
264,1000,-127.063793750621
265,138,-549.784042212624
266,1000,-91.70361925277916
267,1000,-75.09168925679735
268,1000,-73.84845962448401
269,1000,-88.11503080811627
270,1000,-88.39591810991682
271,345,-185.7307503501816
272,1000,-97.43781707485657
273,1000,-92.59912719490602
274,1000,-91.9328773888288
275,1000,-63.9355226860566
276,1000,-133.99540585733033
277,1000,-98.21794257504958
278,1000,-157.64025791279357
279,1000,-90.40562829135591
280,1000,-94.01431919116713
281,793,-237.36829664431062
282,1000,-107.2729260678876
283,1000,-122.23872814148544
284,1000,-164.5586307818392
285,1000,-82.66003181383374
286,1000,-68.3296480001739
287,1000,-158.9289905709688
288,1000,-125.98944779271939
289,1000,-95.51078074119755
290,1000,-75.9371873055857
291,691,-627.723234798798
292,329,-309.02787220419077
293,137,-295.075392414412
294,263,-192.2095856909104
295,184,-312.77752188831374
296,156,-244.51394196367156
297,1000,-158.60277731881772
298,843,-475.8460539535094
299,144,-269.399651103014
300,135,-239.11408001307018
301,1000,-131.86068242008307
302,1000,-129.19424793096178
303,1000,-141.49562225950737
304,1000,-168.30295435359767
305,1000,-134.6678185824369
306,1000,-160.28760586957233
307,1000,-157.3067330779678
308,415,-416.807923011673
309,201,-460.1311253273417
310,191,-465.17657719065926
311,340,-243.3150974770502
312,1000,-322.9101720495019
313,1000,-295.18938828132656
314,1000,-307.6069613363219
315,1000,-183.99398155592323
316,1000,-222.4224803870871
317,1000,-182.26774061803192
318,1000,-210.99720576087796
319,1000,-141.17092279473292
320,1000,-127.73459583751985
321,1000,-124.50668774174234
322,1000,-94.70310927094809
323,1000,-115.20831935019801
324,1000,-72.00815567718082
325,1000,-112.49578768607395
326,1000,-87.2781811488926
327,1000,-90.78244315410721
328,1000,-126.24391465283401
329,1000,-124.04306991416458
330,1000,-112.75967239934255
331,1000,-111.65090712490675
332,1000,-59.05186955291537
333,1000,-86.54111057076078
334,1000,-140.66995704180556
335,1000,-172.00548217415428
336,1000,-96.64388377244906
337,1000,-146.51465318298617
338,1000,-157.24031186228257
339,1000,-129.64323003095808
340,1000,-22.457409030017732
341,1000,-88.06657083454803
342,1000,-69.29873204570423
343,1000,-68.05571726260729
344,1000,-39.243752551679194
345,958,-181.78754741297996
346,187,-95.5886879012061
347,355,-144.84395397258515
348,316,-229.38414752762918
349,1000,-128.28102138044227
350,1000,-9.965823491552674
351,1000,-70.00968566826654
352,1000,-41.69053432947473
353,177,-404.5273508521013
354,167,-425.8995320246047
355,257,-314.09899273390454
356,340,-367.41004793068714
357,384,-389.83984826519156
358,527,-369.1755887388128
359,986,-545.795550223597
360,1000,-223.40740394868678
361,1000,-194.54794855894917
362,887,-338.9320660335548
363,218,-301.1542307732176
364,104,-300.58031138634556
365,190,-321.1848078718008
366,286,-325.5677896939419
367,635,-357.93564550909434
368,321,-428.7844174976555
369,317,-462.8261514624811
370,164,-292.18022940571814
371,448,-227.33555278123657
372,326,-231.9861736502229
373,897,-244.79880715158356
374,1000,-110.2713631784008
375,1000,-149.94197356463334
376,1000,-155.5231746775051
377,1000,-148.35967103347053
378,1000,-121.62811696558967
379,1000,-105.8531264262609
380,1000,-120.05327488907307
381,1000,-134.22203632036306
382,1000,-108.2879915252514
383,1000,-108.1614822110267
384,1000,-129.5875763026017
385,1000,-73.30900981293269
386,1000,-84.80462522657695
387,1000,-57.92555450049339
388,1000,-121.56325611296153
389,1000,-127.37634198966782
390,1000,-98.94384738519933
391,1000,-113.20141360380269
392,1000,-76.60430688547795
393,1000,-89.00021015786197
394,1000,-137.0134169771966
395,1000,-103.06780458408359
396,1000,-85.10863071014674
397,1000,-118.39849230736023
398,1000,-101.4421138561691
399,1000,-102.13134801368285
400,1000,-107.95408411187285
