episodes,steps,rewards
0,96,-315.457069045773
1,81,-339.77215791257674
2,91,-236.5090901118443
3,88,-150.13256010610348
4,120,-167.52183778896938
5,91,-134.51506818438176
6,78,-132.10076585939356
7,100,-227.1144481726601
8,107,-194.99251031709463
9,90,-88.44846332173823
10,86,-175.1456226064252
11,119,-132.88955444693352
12,171,-95.43211397838856
13,1000,-95.3567182696114
14,333,-61.44019604698987
15,186,-101.01525902909657
16,1000,-96.90075251114791
17,931,-543.0516328312283
18,633,-359.9227371189544
19,120,-240.56223486594533
20,1000,-108.34407143564403
21,1000,-82.23766295265652
22,1000,-67.15367936177289
23,1000,-67.16775235482625
24,1000,-71.98272651724457
25,1000,-32.80193766516295
26,1000,-38.652866862538744
27,333,-198.80525357431264
28,1000,-1.4376810228317016
29,1000,-39.50499775910265
30,687,-354.7705142846968
31,117,-201.32949786759474
32,1000,3.0091636392782473
33,1000,-67.92886938643608
34,1000,13.802258835910493
35,1000,-20.543810235316894
36,1000,-8.456435941617555
37,125,-90.69063060895306
38,91,-249.10275647378728
39,1000,19.432785000117935
40,1000,-72.89597129316361
41,220,-7.677938306567725
42,117,-258.8977357135747
43,276,-34.84673869042507
44,1000,113.56533873344992
45,1000,-27.581214156721046
46,1000,95.91096715903598
47,1000,-12.704502268844003
48,214,-84.81773864457008
49,1000,-53.894349163107954
50,144,-91.32928342548409
51,1000,-4.302873900331555
52,1000,-35.03954636292252
53,378,-137.96811290335754
54,1000,1.2623841214210794
55,1000,-15.362294030309739
56,1000,-34.91878925359664
57,228,-37.110232536793276
58,1000,17.05198662326828
59,267,-11.765891041940733
60,1000,-6.760328370823472
61,113,-3.3605498484474907
62,1000,-38.48153032031571
63,1000,-19.040239606169624
64,1000,8.353973186761259
65,92,-92.4254179627434
66,358,228.58653566109749
67,1000,7.579234636675144
68,1000,-21.023682204808804
69,884,119.08204507530911
70,136,-77.93047034554738
71,1000,5.567926728624135
72,1000,-33.18337335279501
73,1000,-158.89755366870097
74,1000,-6.3132270914840465
75,656,225.90260833894
76,991,156.02293731464547
77,425,228.42670146028857
78,966,192.05561620582355
79,1000,1.6233328298073948
80,791,174.70048408847242
81,1000,32.096117245517554
82,243,-60.20698737765372
83,363,215.18242122116197
84,185,-42.798803365654436
85,203,-34.340004759127
86,1000,-40.58524355931203
87,441,-89.03402203987059
88,775,222.85518537193423
89,424,223.37386090037762
90,410,226.94132988036083
91,460,140.48114008236297
92,861,137.10598812099323
93,559,233.4081700717012
94,1000,-82.51156914799509
95,586,207.12105711467575
96,435,266.8572312301177
97,1000,-104.74027800236789
98,470,249.65708639819246
99,971,-228.133136821872
100,1000,53.07941613923788
101,685,-67.6338501636186
102,450,215.5348478771176
103,225,-15.398610866130923
104,622,216.51561965501133
105,501,213.36685803824565
106,472,207.7784455330171
107,451,249.62826920347038
108,652,204.744882502086
109,444,235.68133716065952
110,608,210.2182124358111
111,468,217.18120382102063
112,769,170.92935936009962
113,354,239.66813297093947
114,669,234.0153153004523
115,302,243.68805771218948
116,356,270.5767726419332
117,585,237.91229232836616
118,345,241.36183015413087
119,416,32.13096493310812
120,563,259.6898691286494
121,437,241.40809736481177
122,369,229.80102030375355
123,821,195.86164359646753
124,451,247.98561236135538
125,594,-69.50551132389101
126,790,130.41305220592972
127,343,247.88987727726285
128,844,126.62538881124951
129,254,46.03181576886681
130,571,212.011603558118
131,544,220.50120573979052
132,544,267.00428749115474
133,350,219.51313494731565
134,634,224.9480084744172
135,617,192.4672313372031
136,335,-19.676323890752954
137,245,3.108885647745879
138,381,-71.63923848802864
139,237,-25.367652013528755
140,381,254.36491633036346
141,375,256.7203273319624
142,1000,59.026201455531314
143,488,-30.66756089520996
144,471,-93.44200101362914
145,337,270.88444627000564
146,442,235.03255343110496
147,642,-201.78567282714027
148,297,0.7880042122910851
149,469,215.3788243334182
150,244,-15.168343405747024
151,391,244.7489097903003
152,1000,-5.872510049049474
153,669,205.99479320530492
154,308,265.03236625912484
155,324,261.5147767350018
156,224,273.97489707461875
157,701,208.60844206293086
158,485,197.86672119104955
159,625,166.52995741366453
160,427,229.39734715732433
161,651,214.4589273005685
162,494,171.26233503731106
163,258,259.3303974288253
164,996,245.49817311700144
165,252,264.32296131561236
166,295,263.0694032062943
167,293,203.2332975216368
168,227,286.3077204940183
169,476,217.90724504744725
170,295,251.2533319572805
171,523,243.62026519783007
172,620,202.66217032507197
173,319,263.61683942187125
174,630,212.02984406508494
175,150,32.176653101434965
176,272,267.32631542988827
177,285,277.71709835373053
178,237,302.5107852347396
179,466,270.2530888146803
180,737,206.20949731844877
181,301,279.7127853629136
182,1000,30.92697460526948
183,684,187.617162064488
184,792,167.19386364073907
185,327,286.30080847683575
186,484,242.47243095784964
187,180,256.57808177860477
188,811,189.06619032843005
189,395,247.42281864586167
190,218,260.0064482790858
191,303,-0.36466773002800323
192,619,200.27587174470474
193,257,286.2334676839183
194,455,-296.4255340464677
195,128,-89.35985009560693
196,545,278.3245574596558
197,1000,-28.906013653373883
198,296,288.885105650381
199,319,267.84793925238296
200,311,-56.409154680343555
201,490,216.90790091063246
202,709,195.51125780019936
203,482,259.52058489642593
204,927,134.250320433792
205,167,-124.18607574435725
206,233,225.53526447590303
207,121,-50.61309765806446
208,250,286.8512497316764
209,1000,22.728140873130638
210,391,218.67537544134788
211,396,213.72922774854885
212,677,-188.04286609570318
213,572,167.12278863127912
214,200,269.704833518971
215,282,265.264899927682
216,219,260.5147044462944
217,369,217.41003850564047
218,123,74.9812060113812
219,248,274.06046026101626
220,1000,25.37100481771321
221,284,227.59078559926826
222,225,243.6210460387315
223,260,238.1246981397769
224,293,33.796878278393706
225,331,268.10572332381264
226,263,278.5519193259272
227,440,223.02697744541166
228,234,270.1968175781156
229,361,253.30428372473895
230,217,278.02346589977526
231,340,295.21357523066763
232,431,248.56937378218691
233,1000,-51.240787480500884
234,193,-116.04455118887363
235,328,168.09949758934013
236,341,297.36457210284686
237,383,233.3383862651652
238,387,267.18111341110966
239,276,251.98342911425334
240,361,-85.46361280859823
241,877,156.00009969399278
242,371,-46.454498042269286
243,545,266.78627741331434
244,1000,144.34688682279867
245,1000,-130.51667989229713
246,307,244.89265815740796
247,254,-167.79922831654466
248,304,254.50251373955012
249,191,44.629942280574454
250,297,235.68574924796064
251,322,275.1434642623975
252,213,270.70515655973367
253,367,274.43470117351706
254,1000,-38.076175526504585
255,301,271.36597689643077
256,207,268.3237384664602
257,361,276.31949441326674
258,680,197.598511840919
259,314,234.75467075508718
260,643,228.04568598190443
261,207,233.77798762791517
262,289,273.45366145387146
263,309,290.8364272590619
264,310,282.48967944462584
265,218,269.0345325879283
266,330,232.28168839734684
267,272,275.2107761934583
268,312,239.04236432114254
269,150,-69.45711785235795
270,1000,120.239157174852
271,224,17.045973300536133
272,197,-168.75171989328072
273,220,-310.6177321235522
274,522,183.52935604935658
275,429,236.38277864593178
276,1000,41.09085734497569
277,646,229.57804531977231
278,386,283.8493835389461
279,329,231.32287163825276
280,256,304.9698333548091
281,355,204.20656622385545
282,331,8.069388542602212
283,530,-546.0462443560664
284,280,252.2665817837173
285,1000,-20.196945156823816
286,469,274.92048480583236
287,620,143.1839436082693
288,256,-6.2982883176295985
289,353,-75.45068408423955
290,554,255.641500468742
291,347,245.71693566067043
292,618,232.54140301885522
293,555,206.2359624603841
294,839,182.7673454159498
295,562,258.0806642473485
296,178,284.20018834560744
297,444,218.93211237383977
298,486,257.2477476777867
299,321,241.21275881360302
300,345,240.9335568074842
301,385,288.3776311051208
302,493,266.69814146742
303,164,3.899561217388637
304,227,275.35767935702256
305,355,297.52973760311477
306,329,260.3114456726646
307,508,253.5212266681424
308,345,212.47149044844406
309,282,245.6291026007108
310,248,262.7573668094125
311,346,276.0844685864127
312,255,283.8950393866255
313,228,244.41589734267154
314,431,191.59951291654903
315,431,210.16219840071255
316,291,243.99811410250703
317,198,288.4808870119773
318,354,234.7500135496039
319,263,279.8380365126618
320,232,275.57126023131207
321,210,295.1354027436005
322,347,244.68430647612223
323,329,278.08720245796417
324,426,204.3706859131688
325,369,211.66586850379426
326,273,250.19037240586016
327,215,298.45559792086055
328,231,239.52258968366198
329,220,219.7766535759159
330,236,256.42220993444107
331,453,280.3954291872333
332,387,234.1413025098646
333,317,275.5334636773432
334,298,276.0566902495277
335,299,256.91559089924965
336,247,298.0521942782025
337,554,251.416826914627
338,351,202.18395430179865
339,324,226.36539094318425
340,777,209.68183637848722
341,300,295.3543426029144
342,227,257.28928393101694
343,311,221.79266142244558
344,288,298.6910806189078
345,199,268.85939230245003
346,224,283.2644520367593
