episodes,steps,rewards
0,112,-74.73435026036938
1,107,-158.34824548326853
2,74,-77.44871014841306
3,89,-390.58201290529314
4,69,-93.98536598960406
5,66,-91.71931025162704
6,67,-76.64788666888984
7,92,-242.16852533354677
8,80,-333.0432614312347
9,89,-273.039096270371
10,73,-182.29829058178746
11,107,-453.03911498567413
12,69,-90.57168087076622
13,157,-135.43876355580352
14,180,-394.8610028088314
15,167,-65.0949170734449
16,107,-74.56294577134969
17,199,-11.183836372287573
18,1000,-85.4197331909821
19,1000,-48.290866309381094
20,1000,-88.670253248344
21,1000,-92.96328208191754
22,1000,-70.5521876400111
23,1000,-3.1988600042693065
24,1000,-59.960773516481304
25,780,-207.6916042549206
26,1000,12.099528155403421
27,1000,-18.333231884440085
28,582,146.4114399937458
29,1000,6.093395999919035
30,121,-191.57056673964485
31,773,-169.50112051457592
32,1000,-31.47470273905929
33,213,-95.47097275837719
34,1000,-82.12723654803959
35,1000,-104.01326391660159
36,1000,-106.11451320705321
37,1000,-85.59833852610106
38,1000,-143.19037531387096
39,238,-135.78302909446205
40,255,-105.18745891872533
41,538,-466.7815875498097
42,166,-188.22934296761983
43,1000,-261.4746202632168
44,1000,-105.93510321840893
45,1000,-181.49589358500887
46,1000,-83.07255274265002
47,1000,-162.665905283555
48,1000,-88.753362832396
49,1000,-32.59327021425915
50,120,-190.41861112832672
51,399,-333.1573035259903
52,1000,-239.5139587866188
53,1000,-124.50022073687732
54,377,-126.25234533442034
55,1000,-145.04702019944497
56,1000,-108.37024525669725
57,146,-135.2724677567847
58,296,-173.08268905902662
59,1000,-154.5867650530291
60,1000,-106.2289023148941
61,1000,-48.69342854669388
62,1000,-44.58430860939194
63,1000,-136.3503999301889
64,456,-91.3384319961215
65,654,-294.41659954209547
66,119,-115.59699684134286
67,618,-392.0322109443591
68,1000,-143.1832525606687
69,470,-316.0906005097603
70,247,-515.5233111153705
71,337,-103.90822525485957
72,1000,-94.34397769827994
73,1000,-86.84986381135309
74,1000,-83.81370149972341
75,1000,-159.23289922570433
76,1000,-92.79869765157254
77,245,-357.75148582652776
78,1000,-118.01612796776786
79,1000,-87.80432125368267
80,1000,-73.59800941551589
81,1000,-119.34884256673682
82,1000,-94.85255899715716
83,1000,-84.54183044388972
84,1000,-144.0619558975104
85,1000,-81.07814939615358
86,1000,-119.09234402842002
87,854,-225.48861980253997
88,984,-221.02989538238205
89,1000,-97.14376099617579
90,1000,-147.30076157500196
91,1000,-107.223528731102
92,175,-96.0283659895251
93,1000,-179.2611709945903
94,1000,-137.25780605757734
95,1000,-156.95317752338744
96,1000,-65.31617692393465
97,1000,-106.10454180891861
98,1000,-133.54762215248402
99,1000,-140.6879893804096
100,1000,-132.20507909530505
101,1000,-122.43142303950977
102,1000,-93.07324590332466
103,1000,-105.64695339602112
104,1000,-106.91704428470166
105,1000,-104.00934096959702
106,1000,-86.06079147428925
107,1000,-122.11842200804625
108,1000,-98.88893531295572
109,1000,-88.76885201396416
110,1000,-155.3794752113282
111,1000,-120.62000861294908
112,1000,-102.22964974314696
113,1000,-139.5313581229595
114,1000,-104.95513395104192
115,1000,-134.18085439766003
116,1000,-65.54158598158732
117,1000,-75.95334020400912
118,1000,-96.92018340811774
119,1000,-97.5387716978497
120,1000,-78.20848745290999
121,1000,-138.39758879308707
122,1000,-169.69069669388253
123,849,-315.6119247692568
124,98,-244.7988895869915
125,1000,-165.73854497987261
126,1000,-155.53631448191402
127,1000,-152.9378252418283
128,1000,-94.07907705889474
129,1000,-93.32219270725932
130,1000,-124.25387245143033
131,449,-276.08692525641436
132,1000,-120.28602342941353
133,320,-196.25178241113076
134,361,-180.9898326827918
135,1000,-149.21993946060286
136,1000,-130.5345500540544
137,1000,-111.10521342479726
138,1000,-107.09801494603097
139,1000,-116.79390633641206
140,1000,-137.4031900392521
141,177,-191.70633091581854
142,757,-347.34337879382565
143,693,-243.3953592414083
144,235,-129.25320047002617
145,106,-213.6418929488985
146,1000,-179.3388293526058
147,1000,-152.399467596344
148,1000,-163.77800362317475
149,1000,-150.30645281201825
150,1000,-123.53761697413597
151,1000,-161.5788479592061
152,1000,-157.96358349405315
153,1000,-173.28384193358875
154,1000,-199.3539931146293
155,1000,-177.90980322093927
156,1000,-194.6555275438345
157,1000,-140.02007055340286
158,1000,-148.83449871428496
159,1000,-171.67215917429212
160,729,-136.0711335934285
161,1000,-169.88938568347263
162,1000,-189.92991479624126
163,1000,-130.22882558797588
164,204,-261.5355934657635
165,1000,-171.8257936892943
166,83,-282.75289956619434
167,1000,-91.61384091870005
168,754,-259.37268072154484
169,1000,-41.604649863939215
170,877,-141.8307866324344
171,218,-248.80645604283103
172,1000,-97.64713900046455
173,1000,-63.31835172057701
174,1000,-64.17075919794434
175,1000,-58.887509085319785
176,1000,-2.390205288108889
177,1000,5.768043269049704
178,253,-356.94331331257524
179,90,-12.250645129814657
180,171,-128.2642241814507
181,153,-255.20859842272523
182,138,-358.99866742402844
183,1000,-66.04188305580881
184,1000,-28.94190817595248
185,1000,-80.49730981652166
186,1000,-43.821140151746626
187,1000,-30.347862154326045
188,1000,-17.361004571700445
189,1000,-22.223410430757333
190,176,-106.74536427180254
191,257,197.0955221087659
192,363,-250.7034946892228
193,155,-245.69875393245312
194,137,-501.76122900781087
195,286,-306.07823075544917
196,214,-291.21805482030004
197,665,-295.3582898550189
198,387,-281.1234339325422
199,1000,-43.210145739841444
200,1000,-149.80868312459697
201,648,-271.73435496153945
202,1000,-169.5764995380089
203,233,-355.6986971375882
204,1000,-132.40168487756966
205,208,-122.44192403040773
206,1000,-122.4022202927812
207,1000,-111.09012050385749
208,1000,-116.46591057844039
209,1000,-70.48232484020225
210,1000,-61.69516665277056
211,1000,-77.71631964547291
212,1000,-36.25633289687748
213,1000,-152.15405157496966
214,485,-412.3828520855872
215,308,-389.4612990709273
216,1000,-311.24086316016724
217,248,-355.4492517944732
218,188,-80.14205276764031
219,308,-278.161638359117
220,604,-359.68382601723323
221,1000,-117.65821262222654
222,1000,-231.34499995541384
223,1000,-105.55595560968636
224,648,-141.59018276491065
225,1000,-129.50260794003742
226,1000,-47.214121958775934
227,817,-194.75040922540907
228,1000,-76.22946522984682
229,1000,-58.52685479973984
230,1000,-115.83660061764516
231,199,-120.5958246096748
232,310,-65.60498180607999
233,577,-60.24196406276837
234,332,-52.68935147733032
235,332,-455.4723608465366
236,134,-124.24160897940644
237,91,-284.5867820298418
238,123,-211.0232395345832
239,229,-320.67032117072455
240,179,-639.0832104509808
241,254,-109.24313250137097
242,500,-188.3187866727061
243,335,-240.85327670914455
244,244,-207.74227748158592
245,311,-196.04080390034855
246,785,-181.4197297429564
247,1000,-74.09535043673424
248,1000,-126.63169004876347
249,1000,-48.083238496663746
250,1000,-49.14388744715811
251,1000,-63.788235826922815
252,1000,-53.176235347767246
253,280,-384.77804010572913
254,1000,-59.66622481077707
255,1000,-84.30407746430012
256,1000,-79.64237315283162
257,714,-216.7441711411032
258,826,-201.4921840933485
259,1000,-91.28776308487573
260,1000,-118.58546585194817
261,1000,-60.80104511887811
262,1000,-87.69283624163319
263,1000,-68.11793021012299
264,1000,-72.68679676090454
265,1000,-117.12433750778447
266,1000,-144.9711890576952
267,734,-236.14117221543108
268,119,-262.2847215551472
269,388,-378.30342689107397
270,302,-332.0499891637386
271,532,-292.68860863338074
272,106,-224.71718409218062
273,952,-226.67720995074978
274,804,-192.08013910312565
275,144,6.0112478840611345
276,1000,-130.5650453841405
277,1000,-136.87682091949202
278,1000,-105.36399628791713
279,1000,-75.30660652404634
280,118,-201.26304272960323
281,1000,-77.3446584587933
282,1000,-227.24121301937558
283,146,-231.80921678139424
284,1000,-114.63468682680063
285,1000,-175.19681925774768
286,1000,-203.51732381790137
287,1000,-155.43068644363998
288,335,-190.71524189300834
289,1000,-112.53255707719714
290,1000,-102.65456650445216
291,182,-171.8004078584466
292,1000,-148.50653395128137
293,1000,-110.28602004382822
294,126,-173.4101809518594
295,1000,-95.07046822177016
296,1000,-263.0190994906038
297,1000,-63.57399225486004
298,1000,-205.91315552125099
299,199,-428.2111858009971
300,130,-490.5419167233798
301,337,-394.6947550827634
302,439,-211.06487605737027
303,101,-499.1634838823195
304,96,-584.6558408190103
305,96,-247.14604711657992
306,139,-412.4269188979139
307,110,-287.08181874989117
308,252,-494.8806353941495
309,111,-281.4320880046
310,284,-306.09952763781416
311,406,-555.9402836899749
312,422,-431.65957306157975
313,389,-319.65051292296926
314,387,-396.67910030923247
315,645,-430.00664623231853
316,183,-281.35820632289233
317,1000,-130.98105725770975
318,570,-341.7982854544435
319,707,-350.1265140720681
320,1000,-70.632332191513
321,1000,-304.9676288547749
322,1000,-152.62678053037553
323,257,-198.66853386217596
324,1000,-193.00948985317316
325,481,-187.84372579721492
326,752,-247.10683535060852
327,1000,-195.11812750344293
328,1000,-83.46787445419857
329,1000,-85.85957557225196
330,344,-273.7024974673201
331,1000,-98.16462715319692
332,1000,-81.78907027063617
333,343,-219.66882892097777
334,1000,-192.36393495074458
335,262,-96.26929197876363
336,1000,-173.1188221936799
337,1000,-112.42613092491742
338,1000,-110.68999982833262
339,392,-181.11825706454087
340,1000,-89.80409340326818
341,200,-181.5483212993845
342,806,-309.20008778689817
343,298,-377.63104627025643
344,236,-77.24435028742553
345,425,-469.0183287420968
346,544,-293.2585509185137
347,197,-207.81932836428138
348,1000,-252.46999714881753
349,1000,-88.20959606994651
350,1000,-100.25834240448165
351,1000,-50.13905958910577
352,1000,-85.95676631931549
353,1000,-71.77297595662014
354,1000,-103.76205974870969
355,1000,-165.50879603720244
356,1000,-49.28432356185472
357,1000,-95.97581627141317
358,132,-96.92474435535145
359,1000,-79.92549206629887
360,1000,-77.07212565533656
361,179,-312.9155170715346
362,1000,-103.12338318398744
363,140,-85.49641965844945
364,1000,-128.18580669833497
365,782,-314.03152111149063
366,181,-197.26614436908085
367,97,-237.5959162787937
368,206,-261.74054437479754
369,1000,-163.85513339676262
370,1000,-80.4229255637931
371,1000,-116.04136613091842
372,1000,-71.62020128447004
373,1000,-113.45111774254288
374,1000,0.5049889712668663
375,1000,-132.95941973913608
376,541,-109.42641766922507
377,1000,-75.5429939340517
378,1000,-53.199454637266804
379,1000,-61.75240316531165
380,1000,-46.75999364446757
381,1000,-198.97776664601662
382,111,-167.94573214435164
383,1000,-71.23033248790183
384,1000,-77.27243186632654
385,1000,-109.16228154295882
386,143,-133.93021216688572
387,443,-278.70654703610614
388,1000,-78.1446442213235
389,228,-93.89298288503902
390,1000,-97.52730501727073
391,1000,-103.9632847653
392,1000,-63.15415588182741
393,1000,-76.5420519406835
394,567,-737.4149420039365
395,998,-352.8578719877703
396,228,-222.14191385731453
397,332,-171.40972438575022
398,448,-242.20051110766644
399,206,-241.75231150294834
400,1000,-107.4912114350919
401,744,-374.97667569132057
402,1000,-123.31870375471613
403,483,-273.27634426272164
404,114,-57.02753975666832
405,254,-198.17509427438046
406,576,-251.4691179973014
407,341,-197.50027731791496
408,1000,-256.3637169677054
409,283,-196.8838620938408
410,270,-128.01542732088802
411,642,-511.1389958727175
412,208,-232.03638307367817
413,141,-130.13421796877125
414,102,-240.55166300428837
415,151,-311.24345884901993
416,239,-125.51599334488196
417,114,-243.91936428583386
418,117,-113.38204091945668
419,224,-348.4299832914288
420,684,-260.4900911563024
421,154,-144.17152288806088
422,93,-122.01720597351672
423,129,-102.50251663735497
424,432,-375.3231866738713
425,210,-58.29691080684748
426,354,-187.4407086413109
427,460,-219.94850533228242
428,509,-224.99154830649977
429,1000,-378.5570431832906
430,588,-184.05661304123706
431,883,-354.28650059420136
432,910,-258.9323216952108
433,530,-113.84281230671573
434,188,-36.96326342291552
435,55,-41.45927152247379
436,154,-70.83411085559928
437,128,-136.6406675188938
438,174,-10.780505364549342
439,168,-67.50629886409675
440,159,-115.61604142324376
441,424,-200.90834171586326
442,1000,-147.76040902486793
443,1000,-105.43900688065844
444,1000,-256.7831262328363
445,766,-368.39841498279225
446,683,-252.31393575122016
447,776,-331.81195062614734
448,1000,-221.89484313667987
449,1000,-92.52354670136519
450,947,-443.195205469989
451,289,-133.0674233254254
452,274,-255.0170250855735
453,446,-193.78801572875045
454,1000,-116.49049519525704
455,1000,-93.24521993921904
456,83,-144.41169911485798
457,346,-323.90158707228375
458,323,-106.98531010934516
459,955,-753.6795617097292
460,405,-225.86516808970117
461,327,-842.466185048104
462,563,-231.70860091780497
463,1000,-239.31498831103215
464,144,-33.30326591124329
465,97,-157.9714974056243
466,1000,-217.7552552290309
467,1000,-113.00310220015938
468,189,-452.6089378130568
469,799,-154.60224357939921
470,134,-215.60832613808495
471,133,-209.82061031660015
472,1000,-117.80269359664378
473,1000,-74.49774812292205
474,761,-274.50908570736186
475,645,-165.85942551694268
476,135,30.437833779331697
477,108,-459.83832260647
478,111,-237.2081454735507
479,186,-75.50626661962063
480,115,-529.296944595189
481,139,-264.87755840634816
482,114,-163.79673297118146
483,1000,-70.8455746514566
484,581,-157.0077072183965
485,196,-34.26241995306205
486,86,-14.098977605522947
487,1000,-143.02351142665947
488,155,-132.65279180651876
489,90,-181.5387909066426
490,645,-241.3376245573684
491,555,-517.732664023928
492,316,-71.63133328191978
493,1000,-217.45796301727592
494,231,-138.95516825855026
495,1000,-180.08302163876016
496,654,-212.61280092962986
497,585,-249.54615780994328
498,421,-198.67070670617204
499,181,-141.5449801609073
500,556,-137.97978381152805
501,570,-331.21446438639975
502,368,-160.61229014980782
503,464,-267.6077246476193
504,369,-152.7803883879998
505,295,-154.33467385513768
506,357,-254.21892986931476
507,514,-119.1313891654962
508,301,-256.9692208260707
509,846,-397.7144857548535
510,742,-379.94217858466163
511,459,-283.51195688086966
512,553,-248.28997344166612
513,272,-511.3749110251605
514,646,-89.92537835667503
515,957,-395.5560363060713
516,1000,-117.33461759234389
517,727,-169.80571191869558
518,178,-222.58214913136257
519,1000,-61.65506986715289
520,1000,-96.41438699866228
521,1000,-138.45126847150757
522,1000,11.739502459109772
523,1000,-51.915326154583305
524,452,-98.29565215981525
525,1000,-61.41983236840999
526,1000,-3.3928549271214656
527,1000,-53.36005416356344
528,146,-37.61345167042738
529,1000,-48.020786057210415
530,1000,-160.6417555358215
531,1000,-145.56989800793778
532,930,-321.6518736526699
533,316,-340.1175597365977
534,1000,-57.74799594183972
535,1000,-93.44715489342451
536,1000,-173.86744184971818
537,1000,-188.5313879622977
538,1000,-191.183763328642
539,254,-191.97342583744722
540,1000,-59.34068219284375
541,503,-104.95780686179867
542,1000,-113.36704699369828
543,541,-72.12393152077014
544,153,-101.1713860462062
545,289,-47.44665739113469
546,1000,-208.22975199731746
547,1000,-173.11061303871136
548,65,-96.30876746238249
549,1000,-142.5608379898761
550,83,-686.1927219735421
551,1000,-69.74799321231215
552,143,-103.32235145414442
553,103,5.237923326978432
554,1000,-101.43200863211285
555,968,-307.17985715176474
556,1000,-106.27674112682638
557,300,-184.25598578548738
558,811,-287.93563370172916
559,580,-262.2660312998946
560,1000,-114.66178682979425
561,450,-205.27998198204926
562,1000,-157.15000234112392
563,137,-62.14352647071935
564,1000,-122.2974262459419
565,1000,-131.63406868559093
566,1000,-168.22561584910284
567,1000,-112.49813581335651
568,1000,-160.56930087353442
569,1000,-141.04932621316567
570,1000,-156.5066134100365
571,1000,-159.42364486980057
572,1000,-153.54268716820778
573,427,-155.41760713142259
574,857,-640.1039125811267
575,1000,-137.80739286208134
576,1000,-148.20506803997682
577,1000,-141.53626536820968
578,1000,-107.91733986231921
579,1000,-107.42700195291067
580,777,-269.3603452001431
581,1000,-140.02985553154218
582,1000,-144.00666088441946
583,594,-498.56962255797197
584,1000,-146.41361193782018
585,968,-445.617409176828
586,1000,-359.5563886185138
587,364,-316.8032430430805
588,1000,-312.20879842328253
589,1000,-234.98386351563212
590,1000,-230.93845059325844
591,1000,-180.43489762987906
592,1000,-195.09932844856914
593,366,-246.6086853173324
594,1000,-190.89743965344107
595,1000,-134.41541107229156
596,1000,-206.383284531929
597,841,-512.3392105681669
598,212,-360.78678046978507
599,188,-379.2969311115743
600,106,-258.66838731757207
601,1000,-108.52291018274686
602,1000,-133.55917804402836
603,716,-227.44670372848336
604,864,-371.26060595287595
605,418,-221.2792694523071
606,840,-274.40763186324546
607,621,-310.05600761318186
608,311,-339.1374081494505
609,1000,-153.51690956144137
610,1000,-123.05014273047873
611,718,-128.00967226475348
612,798,-391.67689658362406
613,222,-127.18639272034521
614,1000,-58.4884178096445
615,372,-333.3369806238744
616,1000,-28.74197649002973
617,164,-74.28354449865225
618,137,-65.07185386969536
619,1000,-123.8495698432592
620,1000,-56.90725126968441
621,377,-317.09439512529474
622,1000,-113.89266308807967
623,1000,-161.02655005916623
624,216,-161.9973446148149
625,427,-196.29015161487223
626,1000,-137.11826074328397
627,1000,-95.67079761741287
628,1000,-33.7582284877697
629,1000,-64.44639863841108
630,1000,-91.1138343630874
631,1000,-225.36231566737098
632,931,-301.1302553999776
633,1000,-160.40397345628273
634,1000,-169.2367863688559
635,1000,-153.58243001265666
636,1000,-118.34091542042334
637,406,-191.1374800495185
638,1000,-166.2470136927859
639,649,-220.764066151586
640,1000,-111.59586311251097
641,1000,-126.89573402062257
642,1000,-137.93863632545953
643,913,-534.29958168242
644,785,-589.9205512378841
645,184,-248.7660535509139
646,1000,-193.7619660361428
647,1000,-167.59051024752347
648,500,-239.96448979980642
649,787,-365.9193006047107
650,122,-175.6357439014904
651,1000,-153.75048010055173
652,738,-313.49618047764045
653,80,-821.5618853645977
654,165,-209.63633646804135
655,210,-176.47849463468344
656,298,-134.84912719788494
657,1000,-264.8387697379727
658,1000,-143.44724036003396
659,1000,-178.94859180999185
660,564,-295.2072280605205
661,715,-279.19459346439874
662,1000,-191.319492994678
663,535,-223.6519022007859
664,331,-222.41075987072736
665,265,-297.8989961574903
666,1000,-230.17025010995712
667,687,-261.2936234685866
668,199,-178.1485709710281
669,457,-320.70955469500655
670,341,-179.2459698447634
671,1000,-338.31885601330816
672,150,-170.21445219527988
673,228,-224.7121563208496
674,873,-287.2654496136041
675,1000,-158.1163153755133
676,1000,-162.45778000006172
677,1000,-178.89137704447958
678,177,-124.14396105798166
679,1000,-148.09309642127533
680,206,-86.67861130645734
681,189,-346.48421016476607
682,168,-119.84585896361152
683,252,-112.88477300978884
684,365,-121.25901295282449
685,171,-170.37640264068787
686,429,-190.45210045438685
687,129,-108.27991735735276
688,130,-221.89195870069295
689,182,-171.69813885207992
690,222,-142.38351597102104
691,1000,-175.99311982217475
692,668,-644.2048961775736
693,89,-157.92609196193257
694,823,-239.37739575492824
695,107,-102.11000560401773
696,1000,-228.83830792518512
697,1000,-113.19965975575889
698,1000,-183.25042492859302
699,295,-209.9059836976943
700,846,-256.34114727631777
701,429,-284.76076270455735
702,569,-186.80597401965983
703,1000,-116.77705690710928
704,1000,-165.22505562676736
705,1000,-135.14362023708358
706,158,-207.13934916500938
707,1000,-127.5484445098835
708,92,-175.2043884583996
709,1000,-107.2944551626196
710,1000,-133.34647061275084
711,1000,-110.49161991092757
712,1000,-113.38926392663564
713,471,-203.88472852160317
714,1000,-107.58546215981066
715,1000,-139.18309066499418
716,785,-268.9882804192224
717,481,-386.48369265589633
718,1000,-273.57572305510473
719,348,-278.4768993788596
720,360,-441.56410248024497
721,1000,-144.5917901055776
722,300,-301.58961965878404
723,1000,-191.3302402063741
724,367,-275.897822798291
725,1000,-264.3129986227269
726,1000,-293.6200104518358
727,429,-334.8447748378355
728,147,-74.71254050898105
729,611,-193.7156130089839
730,523,-691.3789182200768
731,100,-697.4294485991506
732,1000,-177.62017577974672
733,643,-279.88331284208664
734,385,-523.4196179167507
735,1000,-191.50869563919397
736,139,-116.13713054094336
737,502,-154.95085117760368
738,230,-726.4920496170973
739,320,-182.82158374469967
740,1000,-128.18533441278726
741,741,-150.4193151332422
742,1000,-69.35251699525996
743,1000,-180.694060729573
744,175,-592.1223620275048
745,151,-309.1567613850435
746,332,-428.7304656886595
747,170,-282.50595075935894
748,166,-275.669671881627
749,1000,-199.12607842599152
750,275,-246.56435839467352
