episodes,steps,rewards
0,200,-200.0
1,200,-200.0
2,200,-200.0
3,200,-200.0
4,200,-200.0
5,200,-200.0
6,200,-200.0
7,200,-200.0
8,200,-200.0
9,200,-200.0
10,200,-200.0
11,200,-200.0
12,200,-200.0
13,200,-200.0
14,200,-200.0
15,200,-200.0
16,200,-200.0
17,200,-200.0
18,200,-200.0
19,200,-200.0
20,200,-200.0
21,200,-200.0
22,200,-200.0
23,200,-200.0
24,200,-200.0
25,200,-200.0
26,200,-200.0
27,200,-200.0
28,200,-200.0
29,200,-200.0
30,200,-200.0
31,200,-200.0
32,200,-200.0
33,200,-200.0
34,200,-200.0
35,200,-200.0
36,200,-200.0
37,200,-200.0
38,119,-119.0
39,200,-200.0
40,200,-200.0
41,200,-200.0
42,200,-200.0
43,200,-200.0
44,200,-200.0
45,200,-200.0
46,200,-200.0
47,200,-200.0
48,152,-152.0
49,200,-200.0
50,174,-174.0
51,200,-200.0
52,200,-200.0
53,185,-185.0
54,200,-200.0
55,200,-200.0
56,200,-200.0
57,200,-200.0
58,200,-200.0
59,200,-200.0
60,200,-200.0
61,200,-200.0
62,200,-200.0
63,200,-200.0
64,200,-200.0
65,200,-200.0
66,200,-200.0
67,200,-200.0
68,200,-200.0
69,200,-200.0
70,200,-200.0
71,198,-198.0
72,200,-200.0
73,200,-200.0
74,200,-200.0
75,158,-158.0
76,200,-200.0
77,185,-185.0
78,200,-200.0
79,200,-200.0
80,200,-200.0
81,169,-169.0
82,200,-200.0
83,160,-160.0
84,200,-200.0
85,188,-188.0
86,142,-142.0
87,200,-200.0
88,138,-138.0
89,193,-193.0
90,106,-106.0
91,138,-138.0
92,139,-139.0
93,137,-137.0
94,200,-200.0
95,200,-200.0
96,197,-197.0
97,172,-172.0
98,200,-200.0
99,137,-137.0
100,200,-200.0
101,162,-162.0
102,175,-175.0
103,150,-150.0
104,199,-199.0
105,178,-178.0
106,106,-106.0
107,200,-200.0
108,179,-179.0
109,128,-128.0
110,136,-136.0
111,115,-115.0
112,136,-136.0
113,97,-97.0
114,134,-134.0
115,112,-112.0
116,92,-92.0
117,153,-153.0
118,135,-135.0
119,139,-139.0
120,102,-102.0
121,141,-141.0
122,160,-160.0
123,180,-180.0
124,113,-113.0
125,122,-122.0
126,142,-142.0
127,126,-126.0
128,109,-109.0
129,153,-153.0
130,154,-154.0
131,178,-178.0
132,186,-186.0
133,156,-156.0
134,150,-150.0
135,101,-101.0
136,177,-177.0
137,144,-144.0
138,130,-130.0
139,178,-178.0
140,181,-181.0
141,123,-123.0
142,132,-132.0
143,127,-127.0
144,90,-90.0
145,154,-154.0
146,200,-200.0
147,122,-122.0
148,108,-108.0
149,116,-116.0
150,194,-194.0
151,156,-156.0
152,200,-200.0
153,200,-200.0
154,191,-191.0
155,145,-145.0
156,182,-182.0
157,122,-122.0
158,108,-108.0
159,161,-161.0
160,146,-146.0
161,112,-112.0
162,177,-177.0
163,117,-117.0
164,110,-110.0
165,176,-176.0
166,200,-200.0
167,200,-200.0
168,88,-88.0
169,167,-167.0
170,147,-147.0
171,200,-200.0
172,182,-182.0
173,200,-200.0
174,164,-164.0
175,127,-127.0
176,99,-99.0
177,88,-88.0
178,158,-158.0
179,93,-93.0
180,120,-120.0
181,157,-157.0
182,184,-184.0
183,159,-159.0
184,159,-159.0
185,157,-157.0
186,184,-184.0
187,187,-187.0
188,172,-172.0
189,106,-106.0
190,174,-174.0
191,144,-144.0
192,200,-200.0
193,119,-119.0
194,183,-183.0
195,106,-106.0
196,150,-150.0
197,113,-113.0
198,86,-86.0
199,107,-107.0
200,151,-151.0
201,158,-158.0
202,109,-109.0
203,97,-97.0
204,169,-169.0
205,199,-199.0
206,141,-141.0
207,144,-144.0
208,88,-88.0
209,171,-171.0
210,125,-125.0
211,139,-139.0
212,168,-168.0
213,149,-149.0
214,164,-164.0
215,152,-152.0
216,171,-171.0
217,86,-86.0
218,145,-145.0
219,180,-180.0
220,153,-153.0
221,157,-157.0
222,116,-116.0
223,98,-98.0
224,186,-186.0
225,160,-160.0
226,114,-114.0
227,147,-147.0
228,121,-121.0
229,169,-169.0
230,151,-151.0
231,87,-87.0
232,151,-151.0
233,86,-86.0
234,158,-158.0
235,141,-141.0
236,168,-168.0
237,117,-117.0
238,144,-144.0
239,90,-90.0
240,115,-115.0
241,87,-87.0
242,112,-112.0
243,162,-162.0
244,97,-97.0
245,149,-149.0
246,148,-148.0
247,158,-158.0
248,89,-89.0
249,190,-190.0
250,155,-155.0
251,98,-98.0
252,185,-185.0
253,146,-146.0
254,158,-158.0
255,167,-167.0
256,88,-88.0
257,156,-156.0
258,106,-106.0
259,164,-164.0
260,85,-85.0
261,163,-163.0
262,98,-98.0
263,104,-104.0
264,97,-97.0
265,172,-172.0
266,117,-117.0
267,146,-146.0
268,91,-91.0
269,101,-101.0
270,147,-147.0
271,98,-98.0
272,99,-99.0
273,156,-156.0
274,92,-92.0
275,95,-95.0
276,169,-169.0
277,89,-89.0
278,103,-103.0
279,164,-164.0
280,147,-147.0
281,84,-84.0
282,143,-143.0
283,126,-126.0
284,88,-88.0
285,145,-145.0
286,84,-84.0
287,142,-142.0
288,85,-85.0
289,140,-140.0
290,147,-147.0
291,85,-85.0
292,89,-89.0
293,142,-142.0
294,93,-93.0
295,145,-145.0
296,144,-144.0
297,151,-151.0
298,88,-88.0
299,141,-141.0
300,147,-147.0
301,86,-86.0
302,84,-84.0
303,95,-95.0
304,146,-146.0
305,153,-153.0
306,153,-153.0
307,134,-134.0
308,144,-144.0
309,124,-124.0
310,181,-181.0
311,142,-142.0
312,151,-151.0
313,142,-142.0
314,143,-143.0
315,164,-164.0
316,170,-170.0
317,143,-143.0
318,141,-141.0
319,84,-84.0
320,138,-138.0
321,145,-145.0
322,146,-146.0
323,140,-140.0
324,139,-139.0
325,92,-92.0
326,140,-140.0
327,144,-144.0
328,99,-99.0
329,103,-103.0
330,154,-154.0
331,85,-85.0
332,154,-154.0
333,117,-117.0
334,103,-103.0
335,88,-88.0
336,141,-141.0
337,139,-139.0
338,138,-138.0
339,85,-85.0
340,139,-139.0
341,147,-147.0
342,146,-146.0
343,136,-136.0
344,154,-154.0
345,161,-161.0
346,159,-159.0
347,83,-83.0
348,141,-141.0
349,150,-150.0
350,133,-133.0
351,169,-169.0
352,152,-152.0
353,138,-138.0
354,200,-200.0
355,104,-104.0
356,143,-143.0
357,108,-108.0
358,89,-89.0
359,144,-144.0
360,141,-141.0
361,85,-85.0
362,131,-131.0
363,140,-140.0
364,146,-146.0
365,93,-93.0
366,137,-137.0
367,115,-115.0
368,91,-91.0
369,179,-179.0
370,136,-136.0
371,96,-96.0
372,140,-140.0
373,91,-91.0
374,144,-144.0
375,86,-86.0
376,146,-146.0
377,148,-148.0
378,135,-135.0
379,136,-136.0
380,137,-137.0
381,150,-150.0
382,150,-150.0
383,95,-95.0
384,150,-150.0
385,148,-148.0
386,91,-91.0
387,139,-139.0
388,164,-164.0
389,114,-114.0
390,87,-87.0
391,142,-142.0
392,142,-142.0
393,139,-139.0
394,153,-153.0
395,154,-154.0
396,139,-139.0
397,118,-118.0
398,95,-95.0
399,144,-144.0
400,142,-142.0
