{
    "env": "CartPole-v1",
    "model_info": "common8",
    "num_episodes_solved": [
        1081,
        367,
        846,
        855,
        492,
        823,
        262,
        1006,
        915,
        1230,
        403,
        964,
        452,
        1046,
        956
    ]
}