{
    "model_info": "common24",
    "episodes": [
        12,
        22,
        27,
        16,
        28,
        15,
        23,
        47,
        30,
        25,
        11,
        12,
        20,
        12,
        10,
        10,
        12,
        17,
        22,
        24,
        10,
        17,
        18,
        22,
        11,
        19,
        16,
        25,
        16,
        15,
        22,
        20,
        20,
        36,
        22,
        13,
        16,
        13,
        28,
        17,
        19,
        19,
        47,
        48,
        19,
        38,
        19,
        19,
        27,
        32,
        45,
        26,
        39,
        40,
        47,
        68,
        33,
        30,
        29,
        23,
        37,
        26,
        30,
        32,
        59,
        27,
        47,
        25,
        27,
        30,
        34,
        31,
        66,
        58,
        23,
        45,
        24,
        66,
        58,
        47,
        45,
        94,
        173,
        112,
        64,
        60,
        69,
        43,
        35,
        31,
        15,
        31,
        16,
        33,
        41,
        18,
        47,
        20,
        25,
        42,
        29,
        53,
        39,
        82,
        40,
        39,
        129,
        32,
        110,
        68,
        79,
        46,
        48,
        73,
        102,
        47,
        115,
        49,
        59,
        62,
        61,
        77,
        69,
        108,
        78,
        60,
        95,
        63,
        67,
        59,
        98,
        90,
        62,
        71,
        49,
        139,
        82,
        74,
        74,
        90,
        138,
        120,
        138,
        162,
        172,
        154,
        144,
        208,
        156,
        102,
        93,
        155,
        87,
        68,
        87,
        101,
        115,
        72,
        60,
        103,
        57,
        84,
        45,
        74,
        50,
        74,
        40,
        66,
        92,
        129,
        91,
        122,
        106,
        222,
        111,
        119,
        158,
        169,
        237,
        316,
        256,
        341,
        147,
        167,
        132,
        418,
        214,
        500,
        500,
        500,
        158,
        125,
        191,
        113,
        124,
        102,
        115,
        120,
        85,
        84,
        25,
        102,
        92,
        74,
        20,
        39,
        106,
        93,
        33,
        32,
        83,
        22,
        19,
        32,
        31,
        76,
        57,
        82,
        97,
        82,
        111,
        95,
        75,
        97,
        104,
        99,
        99,
        104,
        91,
        107,
        113,
        108,
        104,
        98,
        81,
        96,
        105,
        100,
        134,
        128,
        96,
        113,
        131,
        107,
        98,
        100,
        131,
        110,
        126,
        115,
        144,
        116,
        153,
        136,
        195,
        220,
        205,
        193,
        174,
        266,
        236,
        260,
        250,
        340,
        276,
        184,
        97,
        460,
        218,
        456,
        256,
        214,
        241,
        204,
        237,
        212,
        221,
        293,
        500,
        303,
        500,
        500,
        344,
        500,
        500,
        500,
        406,
        500,
        413,
        500,
        500,
        500,
        500,
        353,
        500,
        500,
        500,
        500,
        500,
        500,
        500,
        500,
        500,
        500,
        351,
        445,
        266,
        500,
        436,
        393,
        500,
        500,
        339,
        295,
        274,
        339,
        231,
        215,
        398,
        187,
        297,
        310,
        303,
        212,
        201,
        176,
        168,
        178,
        154,
        137,
        162,
        136,
        142,
        129,
        146,
        139,
        137,
        133,
        157,
        140,
        145,
        136,
        132,
        138,
        143,
        150,
        147,
        155,
        143,
        137,
        132,
        144,
        137,
        150,
        131,
        137,
        161,
        25,
        149,
        154,
        146,
        139,
        22,
        37,
        157,
        142,
        137,
        143,
        137,
        134,
        140,
        142,
        136,
        151,
        146,
        150,
        139,
        163,
        139,
        185,
        158,
        152,
        152,
        142,
        157,
        163,
        175,
        143,
        148,
        171,
        153,
        148,
        125,
        162,
        160,
        156,
        148,
        157,
        144,
        154,
        142,
        152,
        156,
        127,
        133,
        130,
        120,
        135,
        122,
        133,
        115,
        129,
        130,
        125,
        121,
        130,
        115,
        132,
        117,
        139,
        113,
        120,
        127,
        140,
        128,
        138,
        131,
        129,
        127,
        130,
        135,
        135,
        138,
        132,
        124,
        153,
        131,
        116,
        133,
        136,
        143,
        135,
        140,
        123,
        139,
        132,
        133,
        149,
        126,
        128,
        151,
        129,
        128,
        131,
        144,
        125,
        119,
        134,
        122,
        129,
        139,
        118,
        139,
        140,
        125,
        134,
        132,
        124,
        141,
        142,
        156,
        131,
        136,
        166,
        140,
        156,
        158,
        145,
        174,
        148,
        163,
        175,
        164,
        152,
        183,
        162,
        175,
        179,
        193,
        176,
        194,
        176,
        153,
        153,
        180,
        177,
        169,
        147,
        166,
        171,
        177,
        201,
        174,
        154,
        164,
        144,
        172,
        172,
        182,
        169,
        165,
        160,
        181,
        197,
        159,
        176,
        180,
        175,
        176,
        156,
        193,
        179,
        184,
        195,
        176,
        173,
        192,
        188,
        218,
        159,
        179,
        217,
        180,
        185,
        226,
        196,
        189,
        175,
        189,
        185,
        173,
        185,
        193,
        165,
        184,
        170,
        175,
        161,
        181,
        149,
        189,
        180,
        156,
        167,
        153,
        185,
        173,
        213,
        200,
        176,
        192,
        182,
        213,
        183,
        189,
        213,
        201,
        211,
        209,
        285,
        296,
        227,
        215,
        243,
        198,
        260,
        227,
        205,
        220,
        211,
        242,
        283,
        254,
        251,
        247,
        224,
        204,
        243,
        250,
        218,
        256,
        237,
        246,
        274,
        242,
        260,
        240,
        277,
        247,
        242,
        231,
        267,
        291,
        209,
        280,
        225,
        237,
        312,
        297,
        214,
        244,
        256,
        220,
        220,
        245,
        231,
        241,
        236,
        212,
        256,
        222,
        195,
        206,
        245,
        239,
        209,
        221,
        233,
        211,
        203,
        208,
        192,
        219,
        208,
        238,
        249,
        252,
        280,
        311,
        206,
        276,
        255,
        226,
        275,
        284,
        250,
        278,
        240,
        254,
        254,
        256,
        254,
        290,
        263,
        235,
        252,
        268,
        285,
        258,
        248,
        259,
        240,
        248,
        227,
        286,
        214,
        247,
        264,
        238,
        208,
        258,
        260,
        277,
        269,
        274,
        266,
        323,
        289,
        346,
        326,
        281,
        326,
        374,
        270,
        331,
        349,
        419,
        404,
        360,
        350,
        369,
        318,
        500,
        255,
        401,
        500,
        500,
        500,
        315,
        500,
        500,
        500,
        500,
        463,
        289,
        355,
        412,
        276,
        390,
        252,
        303,
        252,
        246,
        274,
        360,
        411,
        500,
        250,
        133,
        385,
        500,
        196,
        269,
        473,
        406,
        500,
        500,
        133,
        337,
        500,
        500,
        500,
        210,
        186,
        211,
        171,
        187,
        151,
        171,
        147,
        167,
        157,
        244,
        172,
        215,
        204,
        203,
        205,
        500,
        373,
        297,
        500,
        398,
        241,
        500,
        500,
        353,
        456,
        280,
        313,
        280,
        500,
        500,
        434,
        500,
        500,
        500,
        228,
        500,
        500,
        500,
        500,
        500,
        296,
        500,
        438,
        500,
        500,
        500,
        500,
        500,
        500,
        500,
        500,
        325,
        500,
        500,
        500,
        500,
        500,
        500,
        500,
        500,
        500,
        500,
        500,
        500,
        30,
        20,
        13,
        17,
        17,
        15,
        18,
        20,
        254,
        209,
        37,
        19,
        14,
        15,
        14,
        15,
        10,
        13,
        144,
        20,
        16,
        29,
        21,
        13,
        135,
        168,
        16,
        24,
        14,
        310,
        500,
        500,
        500,
        500,
        500,
        500,
        299,
        10,
        199,
        13,
        32,
        148,
        14,
        124,
        29,
        15,
        109,
        20,
        109,
        123,
        115,
        104,
        12,
        17,
        14,
        120,
        111,
        18,
        107,
        26,
        18,
        130,
        121,
        19,
        109,
        126,
        18,
        21,
        129,
        125,
        116,
        134,
        137,
        130,
        150,
        141,
        123,
        134,
        135,
        128,
        145,
        14,
        137,
        139,
        114,
        130,
        12,
        137,
        126,
        133,
        127,
        125,
        137,
        25,
        146,
        144,
        173,
        168,
        170,
        201,
        215,
        180,
        211,
        257,
        213,
        228,
        244,
        239,
        262,
        263,
        294,
        298,
        476,
        500,
        500,
        500,
        500,
        500,
        500,
        500,
        500,
        500,
        500,
        500,
        500,
        500,
        500,
        500,
        500,
        500,
        500,
        500,
        500,
        500,
        500,
        500,
        500,
        500,
        500,
        500,
        500,
        500,
        500,
        500,
        500,
        500,
        500,
        500,
        500,
        500,
        500,
        500,
        500,
        500,
        500,
        500,
        500,
        500,
        500,
        500,
        500,
        500,
        500,
        500,
        500,
        500,
        500,
        500,
        500,
        500,
        500,
        500,
        500,
        500,
        500,
        500,
        500,
        500,
        500,
        500,
        500,
        500,
        500,
        500,
        500,
        500,
        500,
        500,
        500,
        500,
        500,
        500,
        500,
        500,
        500,
        500,
        500,
        500,
        500,
        500,
        500,
        500,
        500
    ],
    "durations": [
        1.365996,
        0.007001,
        0.009,
        0.005001,
        0.008001,
        0.004997,
        0.007003,
        0.012,
        0.008,
        0.006999,
        0.003,
        0.003,
        0.005,
        0.003,
        0.002,
        0.002,
        0.002998,
        0.005,
        0.006001,
        0.007001,
        0.002998,
        0.004999,
        0.005001,
        0.006,
        0.003,
        0.004999,
        0.004002,
        0.006001,
        0.005,
        0.003999,
        0.004999,
        0.004999,
        0.008003,
        0.010998,
        0.005999,
        0.004002,
        0.003999,
        0.004,
        0.006999,
        0.005002,
        0.005999,
        0.006,
        0.015,
        0.013999,
        0.006,
        0.012002,
        0.006999,
        0.006,
        0.007999,
        0.008997,
        0.012001,
        0.007998,
        0.011,
        0.011001,
        0.012999,
        0.019001,
        0.01,
        0.008001,
        0.008,
        0.006002,
        0.009999,
        0.009003,
        0.008997,
        0.007999,
        0.015,
        0.007,
        0.013,
        0.007001,
        0.007,
        0.007,
        0.008,
        0.008,
        0.017001,
        0.014999,
        0.007001,
        0.010998,
        0.006001,
        0.016999,
        0.015,
        0.012,
        0.011001,
        0.021678,
        0.04721,
        0.019883,
        0.016753,
        0.023298,
        0.017999,
        0.010999,
        0.010001,
        0.008999,
        0.004001,
        0.008,
        0.004,
        0.007999,
        0.01,
        0.004999,
        0.012,
        0.005001,
        0.006,
        0.011999,
        0.008,
        0.013001,
        0.010001,
        0.020998,
        0.011,
        0.01,
        0.032001,
        0.009,
        0.028064,
        0.01685,
        0.015627,
        0.015625,
        0.0,
        0.031253,
        0.02123,
        0.016872,
        0.03125,
        0.015626,
        0.015626,
        0.015625,
        0.015917,
        0.005033,
        0.031243,
        0.015632,
        0.031246,
        0.015625,
        0.02106,
        0.015625,
        0.015626,
        0.025879,
        0.016743,
        0.031346,
        0.004203,
        0.015624,
        0.015628,
        0.046873,
        0.015627,
        0.020998,
        0.015626,
        0.031253,
        0.031248,
        0.035363,
        0.03245,
        0.045179,
        0.044997,
        0.038982,
        0.037001,
        0.052002,
        0.031252,
        0.032362,
        0.031711,
        0.036543,
        0.032389,
        0.015637,
        0.035807,
        0.031586,
        0.03238,
        0.031257,
        0.021789,
        0.032353,
        0.015627,
        0.031252,
        0.015626,
        0.02048,
        0.015624,
        0.016744,
        0.015627,
        0.031251,
        0.033751,
        0.035833,
        0.015624,
        0.046877,
        0.053185,
        0.081999,
        0.042,
        0.042999,
        0.058001,
        0.060999,
        0.074235,
        0.099176,
        0.099249,
        0.115159,
        0.0625,
        0.052305,
        0.031251,
        0.146077,
        0.068088,
        0.164978,
        0.177191,
        0.169155,
        0.063728,
        0.03727,
        0.063635,
        0.036941,
        0.032487,
        0.031251,
        0.036962,
        0.04823,
        0.031527,
        0.020904,
        0.0,
        0.046879,
        0.031894,
        0.022341,
        0.0,
        0.015627,
        0.031251,
        0.035866,
        0.0,
        0.015624,
        0.032384,
        0.0,
        0.0,
        0.015622,
        0.015627,
        0.015626,
        0.021375,
        0.032742,
        0.03125,
        0.034802,
        0.036394,
        0.026999,
        0.023,
        0.027999,
        0.034001,
        0.028999,
        0.029004,
        0.030997,
        0.024998,
        0.029001,
        0.035771,
        0.016866,
        0.03125,
        0.031251,
        0.015628,
        0.02095,
        0.031249,
        0.031248,
        0.037781,
        0.031258,
        0.031241,
        0.032366,
        0.0371,
        0.031248,
        0.032441,
        0.037086,
        0.031252,
        0.032425,
        0.035676,
        0.031253,
        0.04807,
        0.032666,
        0.045655,
        0.038998,
        0.055003,
        0.064001,
        0.056998,
        0.055,
        0.03893,
        0.079238,
        0.068285,
        0.067039,
        0.063645,
        0.116358,
        0.084939,
        0.062501,
        0.037698,
        0.161587,
        0.074001,
        0.151999,
        0.078727,
        0.068362,
        0.095069,
        0.068297,
        0.084883,
        0.063731,
        0.052537,
        0.100413,
        0.141636,
        0.083,
        0.157956,
        0.154022,
        0.093755,
        0.13706,
        0.178761,
        0.198615,
        0.152001,
        0.139695,
        0.116085,
        0.148798,
        0.153183,
        0.149025,
        0.146869,
        0.096101,
        0.13634,
        0.147473,
        0.131003,
        0.147418,
        0.131704,
        0.156444,
        0.14,
        0.125108,
        0.153048,
        0.130603,
        0.099547,
        0.130667,
        0.063634,
        0.155402,
        0.120001,
        0.109001,
        0.137255,
        0.133248,
        0.099481,
        0.082652,
        0.079479,
        0.083855,
        0.068174,
        0.061764,
        0.110999,
        0.053,
        0.081,
        0.079093,
        0.083869,
        0.063598,
        0.052538,
        0.048,
        0.052368,
        0.047993,
        0.035733,
        0.046877,
        0.032376,
        0.035806,
        0.04688,
        0.03243,
        0.036834,
        0.052399,
        0.037001,
        0.037001,
        0.043996,
        0.039,
        0.039,
        0.034904,
        0.031256,
        0.036972,
        0.048025,
        0.031251,
        0.053701,
        0.031252,
        0.049107,
        0.034812,
        0.031256,
        0.051484,
        0.032377,
        0.04688,
        0.035857,
        0.032358,
        0.04689,
        0.015616,
        0.036027,
        0.048087,
        0.031251,
        0.053161,
        0.007001,
        0.01,
        0.042998,
        0.03699,
        0.037002,
        0.039003,
        0.038,
        0.040103,
        0.031251,
        0.053695,
        0.046875,
        0.053276,
        0.046872,
        0.052271,
        0.062501,
        0.052342,
        0.046879,
        0.067981,
        0.062499,
        0.052273,
        0.046878,
        0.062994,
        0.054998,
        0.056999,
        0.061001,
        0.051001,
        0.053,
        0.054269,
        0.046875,
        0.064717,
        0.034663,
        0.062499,
        0.052394,
        0.062499,
        0.052564,
        0.046872,
        0.052623,
        0.062499,
        0.05272,
        0.052995,
        0.036291,
        0.036557,
        0.032386,
        0.052516,
        0.032395,
        0.046878,
        0.052943,
        0.032279,
        0.047311,
        0.038203,
        0.031251,
        0.054083,
        0.031252,
        0.052411,
        0.032574,
        0.046875,
        0.038228,
        0.046878,
        0.031249,
        0.051334,
        0.038999,
        0.046999,
        0.037121,
        0.046875,
        0.037994,
        0.046879,
        0.031248,
        0.05341,
        0.046875,
        0.036655,
        0.046878,
        0.046875,
        0.03683,
        0.046876,
        0.052547,
        0.046874,
        0.046877,
        0.036789,
        0.046872,
        0.05228,
        0.046878,
        0.031247,
        0.060369,
        0.043003,
        0.043999,
        0.049002,
        0.030742,
        0.053774,
        0.046875,
        0.032448,
        0.052661,
        0.048066,
        0.036996,
        0.04803,
        0.031252,
        0.051675,
        0.048076,
        0.031251,
        0.05158,
        0.032521,
        0.052469,
        0.048013,
        0.046874,
        0.038047,
        0.051617,
        0.039997,
        0.044002,
        0.044999,
        0.051,
        0.044,
        0.042036,
        0.048084,
        0.052487,
        0.047989,
        0.046875,
        0.052868,
        0.062503,
        0.037611,
        0.062499,
        0.052323,
        0.0625,
        0.05231,
        0.062501,
        0.052338,
        0.063532,
        0.058999,
        0.064003,
        0.056998,
        0.062,
        0.045593,
        0.063681,
        0.036986,
        0.063685,
        0.052556,
        0.059418,
        0.052784,
        0.048046,
        0.052575,
        0.063651,
        0.069786,
        0.062502,
        0.055487,
        0.053997,
        0.046,
        0.058,
        0.057,
        0.059,
        0.051,
        0.038388,
        0.069388,
        0.046873,
        0.068851,
        0.046874,
        0.069258,
        0.063687,
        0.052664,
        0.063678,
        0.05168,
        0.063677,
        0.060323,
        0.059998,
        0.065,
        0.059,
        0.059138,
        0.053514,
        0.063728,
        0.068132,
        0.048082,
        0.05245,
        0.079375,
        0.052956,
        0.062505,
        0.085105,
        0.069411,
        0.04688,
        0.071791,
        0.062999,
        0.061002,
        0.053,
        0.061,
        0.058302,
        0.050501,
        0.052652,
        0.063703,
        0.052477,
        0.048233,
        0.067371,
        0.048088,
        0.069442,
        0.04688,
        0.053878,
        0.062503,
        0.053883,
        0.069396,
        0.057001,
        0.072998,
        0.06,
        0.058002,
        0.054992,
        0.069224,
        0.068851,
        0.062502,
        0.052316,
        0.078124,
        0.05236,
        0.078123,
        0.067903,
        0.085946,
        0.110298,
        0.075001,
        0.064959,
        0.069351,
        0.06361,
        0.083962,
        0.084794,
        0.063696,
        0.069377,
        0.062505,
        0.085128,
        0.085127,
        0.069476,
        0.087778,
        0.081001,
        0.063095,
        0.068233,
        0.084941,
        0.079336,
        0.069537,
        0.084491,
        0.078129,
        0.08361,
        0.083554,
        0.078121,
        0.094348,
        0.074999,
        0.089,
        0.079079,
        0.067997,
        0.083616,
        0.083601,
        0.100717,
        0.068001,
        0.079362,
        0.069268,
        0.085068,
        0.100125,
        0.093751,
        0.083501,
        0.083718,
        0.090698,
        0.072035,
        0.055788,
        0.084992,
        0.06365,
        0.083884,
        0.084965,
        0.063667,
        0.085184,
        0.068071,
        0.063713,
        0.069395,
        0.083741,
        0.084314,
        0.067998,
        0.074001,
        0.068999,
        0.071951,
        0.062504,
        0.067907,
        0.067918,
        0.062503,
        0.067839,
        0.078127,
        0.083628,
        0.08372,
        0.084621,
        0.114995,
        0.069999,
        0.086999,
        0.080105,
        0.067929,
        0.093754,
        0.083621,
        0.083519,
        0.083671,
        0.093752,
        0.083569,
        0.083737,
        0.10242,
        0.095,
        0.093001,
        0.084999,
        0.069259,
        0.084749,
        0.079296,
        0.101259,
        0.085306,
        0.0693,
        0.082684,
        0.083717,
        0.08,
        0.073,
        0.077046,
        0.079305,
        0.069381,
        0.084587,
        0.062503,
        0.083648,
        0.083612,
        0.078124,
        0.099185,
        0.090647,
        0.086999,
        0.088998,
        0.106347,
        0.080562,
        0.116273,
        0.099678,
        0.100774,
        0.083864,
        0.132322,
        0.099431,
        0.108997,
        0.114998,
        0.123739,
        0.130377,
        0.114802,
        0.09945,
        0.114917,
        0.099196,
        0.164398,
        0.084001,
        0.124664,
        0.168783,
        0.148624,
        0.168786,
        0.100609,
        0.185345,
        0.165,
        0.161842,
        0.151521,
        0.161747,
        0.083571,
        0.114748,
        0.141979,
        0.087,
        0.122,
        0.071933,
        0.099178,
        0.078129,
        0.083608,
        0.091586,
        0.1305,
        0.130513,
        0.174979,
        0.076958,
        0.036964,
        0.130827,
        0.148736,
        0.06707,
        0.079312,
        0.137169,
        0.133165,
        0.172428,
        0.158217,
        0.050202,
        0.111872,
        0.15441,
        0.170746,
        0.183403,
        0.072597,
        0.056999,
        0.060998,
        0.055,
        0.062998,
        0.041213,
        0.062501,
        0.049084,
        0.049218,
        0.047298,
        0.083555,
        0.053361,
        0.078123,
        0.069501,
        0.063598,
        0.068236,
        0.160977,
        0.125,
        0.095999,
        0.154218,
        0.132585,
        0.085313,
        0.164849,
        0.164282,
        0.115999,
        0.134975,
        0.099812,
        0.100108,
        0.084563,
        0.162481,
        0.16992,
        0.136896,
        0.158233,
        0.15442,
        0.16394,
        0.069498,
        0.170285,
        0.164067,
        0.156457,
        0.163999,
        0.165759,
        0.085275,
        0.16308,
        0.13689,
        0.177481,
        0.166799,
        0.165397,
        0.166836,
        0.151895,
        0.163348,
        0.175194,
        0.164735,
        0.109001,
        0.170222,
        0.163173,
        0.167795,
        0.162964,
        0.158479,
        0.169999,
        0.144156,
        0.168058,
        0.161687,
        0.147184,
        0.178184,
        0.167,
        0.009999,
        0.007003,
        0.004997,
        0.006001,
        0.0,
        0.0,
        0.015624,
        0.0,
        0.092832,
        0.067999,
        0.012004,
        0.006001,
        0.004998,
        0.005003,
        0.004997,
        0.005001,
        0.002998,
        0.005002,
        0.049999,
        0.007001,
        0.005999,
        0.010002,
        0.006998,
        0.005003,
        0.043996,
        0.042195,
        0.015624,
        0.0,
        0.015625,
        0.099176,
        0.177348,
        0.154306,
        0.16208,
        0.174184,
        0.164,
        0.154942,
        0.112839,
        0.001319,
        0.063639,
        0.0,
        0.015623,
        0.054063,
        0.0,
        0.046879,
        0.0,
        0.015623,
        0.038235,
        0.0,
        0.031252,
        0.046875,
        0.037805,
        0.031252,
        0.0,
        0.015623,
        0.0,
        0.031254,
        0.049331,
        0.005999,
        0.033999,
        0.009,
        0.006002,
        0.039999,
        0.038,
        0.006001,
        0.036,
        0.040998,
        0.006002,
        0.007001,
        0.044003,
        0.045,
        0.029272,
        0.053724,
        0.031252,
        0.048037,
        0.052471,
        0.032499,
        0.037029,
        0.031261,
        0.048016,
        0.036915,
        0.048001,
        0.015626,
        0.03691,
        0.047994,
        0.031249,
        0.053674,
        0.0,
        0.051367,
        0.043,
        0.040001,
        0.042,
        0.039998,
        0.040723,
        0.0,
        0.052543,
        0.063859,
        0.053666,
        0.04688,
        0.069517,
        0.065849,
        0.066063,
        0.053682,
        0.062508,
        0.068343,
        0.06881,
        0.072497,
        0.079002,
        0.079999,
        0.082,
        0.081953,
        0.099733,
        0.100385,
        0.147523,
        0.170083,
        0.173769,
        0.159999,
        0.149852,
        0.167183,
        0.177378,
        0.151933,
        0.175463,
        0.162,
        0.165956,
        0.148734,
        0.170076,
        0.146489,
        0.168011,
        0.174462,
        0.163881,
        0.164463,
        0.16858,
        0.163285,
        0.1688,
        0.176862,
        0.15871,
        0.163285,
        0.148555,
        0.186062,
        0.169142,
        0.16231,
        0.160188,
        0.168201,
        0.162805,
        0.15438,
        0.164637,
        0.166059,
        0.156134,
        0.16667,
        0.165601,
        0.169784,
        0.161733,
        0.158662,
        0.163999,
        0.159039,
        0.168694,
        0.148561,
        0.163087,
        0.170785,
        0.159998,
        0.158413,
        0.164517,
        0.15291,
        0.1464,
        0.142793,
        0.138999,
        0.137079,
        0.133084,
        0.146443,
        0.136428,
        0.146348,
        0.154519,
        0.142999,
        0.139722,
        0.147037,
        0.148182,
        0.137244,
        0.146372,
        0.151921,
        0.139996,
        0.139995,
        0.132956,
        0.146073,
        0.146019,
        0.135906,
        0.150892,
        0.145003,
        0.142996,
        0.136297,
        0.130866,
        0.146457,
        0.149045,
        0.139559,
        0.141,
        0.136159,
        0.136373,
        0.146432,
        0.133433,
        0.131983,
        0.14649,
        0.147182,
        0.137001,
        0.134902,
        0.146036
    ]
}