episodes,steps,rewards
0,75,-151.9316540419698
1,86,-224.2869950220092
2,96,-334.2745735281402
3,82,-43.39565686826664
4,80,-74.57180458616877
5,87,-226.8741257616138
6,83,-243.740723475962
7,78,-332.571295071587
8,136,-94.04956365218617
9,90,-369.271231839824
10,89,-111.1370088007992
11,101,8.669924581033214
12,187,-170.9138742443779
13,185,-63.90930267657434
14,346,243.21544099195702
15,103,-146.8673558181208
16,83,-267.14682992435235
17,79,-717.7112683680294
18,79,-43.37904525052677
19,78,-271.3160273973539
20,101,-284.2269734747466
21,96,-314.12299060089595
22,100,-144.56502880520088
23,204,-325.7511986764672
24,99,-265.77658519048106
25,234,-342.560424432174
26,507,-94.10796155146014
27,295,-281.01148476017465
28,195,-137.13771917459036
29,172,-143.88631823623246
30,248,-271.99591734153364
31,242,-77.32749514448052
32,226,-141.79247087322267
33,162,-130.8462205438092
34,223,-205.71267911329886
35,220,-186.52131435030367
36,186,-95.68162556372508
37,243,-108.65568169771912
38,193,-33.2648704002913
39,216,-135.5924983747049
40,218,-38.547907507615065
41,354,-114.06958705808155
42,615,-123.16657133254971
43,259,-82.93914600939165
44,711,-228.2813028545269
45,737,-173.59249148939728
46,607,-99.99835539353926
47,762,-139.90730862295175
48,122,-64.02018676218236
49,150,-7.079868600460287
50,140,-49.175326656799825
51,185,-35.66184121321021
52,144,-87.29048405431908
53,136,-24.379323528744962
54,133,-92.45719556832948
55,291,-76.27359231514845
56,137,-41.49130233429877
57,403,-38.792846363488465
58,103,-69.23162249268434
59,339,-47.02358980486024
60,522,222.72500505177544
61,532,-288.96386777236836
62,1000,-94.50491431052252
63,1000,-75.4612237518143
64,1000,-105.65175946140612
65,1000,-73.8131509566447
66,103,-119.40953835705682
67,139,3.6447520683130534
68,1000,-34.97932036258367
69,1000,-77.46879580069091
70,202,29.659998963533695
71,1000,-56.371363532271516
72,357,0.8059154505283175
73,163,11.392659749406306
74,161,-24.884371689557852
75,444,-116.52825671473309
76,651,-161.89235776404826
77,1000,-5.002795018417589
78,1000,-50.31711315676489
79,481,-91.15350812171722
80,248,-200.5869744566545
81,234,-485.7429217477756
82,204,-67.65746791336056
83,437,-198.82138923347762
84,146,-38.71822385374787
85,264,-213.32455656151862
86,132,-28.397480670649244
87,133,46.39258107639631
88,98,-191.19109937687728
89,130,-136.3918172753428
90,181,-56.80053573828174
91,107,-280.4557691480064
92,117,-141.38772597169083
93,203,-29.59533168631488
94,143,-51.952399605931305
95,95,-177.020708980743
96,252,-104.07601355593783
97,234,-146.90286945441022
98,284,-538.8861869513413
99,174,-89.50552824365144
100,173,-215.89849064190892
101,932,-200.69900779262196
102,370,-200.3663851098845
103,123,-53.6681299705441
104,157,-220.3413315700231
105,328,-30.890731596954637
106,321,-280.6261349741838
107,144,-77.12385633414615
108,138,-54.64366734528258
109,230,-5.539668509403285
110,113,-226.3589347754601
111,312,-326.125128479836
112,251,-87.44878555472525
113,330,-246.0669573399104
114,1000,-143.3856089932515
115,1000,-84.72251167938717
116,154,33.46442501900336
117,1000,-108.1501453731799
118,1000,-53.953952742791174
119,360,-45.53268151935904
120,1000,-32.95968276950356
121,1000,-83.08378033128135
122,1000,-40.87262385653326
123,1000,-49.38361924283001
124,180,17.21556364332308
125,436,-129.99409692315533
126,1000,-54.43462721069773
127,160,23.073668106070244
128,329,264.1363737132901
129,1000,-46.9782855392513
130,1000,-50.67117661841589
131,1000,-6.694405505783073
132,264,-71.20312899712016
133,1000,-75.83775297417908
134,1000,-103.28342186459462
135,489,268.14262923674437
136,117,-133.44939718984548
137,147,-110.97689669461785
138,330,-408.9230862043818
139,349,-386.5885791949163
140,112,-156.44360068347768
141,258,-16.105169302559048
142,999,-135.5613376581323
143,1000,-98.87433449007852
144,174,-119.26159374168216
145,1000,-47.86906773863729
146,1000,-70.89472755827057
147,1000,-93.7485684573029
148,275,-11.396637934332063
149,177,-134.25942106010254
150,1000,-113.2212877865734
151,329,-47.71640074800485
152,1000,-84.90740131165909
153,898,-313.0998063555601
154,1000,-32.769709607234205
155,1000,-54.695853851087065
156,205,-157.28735910079925
157,118,-107.5340551234154
158,669,-74.99402212713203
159,282,245.2886130468617
160,318,-98.55978111596616
161,835,185.7249407007124
162,152,-175.7983221438495
163,132,-136.8752386383732
164,504,234.10511666274482
165,644,252.9417575329264
166,986,-162.08503060457957
167,274,178.49392119376748
168,1000,-205.05362883584456
169,619,-114.06106921401319
170,628,-247.56164316950938
171,1000,79.3033149540112
172,209,194.06250000647512
173,401,-195.683191079985
174,532,226.34625310832342
175,171,49.417959843410216
176,326,-248.19482004079836
177,788,174.8573092214166
178,545,167.977589653152
179,423,237.1419357712539
180,369,241.81151628312506
181,385,228.67439716639768
182,1000,-102.97854150550347
183,355,228.57657660892858
184,309,247.0851958448416
185,710,185.19363730447594
186,295,224.9095396185569
187,306,253.45768143580028
188,340,-229.07221593029965
189,1000,-93.0977528703588
190,879,224.2682643494822
191,395,275.811844688788
192,475,-288.55962262003834
193,236,234.27612889894013
194,799,186.11848302322545
195,518,-262.2829220309575
196,266,229.21851514377468
197,313,241.0705998705053
198,1000,-74.01275402063598
199,735,-79.80034292910187
200,658,206.60905467927313
201,348,275.8092187196576
202,385,263.2297078215613
203,185,-59.54882121974858
204,1000,71.13048663225798
205,239,-147.64565255260058
206,353,200.96462462379807
207,915,98.22956064072031
208,329,234.0485501841684
209,1000,9.52689279062126
210,442,217.36339551887414
211,338,-142.31573684715622
212,862,205.10561629700643
213,242,285.2448827978236
214,826,176.64373364718327
215,1000,5.071289002782945
216,338,287.1745126090659
217,1000,-16.36045666159606
218,631,166.34524203265914
219,822,215.2027177133142
220,350,50.3026661185977
221,360,-22.74959757747149
222,495,251.38847270343007
223,231,262.4607631688385
224,650,216.0262170521824
225,228,224.96931807279555
226,231,44.970371399030824
227,574,232.60450379485894
228,521,250.0528021445033
229,222,-79.3592205894141
230,564,226.05824948352725
231,1000,74.74599735759107
232,1000,40.036935857437484
233,869,188.6877351146614
234,258,-37.75841984196413
235,862,-350.4120013261829
236,215,38.23611777464677
237,440,-297.6800487960996
238,1000,2.718124809287385
239,1000,110.48680055369894
240,321,-44.591419568900676
241,343,246.63405839209227
242,565,224.20490645710163
243,978,199.03858013804842
244,327,215.07078209012784
245,359,239.7024971790398
246,537,225.35210618110585
247,801,178.96771343109612
248,1000,85.9735896022626
249,988,178.03135430996358
250,968,240.07493114321505
251,1000,96.89768785236573
252,538,239.03311175198982
253,218,26.597697517818716
254,197,-8.270914927993871
255,549,218.70633564093757
256,821,245.75117363620868
257,193,-68.99644786764473
258,626,226.57884219437727
259,382,275.75881419644384
260,948,154.31964905343534
261,528,249.3945889685343
262,708,170.2059686637155
263,391,-50.52697075342418
264,416,238.18321013311643
265,595,-60.764255955702716
266,451,-24.612411954457457
267,677,245.1393643693205
268,393,166.67175915413003
269,439,-48.848947828621036
270,476,-155.3596942014491
271,799,189.92766284378826
272,478,-285.09705043990715
273,246,252.62427148498423
274,550,226.73577908429735
275,314,209.19019145427634
276,355,237.26659011443778
277,86,-122.25964488002239
278,1000,-4.462316516265685
279,397,248.31303960106297
280,450,234.50721030056872
281,1000,-116.51197764801933
282,196,52.36697733573308
283,490,251.04935309881844
284,693,-234.3053248194056
285,234,29.100537737289017
286,415,242.13932214787326
287,1000,121.0955178979244
288,1000,-26.632867203200156
289,403,158.6899246809066
290,487,281.67863463255674
291,194,-9.554536533964324
292,791,218.08950352325422
293,348,279.0145112892756
294,361,214.6862538431148
295,645,198.8800462413167
296,937,117.73319453547325
297,192,23.283077212700476
298,1000,12.193684123641736
299,335,282.1299043841375
300,525,175.64442995456483
301,1000,-65.701279018687
302,343,193.64656463866623
303,217,227.29320010565152
304,342,-74.40032246375466
305,357,-167.94717208337963
306,846,177.10364210761003
307,1000,55.11336328738246
308,425,227.71251941814646
309,343,245.71947746598045
310,273,292.87390925843454
311,424,246.5956852786684
312,438,-403.49842723903504
313,308,247.94187787043154
314,192,24.897758846115195
315,173,-22.025071917397113
316,417,270.8032870976097
317,421,258.4437633639578
318,331,222.09328226301554
319,704,152.9415927920254
320,832,245.0728945654674
321,1000,97.41267807816948
322,1000,58.981514922934984
323,361,246.8868528478112
324,315,288.4180638399639
325,597,189.91296323564882
326,615,151.28527171401066
327,419,-141.88078926774492
328,504,213.11993523885036
329,571,231.0013841230142
330,320,285.41286603823465
331,442,269.17718097716727
332,431,244.68163017234278
333,1000,42.590695257196856
334,453,236.1462220928222
335,352,273.0937971688798
336,435,176.32170764928264
337,302,276.53538374005774
338,408,243.7912589037601
339,358,258.8502351625498
340,613,225.29639410887754
341,483,230.21987734001576
342,191,1.4352185309251269
343,323,-178.97207648584293
344,716,232.03482739606693
345,356,214.65916356670638
346,619,222.29673201884313
347,241,271.9523192884826
348,221,80.3376214369843
349,1000,88.99680133310476
350,237,218.79718733485123
351,595,269.4516089689013
352,596,244.5362893687575
353,305,243.1350320002277
354,344,222.1859521905116
355,651,217.02514325502577
356,317,279.87782614328506
357,471,268.92254729784895
358,319,291.71656999313024
359,438,211.47528642997554
360,565,260.9484000302517
361,478,210.38391206367908
362,610,227.91785715510554
363,380,281.2964361622031
364,688,-276.3891242202818
365,255,-135.53492111686361
366,300,278.65290008300383
367,257,300.31874627379506
368,501,268.36317993152136
369,309,240.43508781060373
370,561,228.22655772974167
371,252,223.12324165099852
372,82,-78.67705941581278
373,221,287.28512657969554
374,248,252.0392779355189
375,585,272.6916816025472
376,94,-57.25320807677967
377,495,275.3175535073947
378,100,6.903430765987025
379,261,234.4044097979646
380,535,228.94611412281193
381,236,258.7903892281215
382,1000,-100.09316825562674
383,500,247.22364347356398
384,340,210.35581184073192
385,304,262.13909188223306
386,431,233.86817142811717
387,492,236.7818026849967
388,446,231.4198308033197
389,296,231.25620676560365
390,354,280.5923564048385
391,238,276.8743050507818
392,552,260.0535801968732
393,282,228.25298812684335
394,351,276.5448067799555
395,412,204.50611888462623
396,639,238.54129686078278
397,232,54.82091944587856
398,344,282.1596473172767
399,363,226.14121993992177
400,402,264.7115357386267
