episodes,steps,rewards
0,200,-200.0
1,200,-200.0
2,200,-200.0
3,200,-200.0
4,200,-200.0
5,200,-200.0
6,200,-200.0
7,200,-200.0
8,200,-200.0
9,200,-200.0
10,200,-200.0
11,200,-200.0
12,200,-200.0
13,200,-200.0
14,200,-200.0
15,200,-200.0
16,200,-200.0
17,200,-200.0
18,200,-200.0
19,200,-200.0
20,200,-200.0
21,200,-200.0
22,200,-200.0
23,200,-200.0
24,200,-200.0
25,200,-200.0
26,200,-200.0
27,200,-200.0
28,200,-200.0
29,200,-200.0
30,200,-200.0
31,200,-200.0
32,200,-200.0
33,200,-200.0
34,200,-200.0
35,200,-200.0
36,200,-200.0
37,200,-200.0
38,200,-200.0
39,200,-200.0
40,200,-200.0
41,200,-200.0
42,200,-200.0
43,200,-200.0
44,200,-200.0
45,200,-200.0
46,200,-200.0
47,200,-200.0
48,200,-200.0
49,200,-200.0
50,200,-200.0
51,200,-200.0
52,200,-200.0
53,200,-200.0
54,200,-200.0
55,200,-200.0
56,200,-200.0
57,200,-200.0
58,200,-200.0
59,200,-200.0
60,200,-200.0
61,200,-200.0
62,200,-200.0
63,200,-200.0
64,200,-200.0
65,200,-200.0
66,200,-200.0
67,200,-200.0
68,200,-200.0
69,200,-200.0
70,200,-200.0
71,200,-200.0
72,200,-200.0
73,200,-200.0
74,200,-200.0
75,200,-200.0
76,200,-200.0
77,200,-200.0
78,200,-200.0
79,200,-200.0
80,200,-200.0
81,200,-200.0
82,200,-200.0
83,200,-200.0
84,200,-200.0
85,200,-200.0
86,200,-200.0
87,200,-200.0
88,200,-200.0
89,200,-200.0
90,200,-200.0
91,200,-200.0
92,200,-200.0
93,200,-200.0
94,200,-200.0
95,200,-200.0
96,200,-200.0
97,200,-200.0
98,200,-200.0
99,200,-200.0
100,200,-200.0
101,200,-200.0
102,200,-200.0
103,200,-200.0
104,163,-163.0
105,200,-200.0
106,200,-200.0
107,149,-149.0
108,200,-200.0
109,200,-200.0
110,200,-200.0
111,129,-129.0
112,200,-200.0
113,200,-200.0
114,200,-200.0
115,200,-200.0
116,131,-131.0
117,200,-200.0
118,200,-200.0
119,200,-200.0
120,200,-200.0
121,200,-200.0
122,200,-200.0
123,200,-200.0
124,200,-200.0
125,200,-200.0
126,200,-200.0
127,200,-200.0
128,200,-200.0
129,200,-200.0
130,128,-128.0
131,200,-200.0
132,200,-200.0
133,200,-200.0
134,200,-200.0
135,200,-200.0
136,165,-165.0
137,200,-200.0
138,200,-200.0
139,200,-200.0
140,200,-200.0
141,143,-143.0
142,200,-200.0
143,200,-200.0
144,200,-200.0
145,198,-198.0
146,200,-200.0
147,200,-200.0
148,200,-200.0
149,164,-164.0
150,200,-200.0
151,200,-200.0
152,200,-200.0
153,200,-200.0
154,200,-200.0
155,200,-200.0
156,169,-169.0
157,155,-155.0
158,200,-200.0
159,200,-200.0
160,181,-181.0
161,200,-200.0
162,200,-200.0
163,200,-200.0
164,200,-200.0
165,200,-200.0
166,153,-153.0
167,177,-177.0
168,200,-200.0
169,200,-200.0
170,143,-143.0
171,177,-177.0
172,200,-200.0
173,200,-200.0
174,200,-200.0
175,199,-199.0
176,200,-200.0
177,200,-200.0
178,141,-141.0
179,200,-200.0
180,143,-143.0
181,200,-200.0
182,200,-200.0
183,200,-200.0
184,200,-200.0
185,152,-152.0
186,200,-200.0
187,189,-189.0
188,200,-200.0
189,200,-200.0
190,200,-200.0
191,200,-200.0
192,179,-179.0
193,159,-159.0
194,149,-149.0
195,200,-200.0
196,160,-160.0
197,200,-200.0
198,143,-143.0
199,200,-200.0
200,200,-200.0
201,133,-133.0
202,200,-200.0
203,151,-151.0
204,169,-169.0
205,200,-200.0
206,200,-200.0
207,138,-138.0
208,200,-200.0
209,166,-166.0
210,200,-200.0
211,200,-200.0
212,200,-200.0
213,149,-149.0
214,87,-87.0
215,148,-148.0
216,200,-200.0
217,174,-174.0
218,200,-200.0
219,183,-183.0
220,169,-169.0
221,159,-159.0
222,146,-146.0
223,142,-142.0
224,88,-88.0
225,200,-200.0
226,155,-155.0
227,200,-200.0
228,148,-148.0
229,178,-178.0
230,117,-117.0
231,200,-200.0
232,117,-117.0
233,147,-147.0
234,111,-111.0
235,163,-163.0
236,168,-168.0
237,157,-157.0
238,110,-110.0
239,152,-152.0
240,117,-117.0
241,164,-164.0
242,132,-132.0
243,122,-122.0
244,140,-140.0
245,150,-150.0
246,149,-149.0
247,112,-112.0
248,154,-154.0
249,153,-153.0
250,134,-134.0
251,152,-152.0
252,87,-87.0
253,162,-162.0
254,149,-149.0
255,150,-150.0
256,144,-144.0
257,152,-152.0
258,166,-166.0
259,147,-147.0
260,112,-112.0
261,154,-154.0
262,133,-133.0
263,124,-124.0
264,200,-200.0
265,154,-154.0
266,153,-153.0
267,166,-166.0
268,183,-183.0
269,116,-116.0
270,119,-119.0
271,161,-161.0
272,159,-159.0
273,180,-180.0
274,200,-200.0
275,163,-163.0
276,149,-149.0
277,155,-155.0
278,139,-139.0
279,135,-135.0
280,200,-200.0
281,181,-181.0
282,172,-172.0
283,153,-153.0
284,147,-147.0
285,155,-155.0
286,154,-154.0
287,108,-108.0
288,171,-171.0
289,180,-180.0
290,164,-164.0
291,124,-124.0
292,174,-174.0
293,150,-150.0
294,161,-161.0
295,94,-94.0
296,138,-138.0
297,170,-170.0
298,141,-141.0
299,146,-146.0
300,148,-148.0
301,145,-145.0
302,142,-142.0
303,107,-107.0
304,113,-113.0
305,153,-153.0
306,84,-84.0
307,114,-114.0
308,93,-93.0
309,149,-149.0
310,137,-137.0
311,155,-155.0
312,169,-169.0
313,149,-149.0
314,158,-158.0
315,91,-91.0
316,144,-144.0
317,155,-155.0
318,148,-148.0
319,158,-158.0
320,115,-115.0
321,144,-144.0
322,171,-171.0
323,180,-180.0
324,183,-183.0
325,102,-102.0
326,189,-189.0
327,116,-116.0
328,151,-151.0
329,167,-167.0
330,147,-147.0
331,163,-163.0
332,163,-163.0
333,165,-165.0
334,143,-143.0
335,152,-152.0
336,147,-147.0
337,121,-121.0
338,116,-116.0
339,157,-157.0
340,169,-169.0
341,136,-136.0
342,168,-168.0
343,151,-151.0
344,180,-180.0
345,92,-92.0
346,125,-125.0
347,143,-143.0
348,143,-143.0
349,148,-148.0
350,148,-148.0
351,146,-146.0
352,84,-84.0
353,178,-178.0
354,150,-150.0
355,134,-134.0
356,152,-152.0
357,148,-148.0
358,151,-151.0
359,150,-150.0
360,149,-149.0
361,179,-179.0
362,87,-87.0
363,146,-146.0
364,153,-153.0
365,163,-163.0
366,150,-150.0
367,200,-200.0
368,141,-141.0
369,200,-200.0
370,144,-144.0
371,156,-156.0
372,134,-134.0
373,144,-144.0
374,163,-163.0
375,156,-156.0
376,149,-149.0
377,148,-148.0
378,133,-133.0
379,136,-136.0
380,109,-109.0
381,147,-147.0
382,152,-152.0
383,133,-133.0
384,135,-135.0
385,134,-134.0
386,131,-131.0
387,192,-192.0
388,110,-110.0
389,105,-105.0
390,141,-141.0
391,146,-146.0
392,135,-135.0
393,152,-152.0
394,133,-133.0
395,136,-136.0
396,127,-127.0
397,84,-84.0
398,142,-142.0
399,144,-144.0
400,172,-172.0
401,119,-119.0
402,162,-162.0
403,112,-112.0
404,164,-164.0
405,140,-140.0
406,143,-143.0
407,143,-143.0
408,114,-114.0
409,101,-101.0
410,113,-113.0
411,115,-115.0
412,125,-125.0
413,86,-86.0
414,108,-108.0
415,110,-110.0
416,114,-114.0
417,139,-139.0
418,189,-189.0
419,110,-110.0
420,109,-109.0
421,84,-84.0
422,114,-114.0
423,108,-108.0
424,139,-139.0
425,157,-157.0
426,131,-131.0
427,117,-117.0
428,133,-133.0
429,168,-168.0
430,164,-164.0
431,164,-164.0
432,198,-198.0
433,108,-108.0
434,141,-141.0
435,152,-152.0
436,163,-163.0
437,112,-112.0
438,154,-154.0
439,168,-168.0
440,151,-151.0
441,152,-152.0
442,90,-90.0
443,84,-84.0
444,173,-173.0
445,86,-86.0
446,169,-169.0
447,147,-147.0
448,96,-96.0
449,87,-87.0
450,103,-103.0
451,200,-200.0
452,96,-96.0
453,138,-138.0
454,96,-96.0
455,152,-152.0
456,153,-153.0
457,144,-144.0
458,143,-143.0
459,142,-142.0
460,162,-162.0
461,150,-150.0
462,176,-176.0
463,142,-142.0
464,140,-140.0
465,142,-142.0
466,150,-150.0
467,148,-148.0
468,86,-86.0
469,89,-89.0
470,156,-156.0
471,149,-149.0
472,98,-98.0
473,106,-106.0
474,88,-88.0
475,144,-144.0
476,155,-155.0
477,152,-152.0
478,86,-86.0
479,107,-107.0
480,138,-138.0
481,86,-86.0
482,167,-167.0
483,132,-132.0
484,144,-144.0
485,170,-170.0
486,135,-135.0
487,159,-159.0
488,86,-86.0
489,166,-166.0
490,134,-134.0
491,90,-90.0
492,164,-164.0
493,150,-150.0
494,142,-142.0
495,136,-136.0
496,151,-151.0
497,136,-136.0
498,88,-88.0
499,140,-140.0
500,147,-147.0
501,143,-143.0
502,140,-140.0
503,84,-84.0
504,140,-140.0
505,148,-148.0
506,142,-142.0
507,136,-136.0
508,137,-137.0
509,147,-147.0
510,130,-130.0
511,91,-91.0
512,146,-146.0
513,145,-145.0
514,145,-145.0
515,89,-89.0
516,84,-84.0
517,85,-85.0
518,89,-89.0
519,141,-141.0
520,87,-87.0
521,156,-156.0
522,142,-142.0
523,83,-83.0
524,143,-143.0
525,135,-135.0
526,200,-200.0
527,149,-149.0
528,200,-200.0
529,142,-142.0
530,166,-166.0
531,145,-145.0
532,94,-94.0
533,200,-200.0
534,89,-89.0
535,137,-137.0
536,89,-89.0
537,157,-157.0
538,95,-95.0
539,144,-144.0
540,161,-161.0
541,91,-91.0
542,200,-200.0
543,148,-148.0
544,153,-153.0
545,189,-189.0
546,94,-94.0
547,154,-154.0
548,169,-169.0
549,130,-130.0
550,181,-181.0
551,160,-160.0
552,170,-170.0
553,150,-150.0
554,110,-110.0
555,162,-162.0
556,168,-168.0
557,165,-165.0
558,113,-113.0
559,150,-150.0
560,151,-151.0
561,97,-97.0
562,135,-135.0
563,105,-105.0
564,94,-94.0
565,149,-149.0
566,153,-153.0
567,152,-152.0
568,145,-145.0
569,137,-137.0
570,106,-106.0
571,85,-85.0
572,147,-147.0
573,109,-109.0
574,142,-142.0
575,134,-134.0
576,88,-88.0
577,145,-145.0
578,86,-86.0
579,146,-146.0
580,94,-94.0
581,93,-93.0
582,139,-139.0
583,94,-94.0
584,149,-149.0
585,89,-89.0
586,159,-159.0
587,142,-142.0
588,151,-151.0
589,142,-142.0
590,140,-140.0
591,149,-149.0
592,142,-142.0
593,152,-152.0
594,141,-141.0
595,143,-143.0
596,156,-156.0
597,160,-160.0
598,118,-118.0
599,137,-137.0
600,159,-159.0
601,177,-177.0
602,95,-95.0
603,136,-136.0
604,90,-90.0
605,86,-86.0
606,110,-110.0
607,145,-145.0
608,149,-149.0
609,162,-162.0
610,146,-146.0
611,154,-154.0
612,85,-85.0
613,137,-137.0
614,87,-87.0
615,170,-170.0
616,136,-136.0
617,142,-142.0
618,92,-92.0
619,156,-156.0
620,152,-152.0
621,104,-104.0
622,143,-143.0
623,104,-104.0
624,87,-87.0
625,85,-85.0
626,87,-87.0
627,154,-154.0
628,89,-89.0
629,141,-141.0
630,86,-86.0
631,154,-154.0
632,200,-200.0
633,147,-147.0
634,146,-146.0
635,85,-85.0
636,153,-153.0
637,151,-151.0
638,86,-86.0
639,146,-146.0
640,157,-157.0
641,93,-93.0
642,91,-91.0
643,86,-86.0
644,152,-152.0
645,140,-140.0
646,118,-118.0
647,149,-149.0
648,155,-155.0
649,156,-156.0
650,151,-151.0
651,139,-139.0
652,158,-158.0
653,174,-174.0
654,152,-152.0
655,133,-133.0
656,145,-145.0
657,142,-142.0
658,165,-165.0
659,160,-160.0
660,180,-180.0
661,155,-155.0
662,157,-157.0
663,200,-200.0
664,157,-157.0
665,200,-200.0
666,124,-124.0
667,162,-162.0
668,160,-160.0
669,148,-148.0
670,86,-86.0
671,155,-155.0
672,200,-200.0
673,159,-159.0
674,200,-200.0
675,151,-151.0
676,172,-172.0
677,161,-161.0
678,102,-102.0
679,161,-161.0
680,161,-161.0
681,166,-166.0
682,150,-150.0
683,161,-161.0
684,182,-182.0
685,108,-108.0
686,200,-200.0
687,200,-200.0
688,152,-152.0
689,147,-147.0
690,96,-96.0
691,113,-113.0
692,146,-146.0
693,186,-186.0
694,92,-92.0
695,162,-162.0
696,156,-156.0
697,140,-140.0
698,200,-200.0
699,150,-150.0
700,114,-114.0
701,99,-99.0
702,148,-148.0
703,200,-200.0
704,90,-90.0
705,162,-162.0
706,115,-115.0
707,172,-172.0
708,152,-152.0
709,200,-200.0
710,151,-151.0
711,175,-175.0
712,158,-158.0
713,102,-102.0
714,98,-98.0
715,155,-155.0
716,153,-153.0
717,112,-112.0
718,159,-159.0
719,87,-87.0
720,99,-99.0
721,141,-141.0
722,177,-177.0
723,185,-185.0
724,91,-91.0
725,144,-144.0
726,118,-118.0
727,200,-200.0
728,84,-84.0
729,148,-148.0
730,157,-157.0
731,156,-156.0
732,86,-86.0
733,159,-159.0
734,89,-89.0
735,139,-139.0
736,137,-137.0
737,150,-150.0
738,172,-172.0
739,156,-156.0
740,161,-161.0
741,141,-141.0
742,85,-85.0
743,151,-151.0
744,97,-97.0
745,148,-148.0
746,166,-166.0
747,98,-98.0
748,94,-94.0
749,164,-164.0
750,145,-145.0
751,85,-85.0
752,138,-138.0
753,145,-145.0
754,160,-160.0
755,155,-155.0
756,146,-146.0
757,120,-120.0
758,92,-92.0
759,105,-105.0
760,147,-147.0
761,147,-147.0
762,163,-163.0
763,151,-151.0
764,99,-99.0
765,146,-146.0
766,145,-145.0
767,139,-139.0
768,146,-146.0
769,90,-90.0
770,150,-150.0
771,151,-151.0
772,140,-140.0
773,148,-148.0
774,155,-155.0
775,143,-143.0
776,200,-200.0
777,90,-90.0
778,192,-192.0
779,177,-177.0
780,88,-88.0
781,119,-119.0
782,200,-200.0
783,200,-200.0
784,133,-133.0
785,101,-101.0
786,142,-142.0
787,155,-155.0
788,144,-144.0
789,142,-142.0
790,158,-158.0
791,148,-148.0
792,147,-147.0
793,134,-134.0
794,148,-148.0
795,137,-137.0
796,141,-141.0
797,92,-92.0
798,159,-159.0
799,94,-94.0
800,136,-136.0
801,151,-151.0
802,200,-200.0
803,146,-146.0
804,157,-157.0
805,146,-146.0
806,145,-145.0
807,158,-158.0
808,200,-200.0
809,145,-145.0
810,165,-165.0
811,177,-177.0
812,158,-158.0
813,175,-175.0
814,200,-200.0
815,175,-175.0
816,200,-200.0
817,200,-200.0
818,174,-174.0
819,168,-168.0
820,97,-97.0
821,191,-191.0
822,161,-161.0
823,200,-200.0
824,86,-86.0
825,143,-143.0
826,172,-172.0
827,88,-88.0
828,123,-123.0
829,157,-157.0
830,85,-85.0
831,109,-109.0
832,168,-168.0
833,149,-149.0
834,98,-98.0
835,115,-115.0
836,161,-161.0
837,154,-154.0
838,200,-200.0
839,86,-86.0
840,93,-93.0
841,154,-154.0
842,146,-146.0
843,162,-162.0
844,200,-200.0
845,165,-165.0
846,155,-155.0
847,199,-199.0
848,160,-160.0
849,93,-93.0
850,158,-158.0
851,177,-177.0
852,96,-96.0
853,87,-87.0
854,184,-184.0
855,145,-145.0
856,135,-135.0
857,158,-158.0
858,136,-136.0
859,136,-136.0
860,133,-133.0
861,135,-135.0
862,154,-154.0
863,132,-132.0
864,156,-156.0
865,152,-152.0
866,139,-139.0
867,148,-148.0
868,112,-112.0
869,143,-143.0
870,107,-107.0
871,104,-104.0
872,200,-200.0
873,167,-167.0
874,125,-125.0
875,186,-186.0
876,197,-197.0
877,111,-111.0
878,185,-185.0
879,200,-200.0
880,138,-138.0
881,155,-155.0
882,162,-162.0
883,175,-175.0
884,140,-140.0
885,128,-128.0
886,89,-89.0
887,155,-155.0
888,89,-89.0
889,176,-176.0
890,166,-166.0
891,88,-88.0
892,174,-174.0
893,98,-98.0
894,109,-109.0
895,170,-170.0
896,94,-94.0
897,152,-152.0
898,168,-168.0
899,153,-153.0
900,167,-167.0
901,200,-200.0
902,200,-200.0
903,93,-93.0
904,158,-158.0
905,103,-103.0
906,94,-94.0
907,100,-100.0
908,200,-200.0
909,159,-159.0
910,93,-93.0
911,150,-150.0
912,84,-84.0
913,152,-152.0
914,156,-156.0
915,157,-157.0
916,156,-156.0
917,100,-100.0
918,98,-98.0
919,92,-92.0
920,181,-181.0
921,103,-103.0
922,84,-84.0
923,156,-156.0
924,180,-180.0
925,140,-140.0
926,149,-149.0
927,152,-152.0
928,147,-147.0
929,86,-86.0
930,150,-150.0
931,141,-141.0
932,178,-178.0
933,145,-145.0
934,154,-154.0
935,149,-149.0
936,155,-155.0
937,200,-200.0
938,175,-175.0
939,88,-88.0
940,144,-144.0
941,88,-88.0
942,87,-87.0
943,97,-97.0
944,152,-152.0
945,112,-112.0
946,146,-146.0
947,152,-152.0
948,139,-139.0
949,148,-148.0
950,98,-98.0
951,86,-86.0
952,152,-152.0
953,183,-183.0
954,146,-146.0
955,104,-104.0
956,150,-150.0
957,152,-152.0
958,146,-146.0
959,155,-155.0
960,156,-156.0
961,164,-164.0
962,143,-143.0
963,155,-155.0
964,158,-158.0
965,132,-132.0
966,135,-135.0
967,147,-147.0
968,163,-163.0
969,180,-180.0
970,200,-200.0
971,176,-176.0
972,153,-153.0
973,140,-140.0
974,91,-91.0
975,139,-139.0
976,138,-138.0
977,92,-92.0
978,186,-186.0
979,175,-175.0
980,141,-141.0
981,89,-89.0
982,143,-143.0
983,88,-88.0
984,94,-94.0
985,140,-140.0
986,131,-131.0
987,193,-193.0
988,154,-154.0
989,159,-159.0
990,151,-151.0
991,176,-176.0
992,145,-145.0
993,145,-145.0
994,140,-140.0
995,149,-149.0
996,88,-88.0
997,145,-145.0
998,111,-111.0
999,102,-102.0
1000,135,-135.0
1001,168,-168.0
1002,139,-139.0
1003,141,-141.0
1004,156,-156.0
1005,97,-97.0
1006,145,-145.0
1007,168,-168.0
1008,161,-161.0
1009,111,-111.0
1010,152,-152.0
1011,88,-88.0
1012,147,-147.0
1013,162,-162.0
1014,146,-146.0
1015,145,-145.0
1016,146,-146.0
1017,148,-148.0
1018,153,-153.0
1019,152,-152.0
1020,159,-159.0
1021,139,-139.0
1022,156,-156.0
1023,140,-140.0
1024,109,-109.0
1025,180,-180.0
1026,151,-151.0
1027,144,-144.0
1028,87,-87.0
1029,200,-200.0
1030,93,-93.0
1031,140,-140.0
1032,161,-161.0
1033,149,-149.0
1034,151,-151.0
1035,152,-152.0
1036,151,-151.0
1037,88,-88.0
1038,200,-200.0
1039,152,-152.0
1040,145,-145.0
1041,148,-148.0
1042,107,-107.0
1043,94,-94.0
1044,146,-146.0
1045,139,-139.0
1046,141,-141.0
1047,142,-142.0
1048,102,-102.0
1049,167,-167.0
1050,153,-153.0
1051,152,-152.0
1052,114,-114.0
1053,142,-142.0
1054,96,-96.0
1055,147,-147.0
1056,151,-151.0
1057,157,-157.0
1058,89,-89.0
1059,148,-148.0
1060,155,-155.0
1061,165,-165.0
1062,170,-170.0
1063,98,-98.0
1064,148,-148.0
1065,148,-148.0
1066,143,-143.0
1067,94,-94.0
1068,98,-98.0
1069,146,-146.0
1070,200,-200.0
1071,99,-99.0
1072,156,-156.0
1073,155,-155.0
1074,166,-166.0
1075,162,-162.0
1076,160,-160.0
1077,200,-200.0
1078,151,-151.0
1079,146,-146.0
1080,155,-155.0
1081,137,-137.0
1082,92,-92.0
1083,145,-145.0
1084,164,-164.0
1085,127,-127.0
1086,108,-108.0
1087,148,-148.0
1088,98,-98.0
1089,146,-146.0
1090,95,-95.0
1091,95,-95.0
1092,151,-151.0
1093,139,-139.0
1094,200,-200.0
1095,149,-149.0
1096,143,-143.0
1097,85,-85.0
1098,151,-151.0
1099,109,-109.0
1100,85,-85.0
1101,158,-158.0
1102,97,-97.0
1103,144,-144.0
1104,200,-200.0
1105,160,-160.0
1106,157,-157.0
1107,200,-200.0
1108,111,-111.0
1109,159,-159.0
1110,87,-87.0
1111,153,-153.0
1112,200,-200.0
1113,90,-90.0
1114,146,-146.0
1115,154,-154.0
1116,159,-159.0
1117,157,-157.0
1118,200,-200.0
1119,152,-152.0
1120,172,-172.0
1121,168,-168.0
1122,150,-150.0
1123,178,-178.0
1124,141,-141.0
1125,116,-116.0
1126,153,-153.0
1127,187,-187.0
1128,150,-150.0
1129,169,-169.0
1130,107,-107.0
1131,161,-161.0
1132,192,-192.0
1133,146,-146.0
1134,108,-108.0
1135,200,-200.0
1136,155,-155.0
1137,176,-176.0
1138,121,-121.0
1139,113,-113.0
1140,116,-116.0
1141,91,-91.0
1142,91,-91.0
1143,109,-109.0
1144,150,-150.0
1145,148,-148.0
1146,137,-137.0
1147,152,-152.0
1148,146,-146.0
1149,96,-96.0
1150,112,-112.0
1151,147,-147.0
1152,119,-119.0
1153,178,-178.0
1154,160,-160.0
1155,156,-156.0
1156,141,-141.0
1157,152,-152.0
1158,147,-147.0
1159,148,-148.0
1160,125,-125.0
1161,165,-165.0
1162,149,-149.0
1163,141,-141.0
1164,100,-100.0
1165,143,-143.0
1166,150,-150.0
1167,166,-166.0
1168,172,-172.0
1169,140,-140.0
1170,111,-111.0
1171,184,-184.0
1172,145,-145.0
1173,200,-200.0
1174,140,-140.0
1175,149,-149.0
1176,89,-89.0
1177,145,-145.0
1178,181,-181.0
1179,144,-144.0
1180,140,-140.0
1181,151,-151.0
1182,200,-200.0
1183,152,-152.0
1184,95,-95.0
1185,157,-157.0
1186,149,-149.0
1187,156,-156.0
1188,159,-159.0
1189,145,-145.0
1190,151,-151.0
1191,127,-127.0
1192,89,-89.0
1193,150,-150.0
1194,143,-143.0
1195,163,-163.0
1196,200,-200.0
1197,200,-200.0
1198,84,-84.0
1199,143,-143.0
1200,144,-144.0
1201,200,-200.0
1202,200,-200.0
1203,200,-200.0
1204,200,-200.0
1205,200,-200.0
1206,200,-200.0
1207,200,-200.0
1208,200,-200.0
1209,200,-200.0
1210,200,-200.0
1211,200,-200.0
1212,200,-200.0
1213,200,-200.0
1214,200,-200.0
1215,200,-200.0
1216,200,-200.0
1217,200,-200.0
1218,200,-200.0
1219,200,-200.0
1220,200,-200.0
1221,200,-200.0
1222,200,-200.0
1223,200,-200.0
1224,200,-200.0
1225,200,-200.0
1226,200,-200.0
1227,200,-200.0
1228,200,-200.0
1229,151,-151.0
1230,183,-183.0
1231,200,-200.0
1232,200,-200.0
1233,155,-155.0
1234,200,-200.0
1235,184,-184.0
1236,152,-152.0
1237,134,-134.0
1238,163,-163.0
1239,135,-135.0
1240,130,-130.0
1241,118,-118.0
1242,200,-200.0
1243,132,-132.0
1244,200,-200.0
1245,159,-159.0
1246,200,-200.0
1247,179,-179.0
1248,134,-134.0
1249,200,-200.0
1250,200,-200.0
1251,173,-173.0
1252,200,-200.0
1253,113,-113.0
1254,125,-125.0
1255,123,-123.0
1256,200,-200.0
1257,112,-112.0
1258,160,-160.0
1259,167,-167.0
1260,191,-191.0
1261,170,-170.0
1262,171,-171.0
1263,200,-200.0
1264,175,-175.0
1265,178,-178.0
1266,115,-115.0
1267,178,-178.0
1268,169,-169.0
1269,115,-115.0
1270,162,-162.0
1271,158,-158.0
1272,120,-120.0
1273,134,-134.0
1274,94,-94.0
1275,125,-125.0
1276,137,-137.0
1277,189,-189.0
1278,192,-192.0
1279,120,-120.0
1280,119,-119.0
1281,155,-155.0
1282,145,-145.0
1283,134,-134.0
1284,165,-165.0
1285,200,-200.0
1286,158,-158.0
1287,165,-165.0
1288,146,-146.0
1289,109,-109.0
1290,160,-160.0
1291,200,-200.0
1292,161,-161.0
1293,157,-157.0
1294,159,-159.0
1295,123,-123.0
1296,128,-128.0
1297,141,-141.0
1298,169,-169.0
1299,121,-121.0
1300,96,-96.0
1301,97,-97.0
1302,146,-146.0
1303,124,-124.0
1304,179,-179.0
1305,162,-162.0
1306,159,-159.0
1307,130,-130.0
1308,160,-160.0
1309,150,-150.0
1310,157,-157.0
1311,160,-160.0
1312,152,-152.0
1313,200,-200.0
1314,152,-152.0
1315,89,-89.0
1316,177,-177.0
1317,129,-129.0
1318,88,-88.0
1319,93,-93.0
1320,161,-161.0
1321,96,-96.0
1322,88,-88.0
1323,144,-144.0
1324,158,-158.0
1325,158,-158.0
1326,176,-176.0
1327,150,-150.0
1328,168,-168.0
1329,138,-138.0
1330,116,-116.0
1331,144,-144.0
1332,159,-159.0
1333,137,-137.0
1334,148,-148.0
1335,90,-90.0
1336,141,-141.0
1337,139,-139.0
1338,136,-136.0
1339,138,-138.0
1340,162,-162.0
1341,136,-136.0
1342,87,-87.0
1343,165,-165.0
1344,129,-129.0
1345,125,-125.0
1346,98,-98.0
1347,163,-163.0
1348,136,-136.0
1349,153,-153.0
1350,154,-154.0
