{
    "env": "DualPole",
    "model_info": "common128",
    "num_episodes_solved": [
        5525,
        10331,
        6532,
        10733,
        6243,
        7311,
        8447,
        11174,
        9666,
        5618
    ]
}