episodes,steps,rewards
0,67,-80.08374019717122
1,84,-153.77844067946523
2,65,-95.62769526240862
3,86,-347.330266149758
4,81,-195.4193410860017
5,113,-328.14866370938466
6,104,-234.5752167065134
7,106,-193.22776076703298
8,101,-306.37264329307686
9,69,-99.00611116815426
10,87,-103.51470196448595
11,85,-70.94116165611823
12,113,-135.17681913924747
13,130,-113.57258937323593
14,114,-150.71086152214588
15,233,-61.36918268368366
16,106,-196.52415635892845
17,203,-96.06357449214208
18,216,-126.95307133213166
19,157,40.17574301118225
20,1000,-99.41114051301791
21,1000,-67.80193764975527
22,1000,-102.50987438236434
23,1000,-92.41770528869138
24,416,-28.23834467262384
25,495,-1.5298009830666786
26,502,230.09042697699203
27,1000,-66.03952765409436
28,1000,-63.59024123274249
29,1000,-42.57422137579624
30,898,-228.49393572916426
31,607,-65.84979847371366
32,969,-212.62854157241233
33,483,-284.96997332768797
34,1000,-23.736626062798223
35,1000,-13.26753869474041
36,766,-148.33300842715855
37,920,113.8755078748145
38,1000,-53.874870952472335
39,1000,-100.1536540881676
40,1000,-39.77480230011054
41,1000,-62.610536401069155
42,1000,-87.33971562293432
43,82,-502.46529781684114
44,1000,15.007804755537482
45,968,90.21531556411452
46,365,230.0331256429511
47,1000,-50.9107201062231
48,1000,-62.9826046610936
49,814,-252.25925794159738
50,1000,-66.16187325633277
51,1000,-59.257296069751625
52,1000,-23.773882516294343
53,942,148.2310783314521
54,1000,-9.211004141297545
55,1000,-30.823497424548894
56,581,171.73347133029387
57,123,38.113057259487476
58,1000,-7.416546958467754
59,1000,-33.345635829144776
60,1000,-4.435760714071622
61,1000,-50.847218021398405
62,1000,-59.5857643676498
63,1000,-45.410123615332076
64,1000,-78.10631318508113
65,470,232.30278118765136
66,1000,-23.750305423747303
67,430,256.976358526247
68,1000,-3.456076150060996
69,1000,-43.856857280027
70,164,-51.27025568460024
71,112,-155.0720805986941
72,206,-75.43406498460035
73,500,220.31766489954776
74,1000,-0.8229336114132779
75,329,192.99486707821265
76,167,-42.44805680193767
77,1000,92.2220681790633
78,470,210.86695355506777
79,454,240.85750076307716
80,562,179.8003449055003
81,1000,-29.45232350061254
82,291,-41.92552915836859
83,769,170.00929033659202
84,565,204.13117564440455
85,316,-84.77876942337826
86,1000,-66.99418723930644
87,226,290.90957400571926
88,128,-74.08053298692107
89,159,-87.21447792071679
90,809,-205.40300283982793
91,199,10.134242202320522
92,901,133.00038849055352
93,523,228.56742805503453
94,280,-50.92578727060609
95,649,111.81931215178697
96,174,67.40459138991281
97,443,223.044108433637
98,1000,-56.07552269691031
99,404,259.2189351870903
100,393,-2.352278110218208
101,367,276.0621463307513
102,396,208.71107595761055
103,438,220.40551571749404
104,224,38.13338115734001
105,480,223.3273998634233
106,127,-262.82066134307547
107,254,269.8585407084537
108,271,260.0836309545224
109,601,221.30919713858265
110,492,148.822153179341
111,1000,-26.971930321792414
112,464,205.4320889866401
113,350,191.77269821441072
114,485,242.95434028449327
115,450,205.7027004554174
116,401,254.19599494807022
117,714,222.67489576203843
118,744,154.41351584263205
119,809,88.50203647395007
120,604,226.20313673321337
121,499,224.24968441740637
122,327,232.9356651387431
123,381,-16.20690276710478
124,253,-19.100447165544836
125,247,-66.13155359349132
126,240,265.9324570935596
127,1000,-64.1816417746797
128,200,-18.524577329136008
129,835,74.58386966989376
130,276,253.32953951593498
131,1000,-75.8815487656418
132,631,168.88982650425208
133,514,258.98540547767107
134,481,-43.293456519707135
135,355,267.0031328985643
136,381,222.14844575306603
137,433,251.08353328783699
138,419,239.81806112475172
139,533,210.6701637793166
140,407,258.7405275533864
141,265,234.9095989124595
142,317,294.39899697098855
143,324,260.6836263814306
144,205,30.601570496219722
145,440,-338.89791626267595
146,1000,121.77883589935945
147,292,239.0277292513754
148,472,195.67410305158432
149,563,258.7768940468238
150,468,235.7125812009762
