episodes,steps,rewards
0,200,-200.0
1,200,-200.0
2,200,-200.0
3,200,-200.0
4,200,-200.0
5,200,-200.0
6,200,-200.0
7,200,-200.0
8,200,-200.0
9,200,-200.0
10,200,-200.0
11,200,-200.0
12,200,-200.0
13,200,-200.0
14,200,-200.0
15,200,-200.0
16,200,-200.0
17,200,-200.0
18,200,-200.0
19,200,-200.0
20,200,-200.0
21,200,-200.0
22,200,-200.0
23,200,-200.0
24,200,-200.0
25,200,-200.0
26,200,-200.0
27,200,-200.0
28,200,-200.0
29,200,-200.0
30,200,-200.0
31,200,-200.0
32,200,-200.0
33,200,-200.0
34,200,-200.0
35,200,-200.0
36,200,-200.0
37,200,-200.0
38,200,-200.0
39,200,-200.0
40,200,-200.0
41,200,-200.0
42,200,-200.0
43,200,-200.0
44,200,-200.0
45,200,-200.0
46,200,-200.0
47,200,-200.0
48,200,-200.0
49,200,-200.0
50,200,-200.0
51,200,-200.0
52,200,-200.0
53,200,-200.0
54,200,-200.0
55,200,-200.0
56,200,-200.0
57,200,-200.0
58,200,-200.0
59,200,-200.0
60,200,-200.0
61,180,-180.0
62,200,-200.0
63,200,-200.0
64,200,-200.0
65,200,-200.0
66,200,-200.0
67,200,-200.0
68,200,-200.0
69,200,-200.0
70,200,-200.0
71,177,-177.0
72,200,-200.0
73,200,-200.0
74,200,-200.0
75,200,-200.0
76,200,-200.0
77,200,-200.0
78,200,-200.0
79,200,-200.0
80,200,-200.0
81,200,-200.0
82,200,-200.0
83,200,-200.0
84,200,-200.0
85,200,-200.0
86,200,-200.0
87,200,-200.0
88,200,-200.0
89,200,-200.0
90,200,-200.0
91,200,-200.0
92,200,-200.0
93,200,-200.0
94,200,-200.0
95,200,-200.0
96,200,-200.0
97,200,-200.0
98,188,-188.0
99,200,-200.0
100,200,-200.0
101,200,-200.0
102,199,-199.0
103,141,-141.0
104,200,-200.0
105,192,-192.0
106,187,-187.0
107,157,-157.0
108,200,-200.0
109,200,-200.0
110,118,-118.0
111,150,-150.0
112,121,-121.0
113,200,-200.0
114,200,-200.0
115,87,-87.0
116,127,-127.0
117,179,-179.0
118,185,-185.0
119,154,-154.0
120,200,-200.0
121,200,-200.0
122,131,-131.0
123,200,-200.0
124,161,-161.0
125,200,-200.0
126,200,-200.0
127,200,-200.0
128,200,-200.0
129,200,-200.0
130,168,-168.0
131,176,-176.0
132,200,-200.0
133,172,-172.0
134,128,-128.0
135,155,-155.0
136,157,-157.0
137,170,-170.0
138,145,-145.0
139,200,-200.0
140,168,-168.0
141,200,-200.0
142,196,-196.0
143,160,-160.0
144,138,-138.0
145,175,-175.0
146,86,-86.0
147,145,-145.0
148,149,-149.0
149,162,-162.0
150,187,-187.0
151,200,-200.0
152,200,-200.0
153,195,-195.0
154,172,-172.0
155,170,-170.0
156,173,-173.0
157,146,-146.0
158,114,-114.0
159,139,-139.0
160,147,-147.0
161,141,-141.0
162,161,-161.0
163,150,-150.0
164,148,-148.0
165,180,-180.0
166,137,-137.0
167,113,-113.0
168,185,-185.0
169,200,-200.0
170,137,-137.0
171,142,-142.0
172,154,-154.0
173,175,-175.0
174,92,-92.0
175,147,-147.0
176,110,-110.0
177,137,-137.0
178,116,-116.0
179,152,-152.0
180,148,-148.0
181,144,-144.0
182,144,-144.0
183,148,-148.0
184,147,-147.0
185,177,-177.0
186,151,-151.0
187,176,-176.0
188,143,-143.0
189,151,-151.0
190,163,-163.0
191,171,-171.0
192,145,-145.0
193,141,-141.0
194,140,-140.0
195,151,-151.0
196,90,-90.0
197,200,-200.0
198,140,-140.0
199,165,-165.0
200,192,-192.0
201,161,-161.0
202,160,-160.0
203,157,-157.0
204,200,-200.0
205,144,-144.0
206,139,-139.0
207,101,-101.0
208,200,-200.0
209,116,-116.0
210,160,-160.0
211,148,-148.0
212,135,-135.0
213,200,-200.0
214,161,-161.0
215,115,-115.0
216,86,-86.0
217,166,-166.0
218,144,-144.0
219,151,-151.0
220,153,-153.0
221,142,-142.0
222,163,-163.0
223,179,-179.0
224,86,-86.0
225,180,-180.0
226,161,-161.0
227,92,-92.0
228,142,-142.0
229,186,-186.0
230,148,-148.0
231,153,-153.0
232,109,-109.0
233,174,-174.0
234,179,-179.0
235,139,-139.0
236,164,-164.0
237,144,-144.0
238,158,-158.0
239,93,-93.0
240,149,-149.0
241,96,-96.0
242,138,-138.0
243,200,-200.0
244,145,-145.0
245,152,-152.0
246,148,-148.0
247,143,-143.0
248,167,-167.0
249,107,-107.0
250,149,-149.0
251,151,-151.0
252,167,-167.0
253,151,-151.0
254,177,-177.0
255,147,-147.0
256,147,-147.0
257,150,-150.0
258,153,-153.0
259,91,-91.0
260,150,-150.0
261,166,-166.0
262,182,-182.0
263,155,-155.0
264,146,-146.0
265,137,-137.0
266,136,-136.0
267,139,-139.0
268,141,-141.0
269,160,-160.0
270,90,-90.0
271,171,-171.0
272,90,-90.0
273,158,-158.0
274,147,-147.0
275,158,-158.0
276,92,-92.0
277,172,-172.0
278,87,-87.0
279,88,-88.0
280,165,-165.0
281,164,-164.0
282,103,-103.0
283,170,-170.0
284,123,-123.0
285,135,-135.0
286,111,-111.0
287,149,-149.0
288,154,-154.0
289,153,-153.0
290,152,-152.0
291,144,-144.0
292,142,-142.0
293,152,-152.0
294,144,-144.0
295,178,-178.0
296,141,-141.0
297,144,-144.0
298,165,-165.0
299,178,-178.0
300,146,-146.0
301,146,-146.0
302,84,-84.0
303,171,-171.0
304,148,-148.0
305,140,-140.0
306,87,-87.0
307,141,-141.0
308,86,-86.0
309,157,-157.0
310,116,-116.0
311,154,-154.0
312,137,-137.0
313,164,-164.0
314,149,-149.0
315,139,-139.0
316,93,-93.0
317,101,-101.0
318,148,-148.0
319,141,-141.0
320,149,-149.0
321,169,-169.0
322,140,-140.0
323,153,-153.0
324,146,-146.0
325,155,-155.0
326,144,-144.0
327,146,-146.0
328,109,-109.0
329,95,-95.0
330,152,-152.0
331,160,-160.0
332,145,-145.0
333,117,-117.0
334,150,-150.0
335,170,-170.0
336,142,-142.0
337,115,-115.0
338,148,-148.0
339,149,-149.0
340,138,-138.0
341,161,-161.0
342,168,-168.0
343,88,-88.0
344,119,-119.0
345,138,-138.0
346,146,-146.0
347,148,-148.0
348,156,-156.0
349,144,-144.0
350,132,-132.0
351,148,-148.0
352,89,-89.0
353,122,-122.0
354,105,-105.0
355,144,-144.0
356,140,-140.0
357,136,-136.0
358,90,-90.0
359,141,-141.0
360,96,-96.0
361,144,-144.0
362,146,-146.0
363,148,-148.0
364,162,-162.0
365,99,-99.0
366,133,-133.0
367,142,-142.0
368,84,-84.0
369,92,-92.0
370,138,-138.0
371,156,-156.0
372,141,-141.0
373,90,-90.0
374,145,-145.0
375,150,-150.0
376,151,-151.0
377,87,-87.0
378,149,-149.0
379,151,-151.0
380,86,-86.0
381,142,-142.0
382,153,-153.0
383,99,-99.0
384,95,-95.0
385,143,-143.0
386,145,-145.0
387,141,-141.0
388,149,-149.0
389,141,-141.0
390,93,-93.0
391,101,-101.0
392,87,-87.0
393,146,-146.0
394,87,-87.0
395,159,-159.0
396,153,-153.0
397,85,-85.0
398,134,-134.0
399,103,-103.0
400,140,-140.0
