{
    "model_info": "common24",
    "episodes": [
        10,
        18,
        13,
        61,
        16,
        13,
        44,
        12,
        16,
        12,
        31,
        13,
        31,
        18,
        11,
        11,
        13,
        12,
        19,
        17,
        12,
        12,
        11,
        34,
        31,
        19,
        21,
        14,
        12,
        30,
        67,
        33,
        60,
        12,
        9,
        11,
        9,
        10,
        12,
        12,
        12,
        11,
        16,
        11,
        14,
        11,
        16,
        16,
        12,
        11,
        13,
        14,
        16,
        11,
        9,
        12,
        11,
        16,
        14,
        19,
        14,
        16,
        21,
        24,
        19,
        28,
        14,
        14,
        34,
        19,
        39,
        16,
        43,
        27,
        21,
        55,
        76,
        77,
        37,
        40,
        21,
        16,
        60,
        46,
        22,
        51,
        107,
        121,
        125,
        82,
        124,
        44,
        51,
        43,
        21,
        72,
        32,
        16,
        41,
        57,
        28,
        13,
        54,
        63,
        50,
        56,
        40,
        112,
        85,
        122,
        36,
        50,
        78,
        20,
        35,
        25,
        17,
        13,
        11,
        11,
        26,
        17,
        9,
        15,
        36,
        23,
        15,
        14,
        19,
        14,
        14,
        12,
        18,
        18,
        15,
        12,
        11,
        17,
        21,
        21,
        15,
        15,
        15,
        18,
        15,
        17,
        28,
        18,
        13,
        16,
        18,
        19,
        13,
        14,
        16,
        16,
        12,
        16,
        18,
        17,
        25,
        16,
        20,
        11,
        17,
        17,
        13,
        18,
        13,
        17,
        15,
        13,
        10,
        12,
        15,
        8,
        16,
        12,
        11,
        14,
        17,
        15,
        13,
        11,
        17,
        19,
        14,
        14,
        10,
        19,
        18,
        24,
        18,
        21,
        22,
        23,
        20,
        22,
        11,
        15,
        16,
        21,
        20,
        19,
        26,
        26,
        22,
        21,
        31,
        31,
        34,
        47,
        57,
        71,
        47,
        65,
        141,
        234,
        88,
        111,
        134,
        127,
        173,
        167,
        151,
        213,
        154,
        134,
        234,
        312,
        265,
        292,
        500,
        135,
        295,
        195,
        243,
        144,
        309,
        233,
        342,
        238,
        220,
        230,
        314,
        247,
        389,
        265,
        299,
        426,
        500,
        454,
        500,
        500,
        500,
        500,
        223,
        500,
        500,
        500,
        500,
        500,
        500,
        500,
        500,
        437,
        488,
        46,
        346,
        392,
        392,
        358,
        299,
        309,
        294,
        83,
        72,
        293,
        72,
        287,
        314,
        391,
        111,
        65,
        409,
        51,
        64,
        73,
        347,
        400,
        379,
        371,
        367,
        376,
        121,
        252,
        259,
        311,
        229,
        228,
        224,
        32,
        188,
        169,
        211,
        193,
        218,
        192,
        196,
        210,
        224,
        209,
        213,
        184,
        182,
        37,
        173,
        199,
        176,
        204,
        176,
        185,
        183,
        183,
        205,
        191,
        188,
        220,
        215,
        205,
        189,
        186,
        193,
        157,
        186,
        186,
        167,
        209,
        159,
        164,
        172,
        162,
        197,
        208,
        192,
        185,
        218,
        197,
        194,
        234,
        237,
        252,
        306,
        256,
        326,
        131,
        335,
        280,
        345,
        418,
        500,
        500,
        500,
        500,
        487,
        359,
        500,
        500,
        500,
        500,
        500,
        500,
        500,
        500,
        500,
        500,
        500,
        500,
        500,
        500,
        500,
        500,
        500,
        500,
        500,
        500,
        349,
        500,
        500,
        353,
        500,
        500,
        500,
        500,
        500,
        500,
        500,
        500,
        500,
        500,
        500,
        500,
        500,
        274,
        181,
        138,
        119,
        26,
        21,
        115,
        117,
        120,
        118,
        25,
        37,
        26,
        120,
        25,
        22,
        111,
        24,
        22,
        19,
        124,
        127,
        141,
        155,
        150,
        153,
        158,
        169,
        18,
        195,
        204,
        201,
        217,
        247,
        259,
        360,
        319,
        66,
        431,
        500,
        67,
        60,
        500,
        500,
        500,
        165,
        500,
        67,
        500,
        500,
        74,
        69,
        68,
        440,
        65,
        345,
        83,
        342,
        184,
        64,
        80,
        199,
        306,
        413,
        202,
        407,
        79,
        500,
        213,
        338,
        76,
        500,
        500,
        500,
        500,
        500,
        500,
        500,
        458,
        352,
        287,
        204,
        199,
        180,
        177,
        177,
        176,
        158,
        155,
        158,
        155,
        179,
        174,
        178,
        196,
        200,
        194,
        220,
        203,
        241,
        254,
        250,
        258,
        290,
        300,
        303,
        333,
        377,
        408,
        387,
        476,
        500,
        500,
        500,
        500,
        500,
        500,
        500,
        500,
        500,
        500,
        500,
        500,
        500,
        500,
        500,
        500,
        500,
        500,
        500,
        500,
        500,
        500,
        500,
        500,
        500,
        500,
        500,
        500,
        500,
        500,
        500,
        500,
        500,
        500,
        500,
        500,
        500,
        500,
        500,
        18,
        500,
        500,
        17,
        15,
        500,
        14,
        18,
        20,
        500,
        500,
        16,
        20,
        20,
        15,
        16,
        16,
        17,
        16,
        212,
        15,
        14,
        188,
        19,
        15,
        211,
        198,
        10,
        193,
        18,
        220,
        226,
        230,
        19,
        21,
        18,
        215,
        13,
        218,
        18,
        217,
        231,
        224,
        241,
        230,
        246,
        18,
        14,
        273,
        20,
        325,
        316,
        338,
        365,
        395,
        369,
        388,
        423,
        403,
        427,
        485,
        393,
        387,
        391,
        403,
        385,
        398,
        423,
        376,
        61,
        411,
        423,
        19,
        500,
        438,
        405,
        434,
        423,
        499,
        498,
        500,
        500,
        500,
        500,
        55,
        500,
        500,
        500,
        500,
        500,
        16,
        500,
        16,
        500,
        500,
        500,
        500,
        500,
        60,
        500,
        500,
        55,
        500,
        20,
        500,
        500,
        500,
        498,
        390,
        367,
        344,
        338,
        17,
        304,
        306,
        19,
        291,
        284,
        292,
        321,
        306,
        281,
        274,
        246,
        271,
        288,
        265,
        280,
        244,
        270,
        23,
        261,
        268,
        259,
        248,
        259,
        269,
        257,
        261,
        276,
        265,
        269,
        19,
        281,
        280,
        289,
        273,
        268,
        267,
        258,
        265,
        270,
        266,
        310,
        14,
        295,
        289,
        20,
        349,
        429,
        386,
        381,
        19,
        436,
        446,
        500,
        57,
        500,
        500,
        500,
        500,
        500,
        500,
        500,
        500,
        23,
        500,
        500,
        500,
        500,
        500,
        61,
        500,
        500,
        500,
        500,
        500,
        500,
        500,
        500,
        500,
        500,
        500,
        500,
        500,
        500,
        500,
        500,
        500,
        500,
        500,
        500,
        500,
        500,
        500,
        500,
        500,
        500,
        500,
        500,
        500,
        500,
        500,
        500,
        500,
        500,
        68,
        500,
        500,
        500,
        500,
        500,
        500,
        500,
        500,
        500,
        500,
        500,
        500,
        500,
        500,
        406,
        445,
        500,
        500,
        447,
        500,
        500,
        500,
        500,
        500,
        500,
        500,
        500,
        500,
        500,
        500,
        500,
        500,
        500,
        500,
        500,
        500,
        500,
        500,
        500,
        500,
        500,
        500,
        500,
        500,
        500,
        500
    ],
    "durations": [
        1.350227,
        0.0,
        0.015627,
        0.017713,
        0.003045,
        0.0,
        0.015629,
        0.0,
        0.0,
        0.0,
        0.015623,
        0.0,
        0.015627,
        0.0,
        0.0,
        0.015624,
        0.003002,
        0.001216,
        0.0,
        0.0,
        0.0,
        0.015627,
        0.0,
        0.0,
        0.01677,
        0.0,
        0.016755,
        0.003999,
        0.002999,
        0.009003,
        0.017002,
        0.0,
        0.021303,
        0.0,
        0.0,
        0.0,
        0.015626,
        0.0,
        0.0,
        0.0,
        0.0,
        0.001018,
        0.0,
        0.0,
        0.0,
        0.015627,
        0.0,
        0.0,
        0.0,
        0.015622,
        0.0,
        0.0,
        0.0,
        0.015626,
        0.0,
        0.0,
        0.0,
        0.0,
        0.015626,
        0.0,
        0.0,
        0.016078,
        0.005278,
        0.0,
        0.0,
        0.01677,
        0.0,
        0.0,
        0.015626,
        0.0,
        0.015625,
        0.0,
        0.015625,
        0.0,
        0.015625,
        0.015626,
        0.020461,
        0.016834,
        0.015628,
        0.0,
        0.015628,
        0.0,
        0.015621,
        0.015625,
        0.0,
        0.015628,
        0.032927,
        0.031254,
        0.031248,
        0.015628,
        0.036897,
        0.015626,
        0.015623,
        0.0,
        0.01672,
        0.015627,
        0.0,
        0.015633,
        0.0,
        0.020931,
        0.015625,
        0.0,
        0.015628,
        0.015622,
        0.015625,
        0.015624,
        0.0,
        0.036567,
        0.015624,
        0.03125,
        0.01564,
        0.01561,
        0.015624,
        0.017726,
        0.003218,
        0.0,
        0.015626,
        0.0,
        0.0,
        0.0,
        0.015627,
        0.0,
        0.0,
        0.015626,
        0.0,
        0.015622,
        0.0,
        0.0,
        0.0,
        0.015627,
        0.0,
        0.0,
        0.015627,
        0.0,
        0.0,
        0.0,
        0.015775,
        0.004998,
        0.0,
        0.0,
        0.015627,
        0.0,
        0.0,
        0.0,
        0.015625,
        0.0,
        0.0,
        0.0,
        0.0,
        0.0,
        0.015628,
        0.0,
        0.0,
        0.0,
        0.015623,
        0.0,
        0.0,
        0.015627,
        0.0,
        0.0,
        0.016716,
        0.004197,
        0.0,
        0.0,
        0.015248,
        0.004999,
        0.003997,
        0.005002,
        0.0,
        0.0,
        0.0,
        0.015626,
        0.0,
        0.0,
        0.0,
        0.0,
        0.015629,
        0.0,
        0.0,
        0.0,
        0.015624,
        0.0,
        0.0,
        0.0,
        0.015624,
        0.0,
        0.0,
        0.017735,
        0.003332,
        0.0,
        0.0,
        0.015626,
        0.0,
        0.0,
        0.015624,
        0.0,
        0.015624,
        0.0,
        0.0,
        0.0,
        0.015627,
        0.003311,
        0.0,
        0.015637,
        0.0,
        0.0,
        0.015615,
        0.0,
        0.015627,
        0.0,
        0.015622,
        0.016735,
        0.015631,
        0.019893,
        0.001218,
        0.015626,
        0.047995,
        0.052457,
        0.031251,
        0.016738,
        0.046878,
        0.021058,
        0.047973,
        0.046876,
        0.037839,
        0.062503,
        0.037507,
        0.031253,
        0.062503,
        0.084507,
        0.069136,
        0.079239,
        0.136958,
        0.031254,
        0.082515,
        0.050226,
        0.062727,
        0.037661,
        0.08138,
        0.049291,
        0.08391,
        0.062498,
        0.05313,
        0.062501,
        0.08343,
        0.063941,
        0.101936,
        0.064784,
        0.069295,
        0.115961,
        0.13072,
        0.137697,
        0.124864,
        0.131659,
        0.131733,
        0.121102,
        0.062501,
        0.130415,
        0.130335,
        0.136978,
        0.130655,
        0.146319,
        0.136896,
        0.131697,
        0.134859,
        0.116249,
        0.115993,
        0.015626,
        0.104622,
        0.1003,
        0.094856,
        0.099312,
        0.084805,
        0.066901,
        0.079254,
        0.034438,
        0.016887,
        0.06362,
        0.032553,
        0.067855,
        0.084779,
        0.099432,
        0.031251,
        0.015626,
        0.100448,
        0.015623,
        0.015627,
        0.032514,
        0.082152,
        0.099103,
        0.109244,
        0.100077,
        0.083715,
        0.100324,
        0.031254,
        0.063638,
        0.067949,
        0.0838,
        0.063613,
        0.052494,
        0.072877,
        0.0,
        0.051426,
        0.047964,
        0.05236,
        0.048031,
        0.06711,
        0.047969,
        0.03674,
        0.047955,
        0.052362,
        0.063742,
        0.053471,
        0.049169,
        0.052556,
        0.015629,
        0.031249,
        0.036719,
        0.048128,
        0.052297,
        0.048081,
        0.046875,
        0.053214,
        0.046873,
        0.052178,
        0.046879,
        0.058972,
        0.06322,
        0.05226,
        0.04688,
        0.053205,
        0.046875,
        0.046876,
        0.036595,
        0.046878,
        0.052191,
        0.046876,
        0.046874,
        0.053249,
        0.031263,
        0.052385,
        0.031254,
        0.063599,
        0.051466,
        0.046879,
        0.05244,
        0.04688,
        0.053584,
        0.062502,
        0.053811,
        0.063599,
        0.067984,
        0.079255,
        0.068254,
        0.083611,
        0.032421,
        0.084783,
        0.078128,
        0.100136,
        0.099241,
        0.147939,
        0.133927,
        0.139433,
        0.131887,
        0.137268,
        0.098223,
        0.132776,
        0.146343,
        0.134485,
        0.128863,
        0.131676,
        0.13125,
        0.14605,
        0.119984,
        0.146025,
        0.125942,
        0.130289,
        0.145922,
        0.134359,
        0.130573,
        0.132586,
        0.131622,
        0.131731,
        0.146512,
        0.121862,
        0.131599,
        0.099443,
        0.130576,
        0.132956,
        0.100035,
        0.130284,
        0.141652,
        0.122404,
        0.132707,
        0.137116,
        0.131616,
        0.131795,
        0.131971,
        0.131288,
        0.130286,
        0.15001,
        0.148592,
        0.13307,
        0.062503,
        0.058447,
        0.020048,
        0.03125,
        0.015626,
        0.0,
        0.036847,
        0.031253,
        0.031252,
        0.03578,
        0.0,
        0.01687,
        0.0,
        0.03125,
        0.0,
        0.015629,
        0.031249,
        0.0,
        0.0,
        0.018962,
        0.018019,
        0.031251,
        0.031248,
        0.037946,
        0.046878,
        0.031249,
        0.037978,
        0.046878,
        0.0,
        0.051284,
        0.063625,
        0.053099,
        0.046878,
        0.067779,
        0.062501,
        0.099063,
        0.084523,
        0.015621,
        0.116034,
        0.131755,
        0.016764,
        0.015626,
        0.131568,
        0.135026,
        0.131629,
        0.048031,
        0.141754,
        0.017,
        0.122186,
        0.132849,
        0.031254,
        0.015622,
        0.015626,
        0.115071,
        0.015625,
        0.083825,
        0.031249,
        0.102276,
        0.036829,
        0.015626,
        0.031249,
        0.050991,
        0.078349,
        0.099096,
        0.052174,
        0.114718,
        0.015626,
        0.130357,
        0.062502,
        0.083443,
        0.015625,
        0.149133,
        0.132748,
        0.131444,
        0.138591,
        0.122259,
        0.132855,
        0.135017,
        0.130611,
        0.079288,
        0.082656,
        0.052451,
        0.046879,
        0.048025,
        0.052416,
        0.032332,
        0.051352,
        0.046876,
        0.032338,
        0.035793,
        0.046879,
        0.048038,
        0.035702,
        0.047991,
        0.051311,
        0.062593,
        0.050144,
        0.049166,
        0.04799,
        0.067037,
        0.069153,
        0.063619,
        0.068009,
        0.082978,
        0.096255,
        0.069672,
        0.084766,
        0.098266,
        0.115071,
        0.099311,
        0.130653,
        0.133009,
        0.131749,
        0.131343,
        0.132577,
        0.137191,
        0.131597,
        0.130576,
        0.133004,
        0.147322,
        0.131292,
        0.137819,
        0.1307,
        0.131737,
        0.131386,
        0.132889,
        0.131701,
        0.131632,
        0.137213,
        0.131821,
        0.13172,
        0.131574,
        0.136059,
        0.13241,
        0.130378,
        0.130338,
        0.146005,
        0.130338,
        0.135544,
        0.131296,
        0.130303,
        0.145966,
        0.130326,
        0.132424,
        0.137333,
        0.131649,
        0.132838,
        0.130744,
        0.131644,
        0.137139,
        0.0,
        0.133921,
        0.119521,
        0.015624,
        0.0,
        0.130725,
        0.016728,
        0.0,
        0.0,
        0.131599,
        0.135072,
        0.015628,
        0.0,
        0.0,
        0.015623,
        0.0,
        0.0,
        0.015627,
        0.0,
        0.060021,
        0.005001,
        0.0,
        0.054168,
        0.0,
        0.0,
        0.052375,
        0.047996,
        0.0,
        0.052338,
        0.0,
        0.063604,
        0.051362,
        0.063642,
        0.0,
        0.015623,
        0.0,
        0.05346,
        0.0,
        0.062504,
        0.0,
        0.06927,
        0.046877,
        0.069123,
        0.052363,
        0.063596,
        0.068845,
        0.0,
        0.0,
        0.068138,
        0.0,
        0.100504,
        0.0836,
        0.094905,
        0.084732,
        0.115918,
        0.084603,
        0.114759,
        0.099241,
        0.114688,
        0.115791,
        0.130726,
        0.100576,
        0.099381,
        0.099304,
        0.114943,
        0.094871,
        0.117544,
        0.108727,
        0.100628,
        0.019701,
        0.111494,
        0.09969,
        0.015626,
        0.137089,
        0.115963,
        0.094839,
        0.114965,
        0.115817,
        0.135753,
        0.146481,
        0.14711,
        0.147461,
        0.136063,
        0.147235,
        0.015624,
        0.147491,
        0.151862,
        0.148307,
        0.147374,
        0.150727,
        0.0,
        0.13285,
        0.01563,
        0.131355,
        0.130608,
        0.1515,
        0.147258,
        0.147291,
        0.016783,
        0.151762,
        0.14723,
        0.016713,
        0.147419,
        0.0,
        0.150885,
        0.148366,
        0.146477,
        0.146406,
        0.099363,
        0.100044,
        0.083506,
        0.099071,
        0.0,
        0.078127,
        0.083525,
        0.0,
        0.083488,
        0.07818,
        0.061907,
        0.084443,
        0.084851,
        0.079252,
        0.067161,
        0.066891,
        0.062503,
        0.069188,
        0.07927,
        0.066994,
        0.069097,
        0.063603,
        0.015629,
        0.066981,
        0.063579,
        0.069187,
        0.068159,
        0.063635,
        0.066975,
        0.063618,
        0.068304,
        0.080312,
        0.065841,
        0.068863,
        0.0,
        0.078124,
        0.06786,
        0.067831,
        0.078127,
        0.067865,
        0.066353,
        0.067067,
        0.084722,
        0.063582,
        0.066979,
        0.084753,
        0.0,
        0.079274,
        0.067,
        0.015627,
        0.08482,
        0.115923,
        0.099513,
        0.11172,
        0.003258,
        0.1149,
        0.11632,
        0.132757,
        0.015624,
        0.13066,
        0.130622,
        0.131308,
        0.135598,
        0.142119,
        0.130431,
        0.130409,
        0.146009,
        0.0,
        0.135687,
        0.137183,
        0.130948,
        0.146415,
        0.150799,
        0.002244,
        0.146229,
        0.130763,
        0.132723,
        0.130676,
        0.131705,
        0.137196,
        0.137523,
        0.131365,
        0.130384,
        0.145935,
        0.132396,
        0.132573,
        0.131336,
        0.130385,
        0.130404,
        0.1303,
        0.131337,
        0.137036,
        0.130597,
        0.147408,
        0.133696,
        0.130263,
        0.136155,
        0.131579,
        0.132876,
        0.130845,
        0.130608,
        0.131579,
        0.136562,
        0.130716,
        0.131348,
        0.145982,
        0.130338,
        0.130285,
        0.020936,
        0.130291,
        0.131441,
        0.146826,
        0.132506,
        0.135069,
        0.130643,
        0.130638,
        0.130803,
        0.131737,
        0.148408,
        0.136286,
        0.130672,
        0.130663,
        0.13287,
        0.114969,
        0.115098,
        0.13158,
        0.131672,
        0.134361,
        0.131554,
        0.131303,
        0.130432,
        0.130401,
        0.130337,
        0.148973,
        0.118948,
        0.131624,
        0.130752,
        0.13067,
        0.131858,
        0.131733,
        0.132697,
        0.136151,
        0.131596,
        0.130658,
        0.132826,
        0.130872,
        0.146283,
        0.132841,
        0.118775,
        0.146985,
        0.130718,
        0.131625,
        0.132747,
        0.144354,
        0.124168
    ]
}