episodes,steps,rewards
0,84,-494.7617806299885
1,63,-62.383167415691595
2,119,-158.9260358147743
3,84,-435.54133759153706
4,64,-204.54588884494606
5,60,-84.14563900884083
6,109,-397.79493773783565
7,80,-9.399771414453753
8,121,-283.8146371377287
9,98,-219.27252793692907
10,67,-137.16591390975236
11,69,-42.30618793597976
12,127,-79.49324991502975
13,80,-163.77738269039355
14,150,-269.1947510600339
15,295,-343.96099217820006
16,82,-135.63206424911593
17,53,-313.62423178960535
18,89,-100.8263696167061
19,85,-52.418531435890785
20,1000,-46.0768492832181
21,1000,-67.111484096584
22,287,-480.8097663199247
23,236,-233.2169323291527
24,1000,-46.89460117982277
25,1000,-86.68336755216892
26,1000,-84.59484916085948
27,1000,-119.17873474412751
28,170,-74.76826930024714
29,117,-75.1237025935823
30,1000,-93.95941015818752
31,1000,-35.5169970320063
32,1000,-81.83928182537768
33,252,-276.613155286227
34,1000,-85.9504819080133
35,1000,-86.87409370440214
36,1000,-20.315896861516176
37,1000,-60.237768942833256
38,1000,-69.45897312660686
39,1000,-82.60069153915617
40,1000,-129.96754770576095
41,1000,-99.8740343420675
42,827,-269.23190825883023
43,140,-466.17432691156415
44,112,-301.0109031207216
45,695,-614.5523818818947
46,395,-123.57105559284614
47,1000,-160.94137785826575
48,1000,-161.53753441226695
49,1000,-138.24739561530956
50,1000,-125.56871125235594
51,1000,-151.6824302808189
52,116,-557.9961949101369
53,318,-426.0165490566667
54,1000,-182.18927901219877
55,1000,-181.69599089702817
56,1000,-198.1423539020152
57,1000,-205.06907788950932
58,1000,-177.19887266249557
59,1000,-145.6323371366452
60,163,-118.24596070349338
61,202,-106.80583807893119
62,1000,-162.83743356267968
63,541,-289.45883670078354
64,293,-208.29796085462937
65,114,-425.25607735465667
66,112,-241.20632843803483
67,1000,-199.85800007843585
68,122,-174.78548308407773
69,1000,-127.4498000989912
70,1000,-178.0828923995766
71,1000,-204.45208566069098
72,1000,-187.76998524682006
73,859,-801.3038055915792
74,117,-391.38617788231505
75,273,-374.83276581105895
76,723,-314.94223310155934
77,1000,-176.89789972223284
78,1000,-216.45056535714284
79,1000,-197.28435757866885
80,1000,-204.66656289876434
81,636,-295.58399697415183
82,1000,-286.88767693250475
83,1000,-278.0258512815938
84,1000,-281.3602847774016
85,1000,-259.23577071699225
86,1000,-242.1364941414411
87,194,-140.2894066935115
88,1000,-197.51774870432425
89,1000,-219.69672751968238
90,1000,-213.23657371503802
91,1000,-198.5347918148081
92,261,-253.11042710543902
93,1000,-206.90583331177305
94,1000,-195.69925606039303
95,1000,-192.0645321100678
96,1000,-160.96043492170986
97,1000,-128.93464405472267
98,1000,-184.43450238997252
99,1000,-148.40840589845698
100,1000,-162.98256835964418
101,1000,-131.17850602167042
102,1000,-126.2080551908658
103,1000,-183.59725799675002
104,1000,-189.96890649319465
105,1000,-161.26240762445502
106,808,-374.6008214147447
107,532,-354.4224918088435
108,1000,-83.14600367015974
109,1000,-104.17954339933084
110,1000,-159.31093007433512
111,1000,-141.85914304040335
112,1000,-92.27277465834773
113,1000,-126.22991266046425
114,1000,-97.27064491519153
115,1000,-119.67462565633038
116,1000,-107.93684792235094
117,1000,-115.92387431640168
118,1000,-155.65372903037357
119,1000,-183.5835250993152
120,130,-125.72998382760588
121,1000,-190.53349591379597
122,1000,-169.9032105423389
123,1000,-156.49679451867664
124,1000,-181.21211551308906
125,1000,-167.55267445651572
126,1000,-155.05330309440757
127,1000,-180.60732300618915
128,1000,-153.19127818120575
129,108,-212.62161573703432
130,1000,-149.16704620656256
131,1000,-162.37409053593254
132,1000,-149.73019033203119
133,146,-137.6199158641536
134,719,-294.1902302765366
135,1000,-193.34540231339514
136,1000,-201.14299776178302
137,1000,-195.0076780479389
138,131,-195.78773260206998
139,1000,-207.53876528518316
140,121,-177.621339059704
141,119,-236.1731635115385
142,1000,-170.7945741898003
143,1000,-160.27036322209193
144,133,-178.57893059809527
145,1000,-181.86399876369148
146,1000,-173.75298668476788
147,1000,-175.63106359290472
148,1000,-186.16178182876303
149,151,-150.9337575861673
150,1000,-141.35854503202845
151,1000,-174.61817048579636
152,1000,-153.3156093312165
153,126,-158.34184421846226
154,1000,-107.29640319789198
155,425,-171.94390478402426
156,1000,-134.6861378505821
157,1000,-157.24062913342564
158,1000,-161.42174676296926
159,482,-208.35098182592714
160,1000,-168.64770593280383
161,1000,-170.2207243370491
162,1000,-175.98891332662373
163,1000,-158.29009469957143
164,1000,-147.8011154940295
165,1000,-184.9660151846533
166,182,-168.88174434558525
167,1000,-157.37339799436091
168,1000,-170.06579594847642
169,141,-155.47940075602367
170,1000,-126.39506756080965
171,1000,-157.70871497596954
172,1000,-139.35275798971938
173,152,-107.08467067103614
174,1000,-106.72008893277088
175,1000,-140.9831283528914
176,1000,-160.41279128834108
177,1000,-150.11500825427606
178,185,-124.60445609133355
179,1000,-137.8261543746074
180,1000,-168.7176854437181
181,1000,-161.11167460170765
182,1000,-135.8492443601885
183,896,-367.99608237247594
184,1000,-172.79535614778263
185,1000,-171.86312926976092
186,1000,-123.50870877712299
187,1000,-108.33734879717608
188,330,-124.07828537982567
189,1000,-87.06364225618442
190,1000,-114.47596968192879
191,1000,-139.16974920325129
192,917,-214.8720074310181
193,1000,-162.0892067422962
194,844,-229.1653701221104
195,1000,-117.2226171684075
196,1000,-73.0575730998139
197,1000,-79.8455785478218
198,1000,-125.88247415984782
199,1000,-143.4702568556409
200,1000,-35.609899031333484
201,1000,-78.14757707081486
202,1000,-45.530170647054426
203,1000,-63.675614902994184
204,426,-121.62362127821136
205,376,-124.76457519579891
206,1000,-71.63853882879359
207,1000,-92.74173163773267
208,1000,-65.06876683454163
209,1000,-61.52315094975897
210,1000,-57.5216717510915
211,1000,-37.52794984359464
212,136,-146.9939566520605
213,1000,-73.60940847779962
214,1000,-90.02949378568178
215,236,-112.38395825050289
216,356,-184.49181271612792
217,1000,-30.621465597988745
218,577,-358.4559543956889
219,296,-135.54221175112747
220,1000,-93.4073376234804
221,1000,-103.28470445815313
222,1000,-134.81080731460443
223,1000,-139.22301448263664
224,1000,-38.40375512682473
225,431,-244.54464547090544
226,262,-171.00264523708213
227,241,-154.26918083163247
228,195,-128.59841611919242
229,789,-293.4141362558148
230,1000,-89.34137719051967
231,1000,-106.07295767007524
232,1000,-112.71043912854152
233,1000,-98.33621589616104
234,1000,-150.83488713647753
235,1000,-162.65892315637288
236,1000,-129.6795906315142
237,1000,-84.88080950412434
238,1000,-113.26509368133445
239,1000,-184.27475042768185
240,1000,-180.89226312106493
241,1000,-176.2024433711985
242,1000,-187.50801467008296
243,719,-285.14103142663976
244,441,-231.58780088426465
245,1000,-134.53247019954307
246,1000,-142.85939212902665
247,94,-254.7031394240026
248,107,-211.0309717599522
249,1000,-123.85871151405063
250,177,-99.93248892197214
251,384,-145.50923422363138
252,1000,-89.11378860966687
253,119,-160.47211264666782
254,209,-115.50109960267947
255,1000,-62.24146703379786
256,1000,-102.63306269295836
257,1000,-111.56582613468494
258,1000,-94.84308716276857
259,144,-118.97977296910186
260,1000,-50.772657722083494
261,1000,-72.07556273957375
262,1000,-85.53371269218702
263,1000,-53.21510377086181
264,1000,-46.71745716777078
265,1000,-114.08886943231414
266,1000,-136.10887114776688
267,146,-161.95247597898512
268,1000,-91.04569321690214
269,1000,-125.46535963265109
270,332,-148.26073928327432
271,1000,-86.91789032081343
272,337,-154.96710272276258
273,331,-189.55867995687805
274,186,-214.09702836558012
275,245,-243.52529770871894
276,1000,-196.37835484034306
277,284,-165.177811965952
278,468,-202.64797669033248
279,208,-164.71075107726412
280,138,-155.61387848933796
281,946,-370.15382713484183
282,1000,-143.59807500723912
283,1000,-182.78907787420619
284,92,-313.9684368550223
285,1000,-206.9358286957895
286,1000,-198.9138120907562
287,1000,-208.921241196444
288,1000,-194.407462808892
289,1000,-163.4062160808696
290,1000,-114.30439331193328
291,1000,-110.95679097799749
292,1000,-108.42761820916105
293,1000,-153.10736817253152
294,1000,-99.008376216448
295,189,-129.29654626610923
296,1000,-92.79114086504318
297,1000,-115.73662771255061
298,1000,-93.31429049655893
299,1000,-141.23884568543653
300,1000,-181.8687685375664
301,1000,-164.2714153455708
302,1000,-107.79056709059235
303,1000,-159.76771461762058
304,111,-149.4526573487188
305,1000,-153.5698058972315
306,1000,-204.83381692489775
307,1000,-92.59736686999385
308,1000,-69.18760264587013
309,1000,-133.65885362169746
310,388,-163.81968782929087
311,443,-180.94816142807542
312,1000,-99.09713305856442
313,1000,-127.60135883322276
314,1000,-142.1889766723789
315,1000,-159.3777110485588
316,1000,-139.6887991189407
317,1000,-87.50605592217568
318,1000,-144.81505155901658
319,951,-243.22620238268243
320,1000,-159.19402756436236
321,1000,-153.88675094473996
322,158,-89.73165062698453
323,1000,-131.24479534506807
324,1000,-93.62288154239664
325,1000,-101.34692251353555
326,333,-183.17034121459994
327,505,-207.20615486896818
328,1000,-97.56010553384148
329,774,-85.0889864987779
330,548,-283.01690403250024
331,271,-389.16620094894523
332,1000,-172.49187442291802
333,1000,-201.98181007550122
334,1000,-217.4618076432289
335,426,-214.29722892912332
336,455,-142.72806890614774
337,1000,-132.78967054594233
338,1000,-174.08391923192025
339,1000,-177.879016193078
340,370,-229.0287534038086
341,1000,-121.19958453832353
342,1000,-10.207719813206925
343,1000,-117.93395917471119
344,114,-323.7996184608727
345,1000,-140.1215873178381
346,204,-172.80389248326247
347,445,-139.0954328560135
348,1000,-230.39331230585674
349,305,-2.994043470406268
350,241,-214.0319003788813
351,874,-255.19261463774728
352,683,-215.8341468167256
353,712,-239.2412946567591
354,196,-97.65560900353486
355,1000,-77.33711073762942
356,1000,-102.72289236118334
357,1000,-120.0431907657961
358,1000,-117.46391759127351
359,1000,-127.81660204021438
360,1000,-36.989660506391495
361,1000,-129.57482466066267
362,1000,-68.42561152725933
363,1000,-47.13640253647823
364,363,-292.70877895799316
365,210,-253.9592700832775
366,235,-239.9208525694097
367,1000,-164.1697214392607
368,1000,-145.10754788002873
369,132,-140.08262951567946
370,1000,-137.72513169161113
371,1000,-106.64844426797491
372,1000,-155.56613893020415
373,171,-197.09123952636526
374,1000,-153.76670430078858
375,293,-808.1021471984624
376,1000,-129.15338941753538
377,225,-591.3135661554156
378,258,-394.58715397865893
379,91,-436.6752321318098
380,352,-279.694272577976
381,224,-344.5542252855081
382,122,-336.6346388333478
383,262,-530.1060317968029
384,257,-546.8080625078059
385,265,-480.3408331219234
386,1000,-339.2707527032351
387,349,-400.4718347505557
388,1000,-128.71846053504566
389,253,-317.522538038488
390,217,-258.3066522454698
391,110,-206.2485615406304
392,172,-181.16992992394097
393,583,-197.68059635272596
394,440,-28.03857654816987
395,133,-357.67182983177264
396,441,-49.92802931261696
397,89,-329.6566244033856
398,105,-369.9939141606685
399,144,-254.9370428821815
400,328,-193.281539344846
401,165,-157.80486697644017
402,98,-287.74190832789986
403,104,-250.6971311525812
404,175,-153.98013940983296
405,201,-165.50088047756427
406,263,-299.84356744881575
407,267,-288.2964876787536
408,378,-31.672410511557004
409,256,-151.50911401463406
410,264,-109.2420238262572
411,294,-128.75010687493895
412,344,-128.4382690780364
413,176,-204.09081835581702
414,994,-214.95400041272353
415,1000,-30.40852333007945
416,1000,-43.632260960763084
417,1000,-105.88595024272351
418,179,1.3116981125314169
419,1000,-73.53490699557929
420,477,206.19528629346686
421,197,48.86517118268256
422,624,193.6655928762749
423,200,-27.52737878149
424,814,-106.08831329647457
425,1000,-15.712201908262365
426,1000,-69.57874635261747
427,1000,-56.487610247912045
428,103,-20.000392224040667
429,902,143.09123332962648
430,372,-71.72046231836599
431,1000,-21.65716467888044
432,1000,-48.76646528626679
433,1000,-55.29112477403801
434,1000,-84.92902941629823
435,1000,-61.57127133899331
436,741,-214.0136113794814
437,821,-151.5883800992846
438,404,-85.60410712424827
439,74,-51.40882563522913
440,69,-79.03887336187614
441,196,-133.33904427799007
442,559,-121.91261496783412
443,103,-49.75205775929069
444,529,-204.35391659726417
445,120,-77.6260981154409
446,128,19.88626984429699
447,323,-104.1995758106153
448,1000,-113.33946249656768
449,595,-191.5025998673407
450,1000,-104.16619024402992
451,291,-135.96421731533346
452,599,-272.7513307252591
453,308,-196.00025166631303
454,379,-145.09603562824412
455,370,-358.5037846153101
456,195,-155.46485978789008
457,384,-134.99047616267038
458,898,-294.6164907851937
459,1000,-154.88850880227906
460,558,-178.19375710460525
461,571,-230.93430567139683
462,730,-280.48771112930814
463,462,-233.60367525840203
464,806,-581.1203705750047
465,87,-261.4028877760778
466,587,-337.4774969956727
467,292,-250.99918849882755
468,221,-228.52000578361444
469,216,-308.6819848974443
470,251,-224.35128349246995
471,583,-254.96672192010539
472,106,-215.2629961784442
473,371,-202.83648669701958
474,188,-175.65652758625205
475,873,-298.12337483173235
476,168,-135.09864371066809
477,792,-243.36966403762023
478,102,-174.72734971902776
479,750,-257.6021297836682
480,1000,-174.9302324023236
481,137,-193.79836620563788
482,1000,-166.49460792826605
483,355,-205.62766061496734
484,1000,-118.20523548195108
485,1000,-178.72579232239076
486,199,-129.0672551389659
487,904,-310.38092034691124
488,1000,-197.205444592642
489,123,-187.9687195629167
490,1000,-238.92864944542129
491,440,-133.48359220096583
492,1000,-190.2368649708093
493,1000,-158.19783501086562
494,596,-359.95211199051585
495,1000,-214.58865712616267
496,1000,-176.18592600795307
497,1000,-188.84368707567376
498,1000,-152.96540528126863
499,1000,-195.31808248278742
500,1000,-168.63981366855432
