{
    "model_info": "common192",
    "episodes": [
        12,
        11,
        12,
        9,
        9,
        9,
        9,
        10,
        9,
        11,
        9,
        12,
        11,
        9,
        11,
        11,
        10,
        13,
        11,
        11,
        11,
        21,
        28,
        51,
        29,
        32,
        37,
        25,
        40,
        18,
        22,
        23,
        16,
        30,
        23,
        24,
        25,
        26,
        34,
        32,
        30,
        38,
        56,
        13,
        39,
        14,
        28,
        39,
        29,
        25,
        30,
        22,
        33,
        25,
        33,
        23,
        29,
        30,
        31,
        34,
        36,
        42,
        27,
        28,
        32,
        45,
        31,
        36,
        25,
        32,
        39,
        30,
        22,
        35,
        27,
        48,
        55,
        31,
        47,
        32,
        32,
        34,
        40,
        50,
        55,
        52,
        45,
        48,
        55,
        36,
        51,
        32,
        23,
        25,
        22,
        29,
        20,
        22,
        25,
        18,
        21,
        17,
        22,
        20,
        15,
        23,
        20,
        21,
        16,
        15,
        18,
        27,
        20,
        22,
        14,
        24,
        15,
        14,
        27,
        30,
        21,
        18,
        14,
        15,
        22,
        26,
        20,
        16,
        25,
        26,
        21,
        27,
        20,
        14,
        21,
        16,
        14,
        22,
        15,
        21,
        11,
        16,
        16,
        19,
        25,
        18,
        22,
        18,
        15,
        13,
        18,
        15,
        9,
        16,
        19,
        14,
        18,
        13,
        16,
        15,
        22,
        23,
        13,
        22,
        27,
        23,
        25,
        22,
        26,
        21,
        28,
        17,
        30,
        27,
        23,
        25,
        17,
        22,
        20,
        12,
        25,
        20,
        18,
        15,
        22,
        21,
        16,
        24,
        17,
        22,
        18,
        19,
        21,
        23,
        33,
        33,
        28,
        25,
        30,
        25,
        20,
        20,
        26,
        8,
        13,
        28,
        30,
        8,
        15,
        14,
        16,
        15,
        25,
        13,
        25,
        14,
        16,
        23,
        8,
        28,
        15,
        14,
        18,
        17,
        17,
        14,
        22,
        26,
        24,
        25,
        25,
        25,
        26,
        25,
        24,
        19,
        23,
        31,
        30,
        40,
        45,
        30,
        22,
        19,
        31,
        28,
        21,
        31,
        30,
        22,
        29,
        34,
        35,
        29,
        39,
        39,
        39,
        36,
        21,
        25,
        16,
        22,
        43,
        42,
        34,
        49,
        39,
        22,
        49,
        29,
        58,
        26,
        83,
        33,
        34,
        58,
        33,
        25,
        30,
        24,
        33,
        20,
        19,
        18,
        30,
        20,
        22,
        26,
        19,
        69,
        35,
        48,
        27,
        45,
        35,
        59,
        34,
        24,
        29,
        34,
        39,
        33,
        18,
        31,
        32,
        61,
        14,
        30,
        28,
        33,
        75,
        23,
        23,
        21,
        48,
        51,
        40,
        32,
        55,
        32,
        35,
        66,
        66,
        62,
        40,
        78,
        61,
        40,
        45,
        23,
        44,
        60,
        30,
        46,
        29,
        35,
        36,
        50,
        35,
        35,
        26,
        43,
        50,
        24,
        25,
        42,
        57,
        48,
        59,
        66,
        46,
        28,
        37,
        48,
        45,
        47,
        66,
        30,
        33,
        52,
        30,
        22,
        53,
        19,
        29,
        32,
        42,
        30,
        25,
        23,
        28,
        32,
        47,
        35,
        49,
        25,
        21,
        33,
        17,
        10,
        13,
        13,
        18,
        22,
        25,
        25,
        13,
        18,
        12,
        11,
        21,
        18,
        13,
        15,
        11,
        21,
        28,
        23,
        37,
        15,
        12,
        20,
        38,
        24,
        23,
        42,
        72,
        54,
        33,
        43,
        46,
        45,
        28,
        85,
        37,
        40,
        112,
        118,
        33,
        35,
        60,
        43,
        61,
        40,
        34,
        87,
        55,
        74,
        66,
        84,
        32,
        69,
        22,
        24,
        38,
        37,
        24,
        22,
        20,
        16,
        20,
        22,
        19,
        25,
        18,
        26,
        21,
        22,
        33,
        24,
        25,
        22,
        21,
        18,
        21,
        18,
        28,
        22,
        24,
        19,
        29,
        29,
        29,
        23,
        20,
        34,
        23,
        27,
        35,
        22,
        18,
        27,
        23,
        23,
        20,
        21,
        34,
        24,
        18,
        23,
        26,
        24,
        18,
        16,
        45,
        42,
        27,
        30,
        36,
        16,
        29,
        21,
        29,
        24,
        22,
        26,
        34,
        38,
        33,
        39,
        41,
        23,
        24,
        26,
        27,
        24,
        42,
        42,
        36,
        26,
        23,
        30,
        26,
        39,
        31,
        23,
        19,
        32,
        39,
        37,
        30,
        34,
        44,
        19,
        24,
        32,
        53,
        22,
        24,
        22,
        40,
        42,
        43,
        51,
        45,
        60,
        72,
        64,
        24,
        28,
        27,
        20,
        34,
        45,
        67,
        43,
        31,
        43,
        21,
        34,
        46,
        24,
        60,
        21,
        41,
        24,
        46,
        36,
        25,
        33,
        27,
        50,
        32,
        24,
        54,
        19,
        27,
        30,
        21,
        63,
        27,
        36,
        22,
        32,
        56,
        28,
        74,
        23,
        74,
        27,
        20,
        46,
        35,
        31,
        46,
        25,
        48,
        25,
        54,
        62,
        31,
        65,
        27,
        16,
        30,
        37,
        61,
        25,
        17,
        56,
        26,
        25,
        27,
        46,
        33,
        26,
        25,
        32,
        38,
        31,
        65,
        35,
        26,
        29,
        38,
        36,
        24,
        41,
        28,
        77,
        44,
        25,
        31,
        42,
        22,
        24,
        34,
        50,
        33,
        27,
        18,
        29,
        33,
        22,
        26,
        32,
        41,
        31,
        24,
        32,
        18,
        23,
        17,
        26,
        23,
        20,
        31,
        24,
        21,
        17,
        24,
        32,
        25,
        22,
        31,
        23,
        27,
        24,
        28,
        25,
        30,
        20,
        18,
        47,
        29,
        26,
        19,
        22,
        30,
        25,
        26,
        32,
        29,
        28,
        17,
        26,
        26,
        21,
        18,
        29,
        23,
        31,
        27,
        19,
        38,
        24,
        23,
        33,
        21,
        32,
        31,
        30,
        17,
        25,
        33,
        28,
        33,
        22,
        44,
        31,
        51,
        21,
        54,
        44,
        18,
        63,
        52,
        23,
        34,
        39,
        75,
        19,
        42,
        35,
        70,
        67,
        34,
        67,
        79,
        40,
        61,
        36,
        49,
        48,
        31,
        37,
        21,
        31,
        46,
        55,
        39,
        36,
        48,
        71,
        53,
        35,
        49,
        45,
        45,
        42,
        36,
        30,
        25,
        45,
        97,
        31,
        68,
        49,
        37,
        40,
        45,
        95,
        49,
        42,
        42,
        58,
        54,
        36,
        63,
        77,
        36,
        61,
        47,
        46,
        70,
        43,
        29,
        77,
        34,
        44,
        37,
        54,
        32,
        40,
        47,
        70,
        50,
        66,
        70,
        87,
        38,
        39,
        51,
        25,
        42,
        83,
        60,
        60,
        34,
        56,
        56,
        40,
        58,
        34,
        56,
        23,
        79,
        51,
        87,
        63,
        75,
        65,
        44,
        65,
        23,
        45,
        28,
        41,
        53,
        48,
        52,
        71,
        35,
        43,
        71,
        102,
        35,
        75,
        31,
        65,
        33,
        33,
        88,
        44,
        38,
        105,
        39,
        67,
        58,
        48,
        74,
        22,
        55,
        50,
        78,
        19,
        37,
        54,
        78,
        47,
        62,
        55,
        29,
        93,
        25,
        40,
        52,
        42,
        83,
        32,
        48,
        69,
        76,
        58,
        44,
        31,
        74,
        75,
        47,
        76,
        40,
        34,
        71,
        43,
        67,
        45,
        62,
        59,
        65,
        61,
        54,
        45,
        45,
        48,
        46,
        49,
        57,
        50,
        35,
        31,
        44,
        49,
        58,
        60,
        64,
        49,
        54,
        45,
        45,
        83,
        60,
        43,
        65,
        55,
        56,
        63,
        72,
        57,
        74,
        69,
        58,
        66,
        55,
        60,
        60,
        71,
        73,
        72,
        80,
        84,
        93,
        89,
        102,
        97,
        112,
        101,
        133,
        113,
        138,
        134,
        175,
        168,
        141,
        158,
        118,
        167,
        83,
        113,
        101,
        79,
        90,
        134,
        62,
        119,
        144,
        164,
        103,
        177,
        86,
        80,
        221,
        80,
        64,
        116,
        135,
        115,
        86,
        99,
        42,
        69,
        172,
        87,
        166,
        180,
        141,
        182,
        430,
        177,
        225,
        143,
        172,
        210,
        102,
        105,
        124,
        224,
        124,
        145,
        140,
        125,
        70,
        78,
        36,
        38,
        108,
        85,
        136,
        102,
        70,
        95,
        40,
        25,
        76,
        58,
        57,
        85,
        73,
        78,
        92,
        67,
        60,
        59,
        85,
        76,
        91,
        51,
        59,
        51,
        64,
        130,
        78,
        69,
        82,
        29,
        17,
        19,
        56,
        55,
        66,
        64,
        88,
        72,
        60,
        34,
        63,
        47,
        16,
        15,
        25,
        34,
        39,
        21,
        16,
        25,
        48,
        63,
        70,
        60,
        53,
        52,
        59,
        86,
        70,
        65,
        79,
        51,
        52,
        73,
        66,
        71,
        86,
        75,
        61,
        17,
        85,
        91,
        78,
        89,
        161,
        240,
        85,
        106,
        82,
        104,
        117,
        96,
        145,
        96,
        74,
        112,
        55,
        79,
        83,
        93,
        60,
        92,
        98,
        73,
        109,
        60,
        80,
        61,
        63,
        39,
        78,
        151,
        123,
        164,
        96,
        132,
        112,
        58,
        113,
        69,
        59,
        121,
        133,
        200,
        118,
        120,
        127,
        186,
        232,
        113,
        66,
        84,
        120,
        70,
        145,
        44,
        61,
        44,
        60,
        77,
        66,
        62,
        59,
        146,
        109,
        97,
        110,
        152,
        96,
        45,
        92,
        71,
        139,
        104,
        86,
        65,
        99,
        105,
        63,
        70,
        67,
        54,
        57,
        74,
        89,
        45,
        59,
        47,
        61,
        61,
        92,
        123,
        66,
        97,
        69,
        51,
        99,
        94,
        77,
        97,
        111,
        91,
        76,
        124,
        119,
        101,
        71,
        77,
        111,
        108,
        99,
        68,
        96,
        95,
        125,
        84,
        72,
        61,
        70,
        31,
        105,
        102,
        91,
        74,
        100,
        105,
        106,
        100,
        99,
        103,
        84,
        127,
        104,
        88,
        77,
        88,
        120,
        84,
        89,
        103,
        108,
        85,
        85,
        87,
        100,
        89,
        87,
        55,
        84,
        88,
        86,
        85,
        90,
        94,
        107,
        97,
        86,
        97,
        73,
        79,
        75,
        90,
        92,
        50,
        82,
        92,
        102,
        85,
        92,
        36,
        41,
        78,
        95,
        38,
        72,
        78,
        63,
        28,
        28,
        53,
        83,
        96,
        39,
        97,
        81,
        49,
        91,
        78,
        84,
        94,
        90,
        86,
        86,
        98,
        86,
        115,
        92,
        87,
        94,
        106,
        91,
        101,
        100,
        52,
        89,
        115,
        90,
        97,
        88,
        108,
        67,
        90,
        96,
        42,
        85,
        65,
        32,
        51,
        69,
        39,
        52,
        65,
        52,
        34,
        67,
        55,
        61,
        58,
        40,
        71,
        55,
        39,
        36,
        39,
        69,
        32,
        73,
        54,
        41,
        37,
        49,
        44,
        69,
        39,
        53,
        38,
        29,
        50,
        58,
        30,
        36,
        31,
        37,
        45,
        32,
        44,
        28,
        47,
        55,
        44,
        55,
        54,
        75,
        64,
        61,
        55,
        71,
        37,
        22,
        24,
        35,
        30,
        50,
        45,
        30,
        40,
        38,
        39,
        34,
        28,
        48,
        27,
        40,
        63,
        49,
        64,
        73,
        58,
        57,
        65,
        28,
        64,
        64,
        42,
        57,
        67,
        37,
        101,
        91,
        40,
        88,
        97,
        69,
        44,
        67,
        93,
        78,
        57,
        86,
        81,
        56,
        88,
        90,
        101,
        79,
        80,
        97,
        87,
        94,
        58,
        61,
        103,
        75,
        87,
        82,
        119,
        75,
        85,
        99,
        92,
        111,
        90,
        69,
        64,
        80,
        70,
        84,
        99,
        74,
        100,
        122,
        92,
        74,
        86,
        84,
        77,
        78,
        70,
        83,
        95,
        78,
        92,
        68,
        89,
        80,
        79,
        98,
        81,
        82,
        115,
        66,
        102,
        99,
        90,
        105,
        112,
        130,
        113,
        103,
        136,
        111,
        118,
        119,
        84,
        151,
        89,
        109,
        115,
        112,
        103,
        152,
        112,
        108,
        103,
        98,
        106,
        147,
        125,
        89,
        135,
        125,
        174,
        112,
        115,
        126,
        110,
        118,
        118,
        110,
        83,
        149,
        124,
        82,
        98,
        240,
        86,
        98,
        147,
        129,
        192,
        163,
        162,
        123,
        175,
        163,
        173,
        198,
        175,
        114,
        160,
        133,
        160,
        129,
        148,
        133,
        138,
        144,
        141,
        130,
        145,
        130,
        147,
        141,
        122,
        149,
        130,
        120,
        116,
        137,
        125,
        134,
        132,
        132,
        121,
        101,
        99,
        122,
        121,
        122,
        107,
        126,
        111,
        110,
        124,
        118,
        136,
        95,
        121,
        145,
        128,
        94,
        119,
        121,
        121,
        116,
        112,
        128,
        104,
        74,
        82,
        96,
        80,
        123,
        83,
        93,
        115,
        97,
        84,
        94,
        91,
        88,
        132,
        65,
        95,
        80,
        96,
        113,
        139,
        113,
        84,
        96,
        126,
        114,
        120,
        120,
        122,
        111,
        96,
        139,
        128,
        109,
        146,
        129,
        148,
        101,
        148,
        98,
        106,
        156,
        125,
        106,
        144,
        105,
        119,
        113,
        152,
        106,
        110,
        169,
        147,
        131,
        162,
        154,
        132,
        147,
        126,
        133,
        108,
        120,
        99,
        137,
        204,
        143,
        169,
        215,
        171,
        179,
        196,
        155,
        193,
        190,
        117,
        215,
        145,
        318,
        132,
        168,
        221,
        142,
        500,
        113,
        145,
        329,
        110,
        179,
        149,
        500,
        157,
        339,
        245,
        222,
        123,
        292,
        283,
        133,
        76,
        164,
        157,
        69,
        140,
        238,
        103,
        227,
        243,
        89,
        76,
        154,
        64,
        50,
        177,
        148,
        77,
        78,
        131,
        125,
        227,
        164,
        96,
        130,
        120,
        118,
        117,
        62,
        170,
        127,
        104,
        198,
        111,
        242,
        142,
        139,
        149,
        165,
        127,
        112,
        104,
        170,
        121,
        143,
        143,
        103,
        45,
        41,
        100,
        88,
        45,
        38,
        89,
        100,
        39,
        100,
        43,
        45,
        97,
        54,
        58,
        97,
        37,
        102,
        88,
        97,
        87,
        95,
        39,
        91,
        97,
        45,
        91,
        106,
        96,
        88,
        70,
        94,
        100,
        69,
        104,
        92,
        96,
        93,
        96,
        92,
        104,
        89,
        97,
        105,
        88,
        100,
        87,
        101,
        149,
        108,
        96,
        130,
        100,
        138,
        102,
        127,
        138,
        117,
        163,
        122,
        148,
        109,
        102,
        143,
        111,
        139,
        108,
        128,
        95,
        192,
        150,
        145,
        177,
        190,
        195,
        179,
        183,
        160,
        235,
        215,
        126,
        214,
        182,
        128,
        154,
        223,
        189,
        210,
        114,
        131,
        123,
        151,
        103,
        133,
        190,
        223,
        195,
        200,
        233,
        188,
        152,
        268,
        196,
        182,
        176,
        143,
        194,
        134,
        145,
        187,
        172,
        132,
        169,
        193,
        155,
        207,
        181,
        159,
        177,
        117,
        149,
        181,
        132,
        124,
        257,
        181,
        135,
        147,
        174,
        124,
        136,
        116,
        110,
        131,
        94,
        108,
        94,
        109,
        101,
        104,
        79,
        106,
        103,
        89,
        80,
        89,
        81,
        89,
        93,
        86,
        83,
        82,
        90,
        84,
        88,
        78,
        87,
        79,
        57,
        93,
        75,
        87,
        91,
        88,
        55,
        74,
        54,
        85,
        41,
        34,
        26,
        75,
        58,
        74,
        82,
        87,
        72,
        49,
        74,
        69,
        87,
        98,
        80,
        74,
        89,
        94,
        101,
        87,
        93,
        105,
        101,
        87,
        91,
        106,
        99,
        97,
        93,
        89,
        93,
        95,
        98,
        95,
        94,
        91,
        102,
        94,
        94,
        93,
        99,
        103,
        107,
        107,
        102,
        98,
        101,
        93,
        116,
        111,
        90,
        107,
        101,
        91,
        96,
        95,
        99,
        89,
        85,
        111,
        99,
        102,
        104,
        108,
        100,
        110,
        104,
        91,
        105,
        109,
        89,
        96,
        90,
        96,
        108,
        85,
        88,
        86,
        95,
        94,
        95,
        103,
        94,
        98,
        84,
        107,
        99,
        105,
        105,
        97,
        99,
        102,
        113,
        100,
        103,
        102,
        97,
        95,
        110,
        88,
        103,
        88,
        94,
        103,
        97,
        107,
        113,
        96,
        92,
        92,
        103,
        96,
        102,
        101,
        116,
        93,
        106,
        106,
        105,
        94,
        86,
        112,
        109,
        126,
        98,
        103,
        111,
        105,
        104,
        111,
        106,
        93,
        105,
        104,
        102,
        111,
        125,
        114,
        126,
        136,
        105,
        133,
        137,
        143,
        129,
        143,
        145,
        124,
        160,
        154,
        149,
        164,
        144,
        154,
        151,
        167,
        127,
        141,
        142,
        114,
        108,
        128,
        107,
        109,
        115,
        134,
        132,
        107,
        119,
        84,
        91,
        91,
        115,
        103,
        107,
        98,
        106,
        98,
        91,
        85,
        96,
        101,
        114,
        104,
        105,
        116,
        121,
        101,
        137,
        127,
        128,
        119,
        90,
        98,
        103,
        95,
        98,
        106,
        108,
        131,
        113,
        105,
        120,
        112,
        106,
        106,
        114,
        100,
        91,
        98,
        93,
        95,
        99,
        101,
        98,
        97,
        94,
        98,
        112,
        105,
        116,
        101,
        103,
        114,
        97,
        107,
        100,
        103,
        109,
        102,
        104,
        106,
        115,
        114,
        96,
        98,
        110,
        113,
        98,
        103,
        105,
        108,
        130,
        113,
        108,
        115,
        109,
        97,
        117,
        125,
        120,
        108,
        92,
        117,
        101,
        121,
        97,
        119,
        131,
        116,
        128,
        96,
        101,
        116,
        108,
        120,
        99,
        130,
        111,
        128,
        119,
        112,
        118,
        102,
        17,
        104,
        115,
        102,
        120,
        152,
        109,
        137,
        150,
        121,
        112,
        135,
        120,
        103,
        106,
        123,
        121,
        124,
        113,
        137,
        125,
        156,
        105,
        134,
        94,
        128,
        131,
        117,
        145,
        128,
        106,
        110,
        118,
        127,
        144,
        169,
        153,
        145,
        138,
        131,
        152,
        114,
        151,
        145,
        184,
        115,
        137,
        116,
        139,
        121,
        132,
        140,
        122,
        139,
        124,
        152,
        153,
        141,
        141,
        154,
        133,
        139,
        148,
        167,
        126,
        120,
        213,
        147,
        127,
        147,
        155,
        146,
        112,
        132,
        109,
        130,
        130,
        134,
        166,
        140,
        169,
        119,
        149,
        136,
        156,
        164,
        141,
        136,
        158,
        162,
        143,
        168,
        214,
        191,
        169,
        244,
        268,
        232,
        232,
        171,
        234,
        153,
        118,
        135,
        161,
        134,
        138,
        141,
        127,
        113,
        105,
        113,
        101,
        96,
        89,
        105,
        98,
        104,
        97,
        90,
        94,
        78,
        82,
        95,
        44,
        78,
        89,
        58,
        92,
        76,
        85,
        85,
        88,
        83,
        88,
        89,
        96,
        89,
        96,
        85,
        95,
        91,
        97,
        96,
        101,
        95,
        99,
        86,
        101,
        90,
        92,
        88,
        99,
        103,
        99,
        85,
        97,
        109,
        98,
        99,
        103,
        107,
        101,
        100,
        107,
        112,
        122,
        119,
        119,
        99,
        114,
        113,
        121,
        123,
        124,
        130,
        109,
        138,
        126,
        128,
        145,
        141,
        165,
        151,
        155,
        144,
        161,
        162,
        200,
        169,
        218,
        179,
        231,
        178,
        157,
        202,
        281,
        190,
        297,
        388,
        332,
        464,
        244,
        329,
        386,
        230,
        275,
        105,
        129,
        90,
        228,
        46,
        34,
        182,
        331,
        60,
        112,
        188,
        172,
        135,
        229,
        217,
        380,
        471,
        102,
        426,
        186,
        227,
        176,
        202,
        230,
        265,
        252,
        304,
        259,
        245,
        408,
        358,
        377,
        360,
        378,
        287,
        169,
        221,
        177,
        155,
        211,
        240,
        177,
        194,
        192,
        184,
        187,
        90,
        73,
        86,
        156,
        84,
        98,
        159,
        180,
        176,
        196,
        238,
        204,
        122,
        103,
        212,
        209,
        196,
        196,
        240,
        240,
        200,
        133,
        269,
        416,
        277,
        177,
        500,
        500,
        479,
        500,
        500,
        500,
        380,
        311,
        263,
        278,
        194,
        221,
        231,
        189,
        196,
        175,
        178,
        175,
        143,
        167,
        140,
        134,
        130,
        143,
        133,
        137,
        148,
        135,
        124,
        135,
        116,
        121,
        136,
        135,
        129,
        119,
        127,
        131,
        139,
        135,
        154,
        120,
        132,
        139,
        166,
        145,
        145,
        163,
        145,
        151,
        158,
        162,
        148,
        129,
        137,
        136,
        134,
        147,
        134,
        147,
        140,
        157,
        139,
        161,
        151,
        168,
        156,
        132,
        144,
        125,
        144,
        137,
        137,
        119,
        135,
        125,
        124,
        128,
        132,
        130,
        131,
        140,
        137,
        145,
        114,
        133,
        132,
        129,
        132,
        146,
        124,
        132,
        144,
        124,
        157,
        175,
        159,
        147,
        169,
        167,
        168,
        180,
        178,
        195,
        183,
        165,
        186,
        198,
        195,
        215,
        195,
        208,
        244,
        220,
        247,
        234,
        251,
        232,
        273,
        258,
        232,
        187,
        203,
        177,
        172,
        156,
        216,
        190,
        163,
        184,
        145,
        141,
        132,
        182,
        113,
        127,
        193,
        129,
        141,
        128,
        160,
        132,
        122,
        148,
        141,
        156,
        152,
        123,
        138,
        170,
        130,
        198,
        198,
        221,
        189,
        120,
        208,
        254,
        231,
        251,
        224,
        234,
        205,
        182,
        230,
        161,
        173,
        178,
        203,
        201,
        181,
        197,
        186,
        190,
        186,
        161,
        165,
        190,
        134,
        175,
        189,
        13,
        169,
        179,
        167,
        166,
        167,
        147,
        179,
        172,
        173,
        181,
        159,
        140,
        171,
        183,
        188,
        12,
        190,
        183,
        188,
        192,
        184,
        178,
        220,
        179,
        151,
        180,
        13,
        244,
        164,
        234,
        142,
        16,
        160,
        16,
        154,
        179,
        196,
        232,
        228,
        243,
        14,
        197,
        199,
        218,
        170,
        233,
        212,
        187,
        198,
        178,
        235,
        208,
        221,
        18,
        223,
        190,
        197,
        193,
        236,
        184,
        202,
        255,
        225,
        203,
        189,
        201,
        195,
        203,
        260,
        244,
        260,
        199,
        236,
        171,
        181,
        184,
        225,
        230,
        246,
        292,
        275,
        273,
        260,
        204,
        232,
        214,
        212,
        223,
        237,
        224,
        225,
        217,
        248,
        267,
        245,
        251,
        309,
        286,
        283,
        314,
        289,
        302,
        334,
        337,
        337,
        325,
        335,
        291,
        288,
        322,
        324,
        336,
        259,
        269,
        298,
        282,
        234,
        239,
        321,
        305,
        347,
        253,
        278,
        150,
        233,
        293,
        207,
        210,
        235,
        283,
        338,
        243,
        316,
        185,
        178,
        185,
        140,
        306,
        213,
        173,
        188,
        282,
        298,
        270,
        216,
        261,
        324,
        121,
        13,
        219,
        211,
        177,
        238,
        202,
        50,
        293,
        11,
        300,
        276,
        305,
        70,
        360,
        189,
        405,
        111,
        183,
        205,
        321,
        314,
        336,
        286,
        232,
        336,
        244,
        314,
        58,
        227,
        360,
        312,
        240,
        277,
        283,
        286,
        232,
        303,
        292,
        310,
        341,
        235,
        244,
        234,
        282,
        251,
        284,
        286,
        302,
        288,
        269,
        296,
        316,
        346,
        312,
        410,
        369,
        15,
        480,
        467,
        424,
        359,
        444,
        406,
        419,
        473,
        423,
        15,
        338,
        456,
        470,
        166,
        475,
        500,
        470,
        289,
        451,
        299,
        420,
        11,
        349,
        377,
        353,
        268,
        349,
        360,
        286,
        403,
        381,
        384,
        498,
        500,
        500,
        500,
        500,
        500,
        500,
        500,
        500,
        500,
        500,
        500,
        500,
        500,
        500,
        500,
        500,
        500,
        500,
        500,
        500,
        500,
        500,
        500,
        500,
        500,
        500,
        500,
        500,
        500,
        500,
        500,
        500,
        394,
        500,
        500,
        500,
        62,
        500,
        500,
        500,
        318,
        246,
        416,
        500,
        163,
        339,
        426,
        500,
        415,
        417,
        500,
        500,
        500,
        304,
        471,
        438,
        281,
        333,
        500,
        324,
        392,
        500,
        307,
        500,
        226,
        472,
        500,
        252,
        237,
        325,
        377,
        390,
        500,
        500,
        500,
        334,
        500,
        500,
        391,
        500,
        500,
        283,
        317,
        283,
        290,
        500,
        500,
        255,
        402,
        500,
        500,
        458,
        500,
        500,
        500,
        500,
        500,
        500,
        500,
        500,
        500,
        500,
        500,
        500,
        500,
        500,
        500,
        500,
        500,
        500,
        500,
        500,
        500,
        500,
        500,
        500,
        500,
        500,
        500,
        500,
        500,
        500,
        204,
        500,
        500,
        500,
        500,
        500,
        500,
        500,
        500,
        500,
        411,
        446,
        495,
        500,
        429,
        500,
        500,
        500,
        500,
        500,
        500,
        500,
        500,
        500,
        500,
        500,
        500,
        500,
        500,
        500,
        500,
        500,
        448,
        500,
        380,
        500,
        500,
        500,
        500,
        500,
        500,
        500,
        500,
        500,
        500,
        500,
        500,
        500
    ],
    "durations": [
        1.246984,
        0.005,
        0.004001,
        0.003,
        0.002998,
        0.002988,
        0.003,
        0.004002,
        0.003,
        0.003997,
        0.002998,
        0.004985,
        0.005002,
        0.003997,
        0.004999,
        0.004001,
        0.004002,
        0.003998,
        0.003999,
        0.004001,
        0.002999,
        0.006,
        0.008999,
        0.015,
        0.009001,
        0.008999,
        0.011,
        0.007998,
        0.012001,
        0.005,
        0.007,
        0.007,
        0.005001,
        0.008999,
        0.008,
        0.007,
        0.008,
        0.007999,
        0.010001,
        0.008985,
        0.008999,
        0.011001,
        0.016998,
        0.004001,
        0.012,
        0.005005,
        0.010011,
        0.012988,
        0.009,
        0.007998,
        0.009,
        0.006001,
        0.010002,
        0.007004,
        0.011005,
        0.006983,
        0.009,
        0.008001,
        0.008983,
        0.011,
        0.011,
        0.013005,
        0.009998,
        0.009003,
        0.009,
        0.012385,
        0.009,
        0.009998,
        0.006985,
        0.009999,
        0.011001,
        0.009,
        0.007002,
        0.01,
        0.008001,
        0.014999,
        0.015999,
        0.010001,
        0.014001,
        0.011999,
        0.011003,
        0.013,
        0.016005,
        0.016994,
        0.016,
        0.015,
        0.014997,
        0.015,
        0.018003,
        0.011997,
        0.017999,
        0.009002,
        0.007002,
        0.007999,
        0.007,
        0.007999,
        0.006001,
        0.006,
        0.007999,
        0.006001,
        0.007001,
        0.005998,
        0.006002,
        0.006,
        0.004002,
        0.007998,
        0.006998,
        0.007001,
        0.006003,
        0.005,
        0.004998,
        0.008999,
        0.007,
        0.007001,
        0.004998,
        0.008001,
        0.005001,
        0.003997,
        0.008001,
        0.009001,
        0.005996,
        0.006002,
        0.003996,
        0.003998,
        0.007001,
        0.008999,
        0.007004,
        0.004997,
        0.006999,
        0.008001,
        0.005998,
        0.009,
        0.006002,
        0.005004,
        0.006995,
        0.005,
        0.004003,
        0.006004,
        0.005,
        0.009002,
        0.003998,
        0.005003,
        0.005997,
        0.006001,
        0.007999,
        0.006,
        0.006998,
        0.005002,
        0.004006,
        0.004002,
        0.004997,
        0.004,
        0.003,
        0.004002,
        0.005002,
        0.004995,
        0.005,
        0.004004,
        0.004002,
        0.004002,
        0.005999,
        0.006,
        0.003999,
        0.007001,
        0.007998,
        0.007001,
        0.007002,
        0.006,
        0.008,
        0.006999,
        0.008002,
        0.004999,
        0.008998,
        0.008002,
        0.006998,
        0.008001,
        0.005,
        0.008001,
        0.006002,
        0.003998,
        0.007,
        0.006003,
        0.007999,
        0.004997,
        0.007003,
        0.007,
        0.003996,
        0.006998,
        0.004999,
        0.007,
        0.006,
        0.006001,
        0.006005,
        0.005999,
        0.01,
        0.009002,
        0.008002,
        0.006997,
        0.008,
        0.007002,
        0.006997,
        0.005997,
        0.008001,
        0.002999,
        0.003999,
        0.009,
        0.009,
        0.003001,
        0.004,
        0.005003,
        0.004,
        0.003998,
        0.007001,
        0.003997,
        0.008001,
        0.004002,
        0.005,
        0.006998,
        0.003004,
        0.007998,
        0.004997,
        0.004001,
        0.004999,
        0.004999,
        0.005003,
        0.004999,
        0.007,
        0.007001,
        0.008,
        0.006997,
        0.007002,
        0.007999,
        0.008001,
        0.008,
        0.006998,
        0.005999,
        0.005998,
        0.009002,
        0.009,
        0.012001,
        0.012999,
        0.008001,
        0.006003,
        0.005996,
        0.012004,
        0.007995,
        0.005998,
        0.008999,
        0.009002,
        0.005996,
        0.009004,
        0.01,
        0.009997,
        0.009003,
        0.011001,
        0.012001,
        0.010996,
        0.010003,
        0.006997,
        0.007999,
        0.005003,
        0.006997,
        0.011998,
        0.011999,
        0.011,
        0.013999,
        0.011001,
        0.006995,
        0.015004,
        0.008997,
        0.016999,
        0.008004,
        0.023996,
        0.01,
        0.011022,
        0.016982,
        0.009998,
        0.007003,
        0.007998,
        0.009004,
        0.010001,
        0.006001,
        0.005998,
        0.006999,
        0.009003,
        0.005999,
        0.006999,
        0.008002,
        0.005999,
        0.019998,
        0.010003,
        0.013999,
        0.007998,
        0.012998,
        0.010002,
        0.016998,
        0.011,
        0.006999,
        0.007998,
        0.010001,
        0.010998,
        0.010003,
        0.004999,
        0.009001,
        0.008999,
        0.016998,
        0.005,
        0.010002,
        0.008001,
        0.01,
        0.020998,
        0.006998,
        0.007001,
        0.006001,
        0.013999,
        0.014997,
        0.012001,
        0.009001,
        0.015999,
        0.009001,
        0.009999,
        0.019,
        0.019999,
        0.019,
        0.012,
        0.021999,
        0.019002,
        0.012001,
        0.013001,
        0.006998,
        0.012998,
        0.018003,
        0.008999,
        0.013998,
        0.009003,
        0.010999,
        0.011,
        0.015998,
        0.010003,
        0.009998,
        0.007997,
        0.012002,
        0.015996,
        0.006999,
        0.007999,
        0.012003,
        0.017001,
        0.013999,
        0.016999,
        0.018997,
        0.014004,
        0.007996,
        0.011003,
        0.014997,
        0.014002,
        0.012999,
        0.019996,
        0.009002,
        0.009998,
        0.015003,
        0.008999,
        0.006001,
        0.015001,
        0.005999,
        0.008,
        0.009999,
        0.012004,
        0.01,
        0.006999,
        0.006996,
        0.008003,
        0.009002,
        0.014002,
        0.011,
        0.014996,
        0.008004,
        0.007,
        0.008996,
        0.004996,
        0.003003,
        0.003999,
        0.004001,
        0.004999,
        0.005996,
        0.008,
        0.008001,
        0.004001,
        0.005999,
        0.003,
        0.002999,
        0.006001,
        0.004996,
        0.005003,
        0.005998,
        0.004001,
        0.005999,
        0.008,
        0.006999,
        0.009999,
        0.004002,
        0.003001,
        0.004999,
        0.011002,
        0.006998,
        0.006998,
        0.012003,
        0.020002,
        0.015001,
        0.008997,
        0.012,
        0.014998,
        0.011998,
        0.008,
        0.025002,
        0.011,
        0.012,
        0.032998,
        0.035,
        0.01,
        0.01,
        0.017,
        0.013002,
        0.017002,
        0.011002,
        0.010002,
        0.024996,
        0.014998,
        0.020999,
        0.019998,
        0.027,
        0.009998,
        0.020003,
        0.006999,
        0.007998,
        0.012001,
        0.011,
        0.007002,
        0.005996,
        0.004999,
        0.004997,
        0.004999,
        0.005998,
        0.005004,
        0.006999,
        0.005,
        0.006995,
        0.007001,
        0.007,
        0.009999,
        0.007001,
        0.008004,
        0.005996,
        0.006003,
        0.005995,
        0.006003,
        0.005998,
        0.009004,
        0.006998,
        0.007999,
        0.005999,
        0.009001,
        0.009,
        0.008998,
        0.007,
        0.006001,
        0.008998,
        0.006998,
        0.009004,
        0.011001,
        0.006995,
        0.006002,
        0.007999,
        0.007001,
        0.007001,
        0.006,
        0.006001,
        0.008998,
        0.006997,
        0.005002,
        0.006997,
        0.008999,
        0.008003,
        0.006,
        0.004999,
        0.013001,
        0.011996,
        0.008002,
        0.008996,
        0.010003,
        0.005,
        0.007999,
        0.005995,
        0.008003,
        0.007002,
        0.005999,
        0.007,
        0.01,
        0.010998,
        0.009,
        0.010998,
        0.012001,
        0.008757,
        0.006998,
        0.006999,
        0.008001,
        0.007,
        0.012998,
        0.012999,
        0.011001,
        0.008003,
        0.008,
        0.008997,
        0.008001,
        0.011,
        0.009001,
        0.007001,
        0.005997,
        0.008989,
        0.011,
        0.011002,
        0.009001,
        0.009997,
        0.013003,
        0.005997,
        0.008001,
        0.009998,
        0.016001,
        0.006999,
        0.007001,
        0.007,
        0.013001,
        0.015001,
        0.012997,
        0.015002,
        0.012999,
        0.018,
        0.021001,
        0.018,
        0.007,
        0.008001,
        0.007998,
        0.005998,
        0.010002,
        0.013,
        0.019,
        0.013004,
        0.008996,
        0.012001,
        0.007001,
        0.009998,
        0.013999,
        0.006998,
        0.017,
        0.006,
        0.011,
        0.006999,
        0.012998,
        0.009983,
        0.007,
        0.01,
        0.007999,
        0.015999,
        0.011,
        0.007,
        0.016,
        0.006,
        0.008002,
        0.008001,
        0.005999,
        0.018,
        0.006999,
        0.011001,
        0.007001,
        0.008999,
        0.017001,
        0.008999,
        0.020999,
        0.007001,
        0.020999,
        0.009001,
        0.006003,
        0.012987,
        0.01,
        0.009001,
        0.013,
        0.008001,
        0.014003,
        0.008,
        0.015997,
        0.017999,
        0.010004,
        0.018996,
        0.008001,
        0.005001,
        0.008999,
        0.011,
        0.018001,
        0.008001,
        0.004997,
        0.015999,
        0.009002,
        0.007999,
        0.008,
        0.014,
        0.011002,
        0.008003,
        0.007996,
        0.009999,
        0.011,
        0.009,
        0.019002,
        0.01,
        0.008002,
        0.008999,
        0.011002,
        0.010001,
        0.007985,
        0.015,
        0.008999,
        0.022998,
        0.013001,
        0.007998,
        0.010001,
        0.013003,
        0.006996,
        0.007,
        0.01,
        0.015004,
        0.009995,
        0.008002,
        0.005001,
        0.009001,
        0.009999,
        0.006998,
        0.008002,
        0.009998,
        0.012,
        0.008002,
        0.007002,
        0.008999,
        0.005001,
        0.006998,
        0.006001,
        0.008,
        0.005998,
        0.006001,
        0.009,
        0.008001,
        0.006999,
        0.005001,
        0.007002,
        0.008998,
        0.006999,
        0.007003,
        0.009003,
        0.006999,
        0.007997,
        0.007003,
        0.006999,
        0.008,
        0.009,
        0.006,
        0.005,
        0.013003,
        0.009001,
        0.008,
        0.005999,
        0.006001,
        0.008,
        0.007,
        0.008003,
        0.009998,
        0.009,
        0.008999,
        0.006003,
        0.008999,
        0.008999,
        0.006,
        0.006,
        0.009,
        0.007,
        0.009,
        0.009001,
        0.005999,
        0.011999,
        0.007003,
        0.006998,
        0.008999,
        0.007,
        0.009003,
        0.009999,
        0.008998,
        0.006001,
        0.007002,
        0.009998,
        0.008,
        0.010003,
        0.006996,
        0.014,
        0.009002,
        0.013999,
        0.006,
        0.015999,
        0.013003,
        0.005997,
        0.018,
        0.015,
        0.006999,
        0.010001,
        0.011001,
        0.020987,
        0.005998,
        0.013,
        0.009999,
        0.019986,
        0.02,
        0.010002,
        0.019999,
        0.023003,
        0.011997,
        0.018,
        0.010998,
        0.017006,
        0.013998,
        0.009002,
        0.009999,
        0.006493,
        0.011,
        0.014004,
        0.015004,
        0.011984,
        0.010999,
        0.013999,
        0.021001,
        0.014999,
        0.010001,
        0.013999,
        0.014,
        0.014016,
        0.011986,
        0.012001,
        0.009997,
        0.007002,
        0.012999,
        0.028,
        0.01,
        0.019,
        0.015,
        0.010999,
        0.013,
        0.013,
        0.027002,
        0.013984,
        0.013002,
        0.013,
        0.017,
        0.015004,
        0.011,
        0.017999,
        0.022004,
        0.010996,
        0.017001,
        0.013,
        0.013003,
        0.019001,
        0.012,
        0.009,
        0.022002,
        0.009999,
        0.011999,
        0.010001,
        0.016,
        0.010002,
        0.011999,
        0.012998,
        0.019999,
        0.015001,
        0.019982,
        0.02,
        0.026001,
        0.010999,
        0.010999,
        0.014999,
        0.008003,
        0.011997,
        0.024001,
        0.018,
        0.018015,
        0.010985,
        0.017002,
        0.017507,
        0.012003,
        0.019,
        0.011001,
        0.015988,
        0.006998,
        0.022999,
        0.015,
        0.025002,
        0.018,
        0.022002,
        0.019001,
        0.013017,
        0.018984,
        0.008001,
        0.013003,
        0.007985,
        0.011999,
        0.014999,
        0.015,
        0.015278,
        0.020999,
        0.010001,
        0.011999,
        0.021,
        0.029003,
        0.009983,
        0.022003,
        0.009001,
        0.018998,
        0.009001,
        0.009997,
        0.025002,
        0.013,
        0.012,
        0.029997,
        0.011999,
        0.019001,
        0.016999,
        0.013996,
        0.022002,
        0.006998,
        0.016003,
        0.014999,
        0.022,
        0.006,
        0.010998,
        0.016004,
        0.022998,
        0.014001,
        0.017985,
        0.016,
        0.008997,
        0.026999,
        0.008004,
        0.011998,
        0.015998,
        0.012999,
        0.024,
        0.009998,
        0.014004,
        0.019999,
        0.022001,
        0.017,
        0.013,
        0.009999,
        0.021998,
        0.022999,
        0.014,
        0.023001,
        0.012997,
        0.009999,
        0.020003,
        0.013998,
        0.019999,
        0.013002,
        0.017002,
        0.016996,
        0.019003,
        0.017998,
        0.016002,
        0.012998,
        0.012997,
        0.014999,
        0.014,
        0.015003,
        0.018,
        0.013998,
        0.010003,
        0.008999,
        0.013997,
        0.014,
        0.016001,
        0.017001,
        0.018998,
        0.014001,
        0.015002,
        0.013997,
        0.014,
        0.024001,
        0.017001,
        0.012004,
        0.018998,
        0.015998,
        0.015996,
        0.018989,
        0.023001,
        0.016998,
        0.019999,
        0.019999,
        0.016997,
        0.019001,
        0.015997,
        0.016983,
        0.017,
        0.020997,
        0.021004,
        0.020998,
        0.023002,
        0.023996,
        0.028002,
        0.025999,
        0.027997,
        0.028003,
        0.033999,
        0.029002,
        0.038,
        0.035,
        0.038996,
        0.037998,
        0.05,
        0.048003,
        0.041002,
        0.044998,
        0.035,
        0.047999,
        0.023997,
        0.032002,
        0.028998,
        0.024,
        0.026001,
        0.038,
        0.017998,
        0.032999,
        0.042,
        0.045997,
        0.029998,
        0.050999,
        0.025002,
        0.024001,
        0.063996,
        0.023002,
        0.017999,
        0.033,
        0.039,
        0.034999,
        0.025,
        0.029001,
        0.012,
        0.02,
        0.048998,
        0.027,
        0.046997,
        0.050983,
        0.041004,
        0.050997,
        0.125005,
        0.050996,
        0.065001,
        0.041002,
        0.048001,
        0.06,
        0.030998,
        0.030001,
        0.034997,
        0.066001,
        0.036985,
        0.041001,
        0.039996,
        0.035997,
        0.019999,
        0.023,
        0.011003,
        0.012,
        0.030999,
        0.024985,
        0.039015,
        0.028986,
        0.019999,
        0.027,
        0.011997,
        0.007,
        0.021999,
        0.017,
        0.017,
        0.025001,
        0.021001,
        0.022997,
        0.026003,
        0.020001,
        0.016999,
        0.017,
        0.024,
        0.022999,
        0.026003,
        0.014999,
        0.016998,
        0.015001,
        0.017997,
        0.038,
        0.021999,
        0.022985,
        0.024,
        0.008,
        0.004998,
        0.006003,
        0.015998,
        0.016001,
        0.02,
        0.017999,
        0.025001,
        0.020999,
        0.017188,
        0.009999,
        0.018,
        0.013983,
        0.006002,
        0.005001,
        0.008001,
        0.010998,
        0.011999,
        0.007,
        0.004998,
        0.007001,
        0.014,
        0.018,
        0.021999,
        0.018001,
        0.014999,
        0.013995,
        0.017002,
        0.024997,
        0.021003,
        0.018999,
        0.022002,
        0.014988,
        0.016998,
        0.020002,
        0.018996,
        0.021003,
        0.024998,
        0.022002,
        0.018999,
        0.004999,
        0.023999,
        0.026002,
        0.022002,
        0.026,
        0.046264,
        0.070001,
        0.025002,
        0.030997,
        0.024,
        0.029002,
        0.032987,
        0.028002,
        0.040998,
        0.026997,
        0.020999,
        0.033003,
        0.016,
        0.023,
        0.023999,
        0.027001,
        0.017002,
        0.025999,
        0.028002,
        0.021003,
        0.030003,
        0.017999,
        0.022997,
        0.016999,
        0.019003,
        0.011999,
        0.023,
        0.046,
        0.035,
        0.046002,
        0.026984,
        0.036982,
        0.033,
        0.018019,
        0.031982,
        0.019999,
        0.017998,
        0.034999,
        0.038003,
        0.056999,
        0.034003,
        0.034999,
        0.035999,
        0.053,
        0.064999,
        0.032001,
        0.018999,
        0.024,
        0.035,
        0.020999,
        0.041001,
        0.014999,
        0.018001,
        0.013999,
        0.018,
        0.021998,
        0.019,
        0.017982,
        0.016999,
        0.044001,
        0.032002,
        0.027003,
        0.030985,
        0.042003,
        0.027999,
        0.012984,
        0.025999,
        0.020999,
        0.039,
        0.02998,
        0.026002,
        0.019999,
        0.028,
        0.031003,
        0.018997,
        0.02,
        0.020002,
        0.015998,
        0.017017,
        0.020982,
        0.025,
        0.013,
        0.017001,
        0.013996,
        0.018002,
        0.019017,
        0.025981,
        0.034002,
        0.018985,
        0.027996,
        0.019999,
        0.015,
        0.028001,
        0.027002,
        0.022,
        0.027984,
        0.032,
        0.027997,
        0.023001,
        0.038,
        0.033998,
        0.030005,
        0.021999,
        0.021996,
        0.032982,
        0.031999,
        0.033011,
        0.023993,
        0.028991,
        0.030001,
        0.037999,
        0.024001,
        0.024,
        0.018999,
        0.022001,
        0.009999,
        0.032002,
        0.030999,
        0.028002,
        0.023016,
        0.029985,
        0.030002,
        0.029999,
        0.028,
        0.028,
        0.031001,
        0.023997,
        0.036001,
        0.03,
        0.026003,
        0.021982,
        0.025,
        0.033998,
        0.025005,
        0.025982,
        0.030002,
        0.032998,
        0.028003,
        0.024998,
        0.025998,
        0.029002,
        0.026998,
        0.025999,
        0.017003,
        0.023996,
        0.025999,
        0.025,
        0.024982,
        0.027001,
        0.029999,
        0.033003,
        0.028998,
        0.025999,
        0.028,
        0.022003,
        0.023997,
        0.022002,
        0.026,
        0.027,
        0.015,
        0.022982,
        0.026002,
        0.03,
        0.024998,
        0.028001,
        0.011001,
        0.012002,
        0.022997,
        0.028002,
        0.011,
        0.020001,
        0.022002,
        0.017998,
        0.009,
        0.008002,
        0.015996,
        0.024002,
        0.028002,
        0.012,
        0.028,
        0.024997,
        0.014998,
        0.024999,
        0.022003,
        0.023996,
        0.027003,
        0.025998,
        0.025,
        0.026002,
        0.029001,
        0.024998,
        0.032002,
        0.027,
        0.024998,
        0.025999,
        0.029999,
        0.026002,
        0.028998,
        0.028999,
        0.015003,
        0.025002,
        0.033999,
        0.026999,
        0.028002,
        0.025,
        0.032,
        0.019,
        0.025001,
        0.027001,
        0.011982,
        0.025002,
        0.021,
        0.01,
        0.015001,
        0.02,
        0.010984,
        0.015,
        0.019002,
        0.015,
        0.009999,
        0.019003,
        0.015998,
        0.016999,
        0.016002,
        0.011999,
        0.021,
        0.016003,
        0.011,
        0.011002,
        0.012,
        0.018999,
        0.010001,
        0.020999,
        0.016,
        0.012002,
        0.010999,
        0.014001,
        0.013001,
        0.020998,
        0.012001,
        0.015999,
        0.012001,
        0.008999,
        0.015,
        0.018002,
        0.008999,
        0.010001,
        0.009002,
        0.010998,
        0.014,
        0.01,
        0.011999,
        0.008,
        0.013999,
        0.016,
        0.013,
        0.016,
        0.016002,
        0.022001,
        0.018,
        0.016981,
        0.015999,
        0.020001,
        0.011002,
        0.006,
        0.006999,
        0.008999,
        0.009001,
        0.014998,
        0.013,
        0.009001,
        0.012999,
        0.011001,
        0.010999,
        0.009998,
        0.008003,
        0.013999,
        0.008999,
        0.012018,
        0.017983,
        0.014998,
        0.019002,
        0.020999,
        0.016999,
        0.017001,
        0.019003,
        0.009,
        0.018996,
        0.019017,
        0.012985,
        0.016998,
        0.020001,
        0.012001,
        0.03,
        0.025999,
        0.011996,
        0.025,
        0.028002,
        0.020001,
        0.013002,
        0.021996,
        0.028024,
        0.024978,
        0.017001,
        0.024,
        0.024001,
        0.016001,
        0.025,
        0.026,
        0.029003,
        0.022002,
        0.022001,
        0.028002,
        0.025998,
        0.028001,
        0.016998,
        0.018999,
        0.030001,
        0.022,
        0.025999,
        0.024,
        0.036002,
        0.021002,
        0.023984,
        0.028002,
        0.026001,
        0.031003,
        0.027998,
        0.020002,
        0.018996,
        0.023,
        0.021001,
        0.023998,
        0.029001,
        0.020983,
        0.028998,
        0.033,
        0.026984,
        0.021001,
        0.026002,
        0.025998,
        0.022001,
        0.022997,
        0.021002,
        0.023999,
        0.028003,
        0.022997,
        0.028003,
        0.019999,
        0.026003,
        0.023,
        0.024,
        0.027999,
        0.023983,
        0.024001,
        0.033002,
        0.018987,
        0.03,
        0.028997,
        0.025999,
        0.031,
        0.032001,
        0.037001,
        0.034,
        0.029998,
        0.039002,
        0.031999,
        0.033982,
        0.034002,
        0.025,
        0.044,
        0.025021,
        0.031,
        0.033001,
        0.031998,
        0.03,
        0.045001,
        0.032999,
        0.031,
        0.03,
        0.029004,
        0.03,
        0.042,
        0.036,
        0.024999,
        0.040001,
        0.035999,
        0.050002,
        0.032002,
        0.034002,
        0.035002,
        0.032001,
        0.033998,
        0.034001,
        0.032999,
        0.026001,
        0.041998,
        0.035,
        0.023983,
        0.028002,
        0.067999,
        0.024998,
        0.029018,
        0.040984,
        0.036998,
        0.056003,
        0.046003,
        0.046002,
        0.034999,
        0.051001,
        0.045001,
        0.048982,
        0.056998,
        0.049999,
        0.033001,
        0.044984,
        0.038001,
        0.044982,
        0.036987,
        0.041,
        0.038001,
        0.039,
        0.040997,
        0.041001,
        0.037001,
        0.041001,
        0.037,
        0.040997,
        0.039999,
        0.036997,
        0.041999,
        0.036999,
        0.033998,
        0.033002,
        0.038,
        0.038,
        0.039001,
        0.037999,
        0.042001,
        0.036002,
        0.030999,
        0.028002,
        0.034997,
        0.034998,
        0.034001,
        0.031001,
        0.038,
        0.033003,
        0.033,
        0.037,
        0.035996,
        0.039005,
        0.027002,
        0.034985,
        0.040998,
        0.036001,
        0.025999,
        0.033,
        0.035003,
        0.033999,
        0.033002,
        0.030987,
        0.036732,
        0.030004,
        0.020846,
        0.024001,
        0.026999,
        0.022999,
        0.035,
        0.022997,
        0.027004,
        0.032996,
        0.030003,
        0.023997,
        0.027004,
        0.024984,
        0.025,
        0.037001,
        0.020001,
        0.027,
        0.023998,
        0.028002,
        0.032998,
        0.039374,
        0.032002,
        0.024,
        0.026973,
        0.035001,
        0.032002,
        0.034,
        0.034001,
        0.034997,
        0.032018,
        0.028001,
        0.04,
        0.037999,
        0.031,
        0.041009,
        0.036985,
        0.042001,
        0.028999,
        0.042001,
        0.028001,
        0.031001,
        0.046999,
        0.035001,
        0.029983,
        0.040002,
        0.029987,
        0.033996,
        0.032999,
        0.045001,
        0.031999,
        0.032999,
        0.050001,
        0.041002,
        0.038001,
        0.046001,
        0.045009,
        0.041001,
        0.047201,
        0.055001,
        0.05,
        0.039,
        0.043999,
        0.043,
        0.048,
        0.075999,
        0.05301,
        0.06199,
        0.081997,
        0.067004,
        0.073997,
        0.081,
        0.055,
        0.064999,
        0.06,
        0.036002,
        0.065998,
        0.043005,
        0.092998,
        0.037998,
        0.048003,
        0.063996,
        0.042003,
        0.147989,
        0.031998,
        0.042,
        0.094002,
        0.031002,
        0.050998,
        0.042998,
        0.145999,
        0.044986,
        0.096999,
        0.070999,
        0.065982,
        0.035004,
        0.082985,
        0.084,
        0.037996,
        0.022004,
        0.048998,
        0.045999,
        0.021004,
        0.041996,
        0.068997,
        0.029999,
        0.066003,
        0.071012,
        0.025987,
        0.024002,
        0.046997,
        0.020002,
        0.017,
        0.058003,
        0.045997,
        0.022999,
        0.024997,
        0.038998,
        0.035999,
        0.065999,
        0.05,
        0.028001,
        0.038,
        0.035001,
        0.036,
        0.035999,
        0.020017,
        0.048982,
        0.037001,
        0.029996,
        0.059003,
        0.032999,
        0.069,
        0.041001,
        0.040016,
        0.042986,
        0.047982,
        0.039002,
        0.032002,
        0.029996,
        0.047001,
        0.034995,
        0.042001,
        0.04496,
        0.032,
        0.016001,
        0.015,
        0.039003,
        0.034001,
        0.016,
        0.014,
        0.029002,
        0.039001,
        0.015999,
        0.043001,
        0.016999,
        0.017998,
        0.032998,
        0.019,
        0.023007,
        0.032997,
        0.010998,
        0.031002,
        0.029,
        0.032,
        0.03,
        0.036002,
        0.012,
        0.028,
        0.030001,
        0.013999,
        0.028001,
        0.035,
        0.031058,
        0.028001,
        0.022986,
        0.027999,
        0.027998,
        0.019997,
        0.029003,
        0.028995,
        0.030004,
        0.026995,
        0.027997,
        0.026005,
        0.029999,
        0.025,
        0.029002,
        0.029997,
        0.026,
        0.029,
        0.024002,
        0.028997,
        0.041002,
        0.02989,
        0.026999,
        0.036999,
        0.033001,
        0.041999,
        0.030997,
        0.043001,
        0.042,
        0.038,
        0.047003,
        0.036001,
        0.045002,
        0.030998,
        0.029013,
        0.040002,
        0.031999,
        0.040002,
        0.031998,
        0.038002,
        0.028002,
        0.057001,
        0.044003,
        0.045,
        0.051833,
        0.053999,
        0.056002,
        0.051002,
        0.052999,
        0.046002,
        0.067999,
        0.061,
        0.034999,
        0.064004,
        0.055984,
        0.039001,
        0.043998,
        0.062002,
        0.053,
        0.060067,
        0.032002,
        0.036999,
        0.035856,
        0.045057,
        0.030997,
        0.039002,
        0.052996,
        0.062999,
        0.057003,
        0.056999,
        0.066002,
        0.053001,
        0.043002,
        0.079997,
        0.060001,
        0.052105,
        0.049,
        0.040003,
        0.055001,
        0.038,
        0.040999,
        0.053024,
        0.051008,
        0.042255,
        0.051,
        0.057015,
        0.043984,
        0.059002,
        0.050999,
        0.043996,
        0.050015,
        0.032984,
        0.041999,
        0.051002,
        0.039998,
        0.036001,
        0.078,
        0.052996,
        0.041998,
        0.048004,
        0.052001,
        0.035997,
        0.04,
        0.037002,
        0.038994,
        0.043002,
        0.028002,
        0.032997,
        0.030003,
        0.030994,
        0.029001,
        0.032001,
        0.022998,
        0.029998,
        0.030002,
        0.026,
        0.022999,
        0.026003,
        0.023998,
        0.030999,
        0.028995,
        0.023996,
        0.026003,
        0.026001,
        0.026997,
        0.023999,
        0.027005,
        0.023998,
        0.026001,
        0.021999,
        0.016004,
        0.027994,
        0.021005,
        0.024996,
        0.029004,
        0.026998,
        0.017002,
        0.021001,
        0.017002,
        0.027996,
        0.012004,
        0.01,
        0.007999,
        0.022002,
        0.017276,
        0.023002,
        0.027998,
        0.025004,
        0.019998,
        0.014999,
        0.023003,
        0.022001,
        0.025,
        0.029997,
        0.024002,
        0.020002,
        0.024998,
        0.028003,
        0.031003,
        0.027998,
        0.027998,
        0.032997,
        0.031003,
        0.024996,
        0.027,
        0.031999,
        0.029003,
        0.026997,
        0.027001,
        0.025001,
        0.029002,
        0.027997,
        0.028999,
        0.026997,
        0.029,
        0.027002,
        0.029001,
        0.027001,
        0.029001,
        0.032999,
        0.029997,
        0.032001,
        0.031,
        0.030999,
        0.029004,
        0.027997,
        0.028002,
        0.026,
        0.033002,
        0.030996,
        0.024998,
        0.031004,
        0.029999,
        0.025999,
        0.026997,
        0.028003,
        0.027997,
        0.026998,
        0.025,
        0.035003,
        0.027998,
        0.028998,
        0.029,
        0.030002,
        0.028,
        0.031013,
        0.029985,
        0.031004,
        0.031001,
        0.030999,
        0.025001,
        0.030001,
        0.035,
        0.028998,
        0.032996,
        0.024002,
        0.024001,
        0.025999,
        0.027992,
        0.032004,
        0.027,
        0.029996,
        0.027,
        0.027996,
        0.024003,
        0.030998,
        0.030002,
        0.035997,
        0.037003,
        0.029001,
        0.032999,
        0.037001,
        0.041998,
        0.037,
        0.039004,
        0.036,
        0.035997,
        0.038002,
        0.046001,
        0.025999,
        0.035998,
        0.029,
        0.030999,
        0.031999,
        0.029002,
        0.036001,
        0.034,
        0.028999,
        0.029004,
        0.026999,
        0.029996,
        0.027998,
        0.030004,
        0.030001,
        0.032997,
        0.027,
        0.030996,
        0.031002,
        0.030001,
        0.026997,
        0.025999,
        0.032003,
        0.033005,
        0.036994,
        0.029003,
        0.032,
        0.032997,
        0.031002,
        0.029988,
        0.033996,
        0.033997,
        0.026999,
        0.031998,
        0.031003,
        0.030999,
        0.034002,
        0.038996,
        0.035002,
        0.037001,
        0.041,
        0.032998,
        0.042004,
        0.039996,
        0.042004,
        0.037024,
        0.043001,
        0.041,
        0.035003,
        0.046985,
        0.046,
        0.042999,
        0.049004,
        0.042996,
        0.048004,
        0.045997,
        0.046998,
        0.036001,
        0.04,
        0.041002,
        0.034,
        0.030999,
        0.037001,
        0.030999,
        0.031375,
        0.034996,
        0.041001,
        0.044004,
        0.032996,
        0.034,
        0.025,
        0.025999,
        0.026987,
        0.034015,
        0.030984,
        0.032004,
        0.029995,
        0.032001,
        0.032,
        0.02899,
        0.024988,
        0.027,
        0.027998,
        0.032,
        0.028999,
        0.032003,
        0.037995,
        0.036002,
        0.029999,
        0.046986,
        0.039998,
        0.039001,
        0.033999,
        0.025,
        0.027999,
        0.03,
        0.027001,
        0.027986,
        0.031,
        0.031004,
        0.036996,
        0.031998,
        0.035001,
        0.041999,
        0.036,
        0.039001,
        0.039,
        0.039999,
        0.039002,
        0.031998,
        0.036,
        0.035,
        0.032998,
        0.03,
        0.03,
        0.03,
        0.03,
        0.029,
        0.030001,
        0.034,
        0.033999,
        0.035001,
        0.030999,
        0.031,
        0.035,
        0.029,
        0.031001,
        0.029001,
        0.029,
        0.030999,
        0.03,
        0.030002,
        0.030001,
        0.033002,
        0.033997,
        0.028001,
        0.028999,
        0.032002,
        0.031998,
        0.028001,
        0.029997,
        0.031983,
        0.032002,
        0.037,
        0.031984,
        0.031004,
        0.033003,
        0.030996,
        0.028001,
        0.035997,
        0.036001,
        0.033999,
        0.030998,
        0.027002,
        0.034,
        0.029001,
        0.035,
        0.027999,
        0.033706,
        0.03651,
        0.033999,
        0.037,
        0.027999,
        0.028998,
        0.034,
        0.031744,
        0.035001,
        0.029001,
        0.037997,
        0.032,
        0.036998,
        0.035999,
        0.032001,
        0.034998,
        0.029,
        0.004997,
        0.032999,
        0.033983,
        0.031002,
        0.035998,
        0.045,
        0.032003,
        0.041999,
        0.044995,
        0.035983,
        0.033999,
        0.039998,
        0.036001,
        0.030998,
        0.032,
        0.035999,
        0.035003,
        0.045,
        0.034002,
        0.040996,
        0.037001,
        0.047001,
        0.030001,
        0.037996,
        0.026003,
        0.037024,
        0.040975,
        0.033998,
        0.040999,
        0.037,
        0.032,
        0.031,
        0.034999,
        0.037,
        0.041,
        0.048003,
        0.042999,
        0.040999,
        0.039003,
        0.037999,
        0.043,
        0.032999,
        0.048003,
        0.042997,
        0.055999,
        0.043,
        0.044995,
        0.035001,
        0.042997,
        0.034999,
        0.046004,
        0.049994,
        0.042001,
        0.040999,
        0.035998,
        0.046004,
        0.045997,
        0.041,
        0.041996,
        0.044998,
        0.039998,
        0.042001,
        0.044996,
        0.047,
        0.034997,
        0.034003,
        0.060997,
        0.043,
        0.035998,
        0.041996,
        0.045002,
        0.040998,
        0.033002,
        0.038,
        0.031002,
        0.036997,
        0.038,
        0.037998,
        0.047004,
        0.038986,
        0.049999,
        0.035003,
        0.040999,
        0.039,
        0.044996,
        0.046004,
        0.040008,
        0.038987,
        0.045004,
        0.047999,
        0.041001,
        0.047999,
        0.060999,
        0.055001,
        0.048998,
        0.068997,
        0.076999,
        0.069001,
        0.068982,
        0.049001,
        0.067001,
        0.044014,
        0.033986,
        0.037985,
        0.046,
        0.038,
        0.038998,
        0.039985,
        0.036,
        0.031998,
        0.029001,
        0.032001,
        0.028997,
        0.025998,
        0.025984,
        0.031,
        0.028,
        0.028998,
        0.028,
        0.025,
        0.025996,
        0.021997,
        0.023001,
        0.027001,
        0.013001,
        0.020988,
        0.024987,
        0.016998,
        0.029001,
        0.023996,
        0.024001,
        0.023999,
        0.024,
        0.024986,
        0.025,
        0.024998,
        0.026999,
        0.025,
        0.027011,
        0.023987,
        0.027,
        0.026001,
        0.029016,
        0.026984,
        0.028999,
        0.028,
        0.030002,
        0.025999,
        0.029,
        0.031999,
        0.030001,
        0.026,
        0.028002,
        0.029999,
        0.028001,
        0.024001,
        0.027998,
        0.032002,
        0.028997,
        0.029998,
        0.029998,
        0.029998,
        0.028997,
        0.030003,
        0.032999,
        0.031997,
        0.035001,
        0.033998,
        0.033997,
        0.028002,
        0.033,
        0.040997,
        0.041002,
        0.034997,
        0.035,
        0.037014,
        0.030984,
        0.038998,
        0.035985,
        0.036001,
        0.040998,
        0.041,
        0.050005,
        0.04501,
        0.046984,
        0.043002,
        0.049,
        0.047997,
        0.058001,
        0.049999,
        0.062,
        0.056002,
        0.066997,
        0.052017,
        0.044983,
        0.058,
        0.080009,
        0.054999,
        0.085001,
        0.112987,
        0.094998,
        0.135,
        0.073002,
        0.093999,
        0.112001,
        0.065997,
        0.077997,
        0.03,
        0.037,
        0.026,
        0.064998,
        0.013,
        0.009996,
        0.051004,
        0.106997,
        0.018,
        0.032,
        0.052998,
        0.049997,
        0.037999,
        0.067,
        0.061984,
        0.136001,
        0.174004,
        0.035999,
        0.155,
        0.072002,
        0.080998,
        0.055004,
        0.058999,
        0.068001,
        0.076996,
        0.073001,
        0.090002,
        0.078998,
        0.070997,
        0.119002,
        0.103003,
        0.107,
        0.106001,
        0.118001,
        0.095999,
        0.055001,
        0.070998,
        0.059999,
        0.051998,
        0.074009,
        0.074995,
        0.051,
        0.056997,
        0.055,
        0.054003,
        0.053998,
        0.026,
        0.021002,
        0.023998,
        0.048996,
        0.027011,
        0.027991,
        0.045003,
        0.050998,
        0.051997,
        0.059999,
        0.079997,
        0.069003,
        0.039997,
        0.029998,
        0.060999,
        0.059999,
        0.057998,
        0.057001,
        0.071,
        0.071002,
        0.060001,
        0.039002,
        0.083004,
        0.125996,
        0.082003,
        0.050995,
        0.149987,
        0.19097,
        0.171001,
        0.182,
        0.185,
        0.172998,
        0.117001,
        0.092003,
        0.077001,
        0.078998,
        0.056002,
        0.063002,
        0.065997,
        0.053999,
        0.057001,
        0.049999,
        0.049999,
        0.050004,
        0.042001,
        0.048,
        0.039997,
        0.038999,
        0.037,
        0.041003,
        0.040998,
        0.04,
        0.042001,
        0.037999,
        0.039,
        0.039016,
        0.032984,
        0.033999,
        0.039003,
        0.038996,
        0.037001,
        0.034003,
        0.035985,
        0.036999,
        0.039999,
        0.037986,
        0.043997,
        0.035004,
        0.037998,
        0.04,
        0.047002,
        0.040983,
        0.042001,
        0.046999,
        0.042001,
        0.043999,
        0.046003,
        0.047014,
        0.041985,
        0.037,
        0.040995,
        0.038002,
        0.037998,
        0.042,
        0.036999,
        0.043001,
        0.038999,
        0.044,
        0.039689,
        0.047,
        0.042998,
        0.046998,
        0.042983,
        0.037001,
        0.039985,
        0.035002,
        0.041998,
        0.039001,
        0.038999,
        0.034002,
        0.038001,
        0.035999,
        0.034999,
        0.037002,
        0.037998,
        0.043999,
        0.036,
        0.039999,
        0.03898,
        0.042,
        0.032998,
        0.038005,
        0.037995,
        0.036001,
        0.037997,
        0.046001,
        0.037003,
        0.045998,
        0.049,
        0.043003,
        0.048996,
        0.050982,
        0.052982,
        0.043002,
        0.048,
        0.048001,
        0.051003,
        0.051985,
        0.053001,
        0.055999,
        0.055,
        0.048063,
        0.053001,
        0.056,
        0.056001,
        0.064,
        0.055,
        0.058998,
        0.069001,
        0.062999,
        0.070998,
        0.072002,
        0.091,
        0.067001,
        0.079987,
        0.074997,
        0.066999,
        0.052997,
        0.056987,
        0.052,
        0.050001,
        0.047984,
        0.061,
        0.054999,
        0.048001,
        0.054001,
        0.041,
        0.039998,
        0.036987,
        0.055,
        0.033997,
        0.038001,
        0.055,
        0.036999,
        0.040001,
        0.036001,
        0.045998,
        0.038999,
        0.038,
        0.058,
        0.05,
        0.054001,
        0.052,
        0.047001,
        0.046001,
        0.048999,
        0.039002,
        0.055987,
        0.054998,
        0.061983,
        0.057,
        0.034,
        0.059001,
        0.071,
        0.066017,
        0.071985,
        0.062998,
        0.066,
        0.059003,
        0.052002,
        0.066998,
        0.045002,
        0.049001,
        0.052,
        0.057,
        0.057,
        0.051,
        0.055999,
        0.053001,
        0.056999,
        0.052999,
        0.046004,
        0.046998,
        0.054006,
        0.038,
        0.048998,
        0.053,
        0.003999,
        0.047999,
        0.050001,
        0.047998,
        0.046999,
        0.046998,
        0.042003,
        0.052999,
        0.050001,
        0.048998,
        0.051002,
        0.045001,
        0.042999,
        0.049001,
        0.050999,
        0.054,
        0.003999,
        0.054,
        0.053999,
        0.053,
        0.054001,
        0.052,
        0.051,
        0.063002,
        0.051,
        0.043,
        0.052001,
        0.003999,
        0.071,
        0.046001,
        0.065999,
        0.04,
        0.006,
        0.044999,
        0.005001,
        0.043997,
        0.051002,
        0.058999,
        0.066,
        0.064998,
        0.072002,
        0.004999,
        0.056002,
        0.056,
        0.062002,
        0.049013,
        0.065986,
        0.059999,
        0.053998,
        0.057002,
        0.05,
        0.067,
        0.059998,
        0.064006,
        0.005995,
        0.063,
        0.056,
        0.056,
        0.054,
        0.067,
        0.052,
        0.057,
        0.072,
        0.065,
        0.058002,
        0.053998,
        0.055999,
        0.055002,
        0.057002,
        0.073985,
        0.07,
        0.074,
        0.055999,
        0.071001,
        0.049002,
        0.053,
        0.051996,
        0.063985,
        0.068999,
        0.070003,
        0.084998,
        0.08,
        0.077999,
        0.074002,
        0.057999,
        0.066001,
        0.065001,
        0.060985,
        0.065999,
        0.067,
        0.062998,
        0.064,
        0.060999,
        0.071003,
        0.077,
        0.070996,
        0.073,
        0.088002,
        0.080997,
        0.08,
        0.089999,
        0.082999,
        0.089,
        0.097999,
        0.097,
        0.098001,
        0.094,
        0.098014,
        0.083998,
        0.083002,
        0.092999,
        0.093001,
        0.097002,
        0.076999,
        0.081001,
        0.084999,
        0.08,
        0.068999,
        0.067001,
        0.093001,
        0.088,
        0.101999,
        0.073,
        0.079998,
        0.043001,
        0.066003,
        0.083997,
        0.060001,
        0.058999,
        0.067001,
        0.080999,
        0.099004,
        0.069997,
        0.092,
        0.052002,
        0.051997,
        0.053001,
        0.038999,
        0.088,
        0.061,
        0.049001,
        0.054,
        0.080002,
        0.083999,
        0.079,
        0.068996,
        0.097,
        0.113,
        0.044,
        0.003989,
        0.074982,
        0.061002,
        0.05,
        0.069001,
        0.057999,
        0.014999,
        0.083003,
        0.004,
        0.086,
        0.078001,
        0.087002,
        0.020998,
        0.103,
        0.056,
        0.120001,
        0.032003,
        0.051998,
        0.058,
        0.094002,
        0.089999,
        0.095999,
        0.082,
        0.067,
        0.095001,
        0.070015,
        0.089983,
        0.017001,
        0.066999,
        0.104,
        0.087999,
        0.067998,
        0.077985,
        0.081001,
        0.081003,
        0.065998,
        0.086985,
        0.083,
        0.091998,
        0.098003,
        0.070001,
        0.069999,
        0.068011,
        0.08099,
        0.078997,
        0.082002,
        0.081002,
        0.086,
        0.081999,
        0.076,
        0.085,
        0.090002,
        0.102999,
        0.090001,
        0.118,
        0.106,
        0.005002,
        0.141,
        0.136998,
        0.124001,
        0.103001,
        0.131005,
        0.117995,
        0.124998,
        0.139,
        0.122998,
        0.005002,
        0.098,
        0.132001,
        0.136996,
        0.047001,
        0.141002,
        0.150999,
        0.137,
        0.082001,
        0.132997,
        0.084999,
        0.122002,
        0.003001,
        0.099,
        0.10803,
        0.102009,
        0.081,
        0.099999,
        0.104003,
        0.080999,
        0.116002,
        0.110996,
        0.109999,
        0.146,
        0.148001,
        0.149,
        0.145998,
        0.148,
        0.147,
        0.147004,
        0.146984,
        0.147002,
        0.151998,
        0.147998,
        0.158004,
        0.154998,
        0.147002,
        0.151998,
        0.154,
        0.154,
        0.182002,
        0.149001,
        0.164008,
        0.163991,
        0.155002,
        0.154,
        0.147999,
        0.152004,
        0.147013,
        0.149982,
        0.150009,
        0.146002,
        0.146998,
        0.147999,
        0.149999,
        0.158001,
        0.113998,
        0.149002,
        0.147982,
        0.152054,
        0.018008,
        0.144999,
        0.151,
        0.149999,
        0.091001,
        0.070999,
        0.123,
        0.146999,
        0.046001,
        0.100165,
        0.125001,
        0.147001,
        0.121001,
        0.120999,
        0.149003,
        0.152002,
        0.155001,
        0.089992,
        0.137979,
        0.129001,
        0.081001,
        0.099998,
        0.150004,
        0.094998,
        0.117001,
        0.161998,
        0.092002,
        0.147999,
        0.070999,
        0.139003,
        0.147981,
        0.071,
        0.072002,
        0.095998,
        0.112002,
        0.111003,
        0.149998,
        0.147,
        0.147001,
        0.095999,
        0.153,
        0.147,
        0.121003,
        0.151995,
        0.152,
        0.080001,
        0.09,
        0.089002,
        0.084982,
        0.153004,
        0.14698,
        0.074002,
        0.119002,
        0.147999,
        0.146999,
        0.139999,
        0.144999,
        0.149001,
        0.148999,
        0.154999,
        0.151002,
        0.152001,
        0.149999,
        0.154,
        0.147002,
        0.154003,
        0.150998,
        0.152,
        0.148997,
        0.147999,
        0.146002,
        0.146997,
        0.157999,
        0.147,
        0.145983,
        0.149011,
        0.148,
        0.149001,
        0.150002,
        0.153999,
        0.153,
        0.153999,
        0.147002,
        0.150001,
        0.148999,
        0.152001,
        0.057999,
        0.149988,
        0.147995,
        0.147002,
        0.170018,
        0.157999,
        0.15,
        0.148998,
        0.146999,
        0.147,
        0.119999,
        0.137999,
        0.145002,
        0.147999,
        0.125001,
        0.149985,
        0.157003,
        0.146997,
        0.148999,
        0.146999,
        0.147985,
        0.149999,
        0.149001,
        0.147999,
        0.147868,
        0.148997,
        0.149,
        0.151001,
        0.158984,
        0.147001,
        0.162,
        0.151,
        0.134015,
        0.145987,
        0.108998,
        0.164983,
        0.152394,
        0.149009,
        0.154001,
        0.147001,
        0.147469,
        0.149008,
        0.150984,
        0.151001,
        0.151008,
        0.148991,
        0.151999,
        0.15
    ]
}