episodes,steps,rewards
0,200,-200.0
1,200,-200.0
2,200,-200.0
3,200,-200.0
4,200,-200.0
5,200,-200.0
6,200,-200.0
7,200,-200.0
8,200,-200.0
9,200,-200.0
10,200,-200.0
11,200,-200.0
12,200,-200.0
13,200,-200.0
14,200,-200.0
15,200,-200.0
16,200,-200.0
17,200,-200.0
18,200,-200.0
19,200,-200.0
20,200,-200.0
21,200,-200.0
22,200,-200.0
23,200,-200.0
24,200,-200.0
25,200,-200.0
26,200,-200.0
27,200,-200.0
28,200,-200.0
29,156,-156.0
30,145,-145.0
31,168,-168.0
32,200,-200.0
33,200,-200.0
34,200,-200.0
35,200,-200.0
36,200,-200.0
37,177,-177.0
38,200,-200.0
39,200,-200.0
40,200,-200.0
41,114,-114.0
42,200,-200.0
43,200,-200.0
44,200,-200.0
45,200,-200.0
46,200,-200.0
47,200,-200.0
48,165,-165.0
49,200,-200.0
50,200,-200.0
51,200,-200.0
52,200,-200.0
53,200,-200.0
54,122,-122.0
55,181,-181.0
56,119,-119.0
57,154,-154.0
58,200,-200.0
59,200,-200.0
60,125,-125.0
61,200,-200.0
62,120,-120.0
63,114,-114.0
64,153,-153.0
65,190,-190.0
66,185,-185.0
67,155,-155.0
68,188,-188.0
69,128,-128.0
70,132,-132.0
71,185,-185.0
72,121,-121.0
73,137,-137.0
74,106,-106.0
75,188,-188.0
76,183,-183.0
77,97,-97.0
78,145,-145.0
79,135,-135.0
80,161,-161.0
81,149,-149.0
82,200,-200.0
83,93,-93.0
84,171,-171.0
85,158,-158.0
86,112,-112.0
87,145,-145.0
88,145,-145.0
89,176,-176.0
90,176,-176.0
91,91,-91.0
92,142,-142.0
93,194,-194.0
94,111,-111.0
95,85,-85.0
96,187,-187.0
97,154,-154.0
98,88,-88.0
99,173,-173.0
100,112,-112.0
101,168,-168.0
102,146,-146.0
103,95,-95.0
104,141,-141.0
105,114,-114.0
106,109,-109.0
107,148,-148.0
108,164,-164.0
109,111,-111.0
110,121,-121.0
111,130,-130.0
112,187,-187.0
113,159,-159.0
114,159,-159.0
115,184,-184.0
116,105,-105.0
117,98,-98.0
118,145,-145.0
119,122,-122.0
120,180,-180.0
121,93,-93.0
122,129,-129.0
123,140,-140.0
124,115,-115.0
125,164,-164.0
126,91,-91.0
127,110,-110.0
128,103,-103.0
129,94,-94.0
130,200,-200.0
131,108,-108.0
132,109,-109.0
133,155,-155.0
134,98,-98.0
135,99,-99.0
136,173,-173.0
137,90,-90.0
138,145,-145.0
139,175,-175.0
140,192,-192.0
141,122,-122.0
142,109,-109.0
143,162,-162.0
144,166,-166.0
145,154,-154.0
146,159,-159.0
147,112,-112.0
148,176,-176.0
149,107,-107.0
150,108,-108.0
151,97,-97.0
152,116,-116.0
153,146,-146.0
154,151,-151.0
155,105,-105.0
156,124,-124.0
157,130,-130.0
158,200,-200.0
159,85,-85.0
160,194,-194.0
161,86,-86.0
162,149,-149.0
163,148,-148.0
164,125,-125.0
165,117,-117.0
166,151,-151.0
167,143,-143.0
168,159,-159.0
169,143,-143.0
170,182,-182.0
171,111,-111.0
172,145,-145.0
173,156,-156.0
174,104,-104.0
175,142,-142.0
176,154,-154.0
177,150,-150.0
178,159,-159.0
179,200,-200.0
180,88,-88.0
181,164,-164.0
182,167,-167.0
183,146,-146.0
184,162,-162.0
185,200,-200.0
186,200,-200.0
187,161,-161.0
188,182,-182.0
189,153,-153.0
190,200,-200.0
191,200,-200.0
192,147,-147.0
193,200,-200.0
194,200,-200.0
195,153,-153.0
196,200,-200.0
197,145,-145.0
198,118,-118.0
199,94,-94.0
200,177,-177.0
201,142,-142.0
202,161,-161.0
203,140,-140.0
204,160,-160.0
205,141,-141.0
206,104,-104.0
207,98,-98.0
208,151,-151.0
209,92,-92.0
210,161,-161.0
211,152,-152.0
212,155,-155.0
213,179,-179.0
214,156,-156.0
215,149,-149.0
216,159,-159.0
217,146,-146.0
218,114,-114.0
219,108,-108.0
220,137,-137.0
221,153,-153.0
222,159,-159.0
223,85,-85.0
224,85,-85.0
225,90,-90.0
226,140,-140.0
227,191,-191.0
228,151,-151.0
229,155,-155.0
230,138,-138.0
231,155,-155.0
232,115,-115.0
233,86,-86.0
234,115,-115.0
235,161,-161.0
236,84,-84.0
237,147,-147.0
238,92,-92.0
239,132,-132.0
240,131,-131.0
241,154,-154.0
242,160,-160.0
243,174,-174.0
244,111,-111.0
245,145,-145.0
246,149,-149.0
247,171,-171.0
248,92,-92.0
249,90,-90.0
250,92,-92.0
251,153,-153.0
252,154,-154.0
253,188,-188.0
254,150,-150.0
255,111,-111.0
256,85,-85.0
257,146,-146.0
258,91,-91.0
259,100,-100.0
260,116,-116.0
261,191,-191.0
262,114,-114.0
263,200,-200.0
264,88,-88.0
265,119,-119.0
266,182,-182.0
267,89,-89.0
268,159,-159.0
269,85,-85.0
270,147,-147.0
271,134,-134.0
272,143,-143.0
273,85,-85.0
274,86,-86.0
275,146,-146.0
276,142,-142.0
277,89,-89.0
278,154,-154.0
279,143,-143.0
280,93,-93.0
281,155,-155.0
282,149,-149.0
283,161,-161.0
284,200,-200.0
285,100,-100.0
286,134,-134.0
287,93,-93.0
288,151,-151.0
289,143,-143.0
290,103,-103.0
291,152,-152.0
292,200,-200.0
293,156,-156.0
294,135,-135.0
295,142,-142.0
296,142,-142.0
297,148,-148.0
298,171,-171.0
299,146,-146.0
300,142,-142.0
301,145,-145.0
302,125,-125.0
303,155,-155.0
304,142,-142.0
305,144,-144.0
306,145,-145.0
307,160,-160.0
308,156,-156.0
309,97,-97.0
310,152,-152.0
311,152,-152.0
312,178,-178.0
313,141,-141.0
314,87,-87.0
315,150,-150.0
316,143,-143.0
317,147,-147.0
318,160,-160.0
319,172,-172.0
320,161,-161.0
321,87,-87.0
322,152,-152.0
323,160,-160.0
324,150,-150.0
325,156,-156.0
326,141,-141.0
327,106,-106.0
328,145,-145.0
329,147,-147.0
330,113,-113.0
331,146,-146.0
332,158,-158.0
333,146,-146.0
334,152,-152.0
335,138,-138.0
336,91,-91.0
337,149,-149.0
338,166,-166.0
339,145,-145.0
340,147,-147.0
341,147,-147.0
342,148,-148.0
343,89,-89.0
344,152,-152.0
345,148,-148.0
346,143,-143.0
347,149,-149.0
348,86,-86.0
349,147,-147.0
350,158,-158.0
