episodes,steps,rewards
0,90,-143.57627454160792
1,134,-232.39375631649932
2,72,-206.31236759361968
3,69,-166.04248189882313
4,121,-65.9094917393637
5,119,-314.8129058532719
6,61,-105.56846765907966
7,69,-223.19190156838675
8,84,-277.12919032705406
9,61,-104.70299293428046
10,133,-266.45263085059
11,112,-330.57436311421907
12,82,-109.76606871573333
13,113,-327.02942062323604
14,125,-70.58613050387521
15,87,-249.1100711011088
16,85,-380.38940201545165
17,412,-142.06735072769033
18,126,-76.45370757284213
19,105,-28.081956197943157
20,411,171.4924376048374
21,452,19.904158723944576
22,298,-245.4686449107644
23,94,-47.921819535657264
24,233,5.22016623733829
25,320,-297.4081618595138
26,321,-123.02669152800848
27,194,-71.2140935020985
28,953,-576.887010930566
29,1000,-87.77556410063863
30,1000,-128.2390938782497
31,1000,-121.99442720313468
32,88,4.778328017038788
33,1000,-172.90576781414336
34,89,7.229172623998693
35,101,41.02333484783023
36,1000,-71.32305062070982
37,322,-280.2971832192011
38,352,178.90206015798321
39,290,-116.74293925871143
40,1000,-53.0960640671213
41,316,182.2006112000695
42,384,-124.95452506559553
43,94,17.725124275600535
44,1000,-43.37040140062238
45,64,15.333683020534735
46,1000,-59.16769164441951
47,208,212.22241380984246
48,1000,31.850713439312862
49,72,-45.52957151756992
50,79,-73.57597253105709
51,100,-57.16708496949117
52,91,53.604731117476035
53,132,73.2113506132394
54,1000,-40.71405874386429
55,1000,-12.638507311786466
56,99,-93.88191026569527
57,1000,-33.68928025315255
58,1000,-30.08471646019151
59,1000,-17.32707598913838
60,1000,-46.58931647031208
61,1000,-26.92015145728707
62,1000,-50.913850227711414
63,1000,-97.75505424310803
64,1000,-69.2796895691344
65,497,214.92198979450316
66,510,-251.77584720502682
67,1000,-47.50669905599161
68,1000,-43.192457657404944
69,1000,26.31658959352996
70,716,-35.80024887021072
71,111,5.9631033913633615
72,433,191.82787990772596
73,61,-234.21499771819205
74,118,-129.78281592346963
75,137,5.948822578454255
76,808,-227.8782477846016
77,525,211.47085877840016
78,98,-19.18431190667819
79,133,5.349154436964156
80,139,4.267484447116658
81,554,168.7526200902595
82,236,-0.010809275062712231
83,363,-136.51951392333535
84,560,197.357311795655
85,712,176.64916368645328
86,254,185.69023588394808
87,658,177.11932704308208
88,369,198.40879728292384
89,524,192.6683245082103
90,437,147.2687108786988
91,214,193.12389206016587
92,112,-37.82963999167889
93,993,128.39330584242202
94,854,143.80098432990906
95,470,-67.03832182734331
96,467,171.5168673354462
97,615,192.8165510950724
98,420,-46.6404366867699
99,527,180.27173436009573
100,194,261.902093589476
