episodes,steps,rewards
0,200,-200.0
1,200,-200.0
2,200,-200.0
3,200,-200.0
4,200,-200.0
5,200,-200.0
6,200,-200.0
7,200,-200.0
8,200,-200.0
9,200,-200.0
10,200,-200.0
11,200,-200.0
12,200,-200.0
13,200,-200.0
14,200,-200.0
15,200,-200.0
16,200,-200.0
17,200,-200.0
18,200,-200.0
19,200,-200.0
20,200,-200.0
21,200,-200.0
22,200,-200.0
23,200,-200.0
24,200,-200.0
25,200,-200.0
26,200,-200.0
27,200,-200.0
28,200,-200.0
29,200,-200.0
30,200,-200.0
31,200,-200.0
32,200,-200.0
33,200,-200.0
34,200,-200.0
35,200,-200.0
36,200,-200.0
37,200,-200.0
38,164,-164.0
39,200,-200.0
40,200,-200.0
41,169,-169.0
42,200,-200.0
43,200,-200.0
44,200,-200.0
45,200,-200.0
46,200,-200.0
47,200,-200.0
48,192,-192.0
49,137,-137.0
50,200,-200.0
51,200,-200.0
52,200,-200.0
53,200,-200.0
54,200,-200.0
55,151,-151.0
56,200,-200.0
57,200,-200.0
58,200,-200.0
59,174,-174.0
60,200,-200.0
61,200,-200.0
62,176,-176.0
63,200,-200.0
64,200,-200.0
65,170,-170.0
66,200,-200.0
67,162,-162.0
68,200,-200.0
69,174,-174.0
70,200,-200.0
71,200,-200.0
72,200,-200.0
73,200,-200.0
74,200,-200.0
75,200,-200.0
76,200,-200.0
77,200,-200.0
78,200,-200.0
79,200,-200.0
80,200,-200.0
81,200,-200.0
82,200,-200.0
83,90,-90.0
84,200,-200.0
85,110,-110.0
86,200,-200.0
87,141,-141.0
88,200,-200.0
89,200,-200.0
90,200,-200.0
91,200,-200.0
92,200,-200.0
93,181,-181.0
94,200,-200.0
95,200,-200.0
96,200,-200.0
97,200,-200.0
98,200,-200.0
99,200,-200.0
100,200,-200.0
101,181,-181.0
102,200,-200.0
103,200,-200.0
104,190,-190.0
105,200,-200.0
106,200,-200.0
107,200,-200.0
108,200,-200.0
109,200,-200.0
110,173,-173.0
111,200,-200.0
112,200,-200.0
113,200,-200.0
114,200,-200.0
115,162,-162.0
116,200,-200.0
117,200,-200.0
118,120,-120.0
119,200,-200.0
120,188,-188.0
121,200,-200.0
122,200,-200.0
123,132,-132.0
124,146,-146.0
125,200,-200.0
126,183,-183.0
127,110,-110.0
128,187,-187.0
129,200,-200.0
130,159,-159.0
131,200,-200.0
132,164,-164.0
133,200,-200.0
134,183,-183.0
135,200,-200.0
136,200,-200.0
137,200,-200.0
138,200,-200.0
139,154,-154.0
140,200,-200.0
141,200,-200.0
142,192,-192.0
143,191,-191.0
144,177,-177.0
145,151,-151.0
146,200,-200.0
147,114,-114.0
148,200,-200.0
149,162,-162.0
150,199,-199.0
151,200,-200.0
152,143,-143.0
153,143,-143.0
154,144,-144.0
155,113,-113.0
156,123,-123.0
157,147,-147.0
158,134,-134.0
159,161,-161.0
160,155,-155.0
161,192,-192.0
162,158,-158.0
163,167,-167.0
164,200,-200.0
165,165,-165.0
166,151,-151.0
167,200,-200.0
168,86,-86.0
169,153,-153.0
170,110,-110.0
171,160,-160.0
172,95,-95.0
173,172,-172.0
174,186,-186.0
175,168,-168.0
176,175,-175.0
177,200,-200.0
178,156,-156.0
179,155,-155.0
180,148,-148.0
181,166,-166.0
182,152,-152.0
183,167,-167.0
184,144,-144.0
185,92,-92.0
186,175,-175.0
187,169,-169.0
188,187,-187.0
189,200,-200.0
190,155,-155.0
191,165,-165.0
192,93,-93.0
193,184,-184.0
194,166,-166.0
195,181,-181.0
196,176,-176.0
197,200,-200.0
198,177,-177.0
199,199,-199.0
200,91,-91.0
201,179,-179.0
202,200,-200.0
203,197,-197.0
204,200,-200.0
205,167,-167.0
206,151,-151.0
207,200,-200.0
208,147,-147.0
209,144,-144.0
210,200,-200.0
211,165,-165.0
212,167,-167.0
213,166,-166.0
214,181,-181.0
215,200,-200.0
216,163,-163.0
217,154,-154.0
218,200,-200.0
219,200,-200.0
220,200,-200.0
221,172,-172.0
222,138,-138.0
223,145,-145.0
224,200,-200.0
225,149,-149.0
226,168,-168.0
227,200,-200.0
228,170,-170.0
229,120,-120.0
230,149,-149.0
231,200,-200.0
232,200,-200.0
233,159,-159.0
234,138,-138.0
235,150,-150.0
236,147,-147.0
237,178,-178.0
238,160,-160.0
239,182,-182.0
240,158,-158.0
241,168,-168.0
242,159,-159.0
243,155,-155.0
244,140,-140.0
245,165,-165.0
246,88,-88.0
247,167,-167.0
248,200,-200.0
249,200,-200.0
250,200,-200.0
251,180,-180.0
252,200,-200.0
253,200,-200.0
254,137,-137.0
255,131,-131.0
256,154,-154.0
257,87,-87.0
258,111,-111.0
259,149,-149.0
260,144,-144.0
261,148,-148.0
262,154,-154.0
263,104,-104.0
264,141,-141.0
265,141,-141.0
266,155,-155.0
267,138,-138.0
268,135,-135.0
269,91,-91.0
270,158,-158.0
271,139,-139.0
272,108,-108.0
273,107,-107.0
274,147,-147.0
275,150,-150.0
276,150,-150.0
277,166,-166.0
278,134,-134.0
279,200,-200.0
280,141,-141.0
281,100,-100.0
282,145,-145.0
283,162,-162.0
284,174,-174.0
285,142,-142.0
286,146,-146.0
287,200,-200.0
288,146,-146.0
289,147,-147.0
290,98,-98.0
291,153,-153.0
292,140,-140.0
293,87,-87.0
294,89,-89.0
295,93,-93.0
296,162,-162.0
297,145,-145.0
298,144,-144.0
299,200,-200.0
300,155,-155.0
301,152,-152.0
302,145,-145.0
303,150,-150.0
304,200,-200.0
305,157,-157.0
306,145,-145.0
307,147,-147.0
308,151,-151.0
309,147,-147.0
310,98,-98.0
311,149,-149.0
312,172,-172.0
313,200,-200.0
314,142,-142.0
315,149,-149.0
316,150,-150.0
317,146,-146.0
318,142,-142.0
319,147,-147.0
320,148,-148.0
321,144,-144.0
322,147,-147.0
323,200,-200.0
324,200,-200.0
325,153,-153.0
326,143,-143.0
327,111,-111.0
328,142,-142.0
329,144,-144.0
330,143,-143.0
331,200,-200.0
332,85,-85.0
333,146,-146.0
334,98,-98.0
335,200,-200.0
336,96,-96.0
337,149,-149.0
338,87,-87.0
339,200,-200.0
340,85,-85.0
341,200,-200.0
342,146,-146.0
343,123,-123.0
344,174,-174.0
345,102,-102.0
346,200,-200.0
347,197,-197.0
348,143,-143.0
349,158,-158.0
350,86,-86.0
351,154,-154.0
352,88,-88.0
353,200,-200.0
354,110,-110.0
355,87,-87.0
356,144,-144.0
357,200,-200.0
358,200,-200.0
359,86,-86.0
360,200,-200.0
361,147,-147.0
362,145,-145.0
363,176,-176.0
364,103,-103.0
365,147,-147.0
366,85,-85.0
367,93,-93.0
368,142,-142.0
369,178,-178.0
370,194,-194.0
371,190,-190.0
372,148,-148.0
373,90,-90.0
374,200,-200.0
375,149,-149.0
376,149,-149.0
377,149,-149.0
378,143,-143.0
379,146,-146.0
380,144,-144.0
381,123,-123.0
382,200,-200.0
383,200,-200.0
384,146,-146.0
385,200,-200.0
386,155,-155.0
387,88,-88.0
388,146,-146.0
389,155,-155.0
390,155,-155.0
391,200,-200.0
392,89,-89.0
393,161,-161.0
394,172,-172.0
395,92,-92.0
396,154,-154.0
397,95,-95.0
398,87,-87.0
399,144,-144.0
400,143,-143.0
401,148,-148.0
402,200,-200.0
403,155,-155.0
404,148,-148.0
405,164,-164.0
406,147,-147.0
407,149,-149.0
408,150,-150.0
409,153,-153.0
410,154,-154.0
411,114,-114.0
412,149,-149.0
413,200,-200.0
414,94,-94.0
415,158,-158.0
416,154,-154.0
417,152,-152.0
418,157,-157.0
419,149,-149.0
420,88,-88.0
421,152,-152.0
422,143,-143.0
423,200,-200.0
424,157,-157.0
425,86,-86.0
426,143,-143.0
427,105,-105.0
428,104,-104.0
429,86,-86.0
430,154,-154.0
431,173,-173.0
432,90,-90.0
433,200,-200.0
434,146,-146.0
435,94,-94.0
436,151,-151.0
437,144,-144.0
438,155,-155.0
439,150,-150.0
440,148,-148.0
441,88,-88.0
442,84,-84.0
443,151,-151.0
444,95,-95.0
445,154,-154.0
446,149,-149.0
447,90,-90.0
448,156,-156.0
449,144,-144.0
450,154,-154.0
451,149,-149.0
452,147,-147.0
453,147,-147.0
454,148,-148.0
455,150,-150.0
456,96,-96.0
457,200,-200.0
458,148,-148.0
459,148,-148.0
460,95,-95.0
461,95,-95.0
462,149,-149.0
463,144,-144.0
464,148,-148.0
465,145,-145.0
466,145,-145.0
467,96,-96.0
468,150,-150.0
469,95,-95.0
470,147,-147.0
471,91,-91.0
472,149,-149.0
473,146,-146.0
474,185,-185.0
475,85,-85.0
476,145,-145.0
477,151,-151.0
478,200,-200.0
479,105,-105.0
480,145,-145.0
481,162,-162.0
482,187,-187.0
483,144,-144.0
484,142,-142.0
485,86,-86.0
486,96,-96.0
487,160,-160.0
488,89,-89.0
489,148,-148.0
490,190,-190.0
491,148,-148.0
492,141,-141.0
493,149,-149.0
494,189,-189.0
495,95,-95.0
496,168,-168.0
497,148,-148.0
498,91,-91.0
499,172,-172.0
500,146,-146.0
501,154,-154.0
502,93,-93.0
503,87,-87.0
504,156,-156.0
505,153,-153.0
506,89,-89.0
507,100,-100.0
508,153,-153.0
509,150,-150.0
510,85,-85.0
511,108,-108.0
512,147,-147.0
513,163,-163.0
514,153,-153.0
515,156,-156.0
516,153,-153.0
517,164,-164.0
518,180,-180.0
519,108,-108.0
520,155,-155.0
521,159,-159.0
522,108,-108.0
523,200,-200.0
524,157,-157.0
525,92,-92.0
526,150,-150.0
527,86,-86.0
528,88,-88.0
529,160,-160.0
530,147,-147.0
531,155,-155.0
532,169,-169.0
533,161,-161.0
534,200,-200.0
535,150,-150.0
536,86,-86.0
537,146,-146.0
538,152,-152.0
539,149,-149.0
540,87,-87.0
541,200,-200.0
542,144,-144.0
543,159,-159.0
544,149,-149.0
545,98,-98.0
546,141,-141.0
547,88,-88.0
548,158,-158.0
549,144,-144.0
550,154,-154.0
551,92,-92.0
552,144,-144.0
553,149,-149.0
554,87,-87.0
555,86,-86.0
556,143,-143.0
557,127,-127.0
558,143,-143.0
559,85,-85.0
560,90,-90.0
561,179,-179.0
562,199,-199.0
563,145,-145.0
564,148,-148.0
565,155,-155.0
566,156,-156.0
567,86,-86.0
568,146,-146.0
569,158,-158.0
570,156,-156.0
571,200,-200.0
572,85,-85.0
573,143,-143.0
574,84,-84.0
575,146,-146.0
576,89,-89.0
577,139,-139.0
578,144,-144.0
579,89,-89.0
580,150,-150.0
581,146,-146.0
582,146,-146.0
583,104,-104.0
584,93,-93.0
585,85,-85.0
586,150,-150.0
587,99,-99.0
588,159,-159.0
589,152,-152.0
590,141,-141.0
591,148,-148.0
592,154,-154.0
593,89,-89.0
594,105,-105.0
595,157,-157.0
596,153,-153.0
597,166,-166.0
598,200,-200.0
599,164,-164.0
600,144,-144.0
601,153,-153.0
602,110,-110.0
603,155,-155.0
604,160,-160.0
605,125,-125.0
606,87,-87.0
607,100,-100.0
608,144,-144.0
609,88,-88.0
610,156,-156.0
611,152,-152.0
612,93,-93.0
613,83,-83.0
614,154,-154.0
615,149,-149.0
616,88,-88.0
617,150,-150.0
618,152,-152.0
619,150,-150.0
620,145,-145.0
621,148,-148.0
622,125,-125.0
623,137,-137.0
624,87,-87.0
625,155,-155.0
626,103,-103.0
627,100,-100.0
628,135,-135.0
629,144,-144.0
630,151,-151.0
631,147,-147.0
632,95,-95.0
633,144,-144.0
634,88,-88.0
635,85,-85.0
636,150,-150.0
637,160,-160.0
638,104,-104.0
639,156,-156.0
640,148,-148.0
641,140,-140.0
642,144,-144.0
643,142,-142.0
644,148,-148.0
645,97,-97.0
646,161,-161.0
647,92,-92.0
648,86,-86.0
649,84,-84.0
650,150,-150.0
651,152,-152.0
652,144,-144.0
653,94,-94.0
654,152,-152.0
655,187,-187.0
656,157,-157.0
657,144,-144.0
658,150,-150.0
659,102,-102.0
660,143,-143.0
661,125,-125.0
662,138,-138.0
663,138,-138.0
664,86,-86.0
665,146,-146.0
666,148,-148.0
667,152,-152.0
668,152,-152.0
669,163,-163.0
670,146,-146.0
671,155,-155.0
672,145,-145.0
673,147,-147.0
674,164,-164.0
675,145,-145.0
676,143,-143.0
677,91,-91.0
678,147,-147.0
679,154,-154.0
680,98,-98.0
681,100,-100.0
682,139,-139.0
683,151,-151.0
684,158,-158.0
685,107,-107.0
686,141,-141.0
687,98,-98.0
688,88,-88.0
689,150,-150.0
690,146,-146.0
691,149,-149.0
692,135,-135.0
693,95,-95.0
694,141,-141.0
695,154,-154.0
696,146,-146.0
697,150,-150.0
698,144,-144.0
699,87,-87.0
700,152,-152.0
701,144,-144.0
702,143,-143.0
703,155,-155.0
704,146,-146.0
705,151,-151.0
706,145,-145.0
707,161,-161.0
708,146,-146.0
709,88,-88.0
710,89,-89.0
711,89,-89.0
712,149,-149.0
713,87,-87.0
714,200,-200.0
715,151,-151.0
716,91,-91.0
717,200,-200.0
718,151,-151.0
719,148,-148.0
720,147,-147.0
721,148,-148.0
722,150,-150.0
723,87,-87.0
724,90,-90.0
725,90,-90.0
726,139,-139.0
727,101,-101.0
728,141,-141.0
729,200,-200.0
730,141,-141.0
731,138,-138.0
732,144,-144.0
733,139,-139.0
734,143,-143.0
735,123,-123.0
736,141,-141.0
737,100,-100.0
738,144,-144.0
739,200,-200.0
740,165,-165.0
741,141,-141.0
742,84,-84.0
743,145,-145.0
744,83,-83.0
745,137,-137.0
746,143,-143.0
747,146,-146.0
748,85,-85.0
749,142,-142.0
750,105,-105.0
751,91,-91.0
752,151,-151.0
753,141,-141.0
754,149,-149.0
755,143,-143.0
756,142,-142.0
757,125,-125.0
758,138,-138.0
759,92,-92.0
760,144,-144.0
761,195,-195.0
762,141,-141.0
763,135,-135.0
764,154,-154.0
765,85,-85.0
766,92,-92.0
767,85,-85.0
768,137,-137.0
769,139,-139.0
770,133,-133.0
771,98,-98.0
772,85,-85.0
773,157,-157.0
774,142,-142.0
775,141,-141.0
776,151,-151.0
777,191,-191.0
778,104,-104.0
779,137,-137.0
780,140,-140.0
781,145,-145.0
782,158,-158.0
783,113,-113.0
784,149,-149.0
785,140,-140.0
786,141,-141.0
787,193,-193.0
788,86,-86.0
789,159,-159.0
790,193,-193.0
791,200,-200.0
792,135,-135.0
793,139,-139.0
794,140,-140.0
795,91,-91.0
796,186,-186.0
797,143,-143.0
798,142,-142.0
799,86,-86.0
800,140,-140.0
801,140,-140.0
802,140,-140.0
803,140,-140.0
804,200,-200.0
805,144,-144.0
806,136,-136.0
807,138,-138.0
808,140,-140.0
809,157,-157.0
810,138,-138.0
811,147,-147.0
812,200,-200.0
813,140,-140.0
814,146,-146.0
815,141,-141.0
816,143,-143.0
817,144,-144.0
818,141,-141.0
819,143,-143.0
820,143,-143.0
821,157,-157.0
822,141,-141.0
823,145,-145.0
824,90,-90.0
825,147,-147.0
826,144,-144.0
827,149,-149.0
828,164,-164.0
829,149,-149.0
830,141,-141.0
831,144,-144.0
832,143,-143.0
833,167,-167.0
834,99,-99.0
835,143,-143.0
836,98,-98.0
837,151,-151.0
838,163,-163.0
839,139,-139.0
840,158,-158.0
841,160,-160.0
842,112,-112.0
843,142,-142.0
844,108,-108.0
845,113,-113.0
846,144,-144.0
847,187,-187.0
848,148,-148.0
849,156,-156.0
850,169,-169.0
851,139,-139.0
852,150,-150.0
853,153,-153.0
854,147,-147.0
855,155,-155.0
856,147,-147.0
857,143,-143.0
858,149,-149.0
859,86,-86.0
860,134,-134.0
861,141,-141.0
862,143,-143.0
863,141,-141.0
864,144,-144.0
865,138,-138.0
866,142,-142.0
867,100,-100.0
868,142,-142.0
869,145,-145.0
870,142,-142.0
871,149,-149.0
872,149,-149.0
873,142,-142.0
874,142,-142.0
875,151,-151.0
876,146,-146.0
877,155,-155.0
878,135,-135.0
879,86,-86.0
880,142,-142.0
881,97,-97.0
882,150,-150.0
883,147,-147.0
884,144,-144.0
885,92,-92.0
886,104,-104.0
887,167,-167.0
888,148,-148.0
889,94,-94.0
890,148,-148.0
891,156,-156.0
892,142,-142.0
893,148,-148.0
894,143,-143.0
895,154,-154.0
896,145,-145.0
897,145,-145.0
898,142,-142.0
899,144,-144.0
900,95,-95.0
901,83,-83.0
902,143,-143.0
903,98,-98.0
904,144,-144.0
905,92,-92.0
906,143,-143.0
907,145,-145.0
908,106,-106.0
909,161,-161.0
910,88,-88.0
911,99,-99.0
912,163,-163.0
913,88,-88.0
914,85,-85.0
915,143,-143.0
916,139,-139.0
917,142,-142.0
918,177,-177.0
919,108,-108.0
920,145,-145.0
921,140,-140.0
922,86,-86.0
923,98,-98.0
924,132,-132.0
925,90,-90.0
926,125,-125.0
927,89,-89.0
928,150,-150.0
929,98,-98.0
930,91,-91.0
931,116,-116.0
932,95,-95.0
933,130,-130.0
934,147,-147.0
935,87,-87.0
936,88,-88.0
937,105,-105.0
938,153,-153.0
939,91,-91.0
940,94,-94.0
941,104,-104.0
942,150,-150.0
943,114,-114.0
944,147,-147.0
945,156,-156.0
946,150,-150.0
947,155,-155.0
948,89,-89.0
949,138,-138.0
950,135,-135.0
951,176,-176.0
952,138,-138.0
953,139,-139.0
954,133,-133.0
955,140,-140.0
956,135,-135.0
957,99,-99.0
958,160,-160.0
959,151,-151.0
960,161,-161.0
961,163,-163.0
962,154,-154.0
963,187,-187.0
964,97,-97.0
965,149,-149.0
966,151,-151.0
967,174,-174.0
968,165,-165.0
969,173,-173.0
970,94,-94.0
971,149,-149.0
972,160,-160.0
973,154,-154.0
974,148,-148.0
975,152,-152.0
976,95,-95.0
977,161,-161.0
978,150,-150.0
979,128,-128.0
980,154,-154.0
981,110,-110.0
982,174,-174.0
983,169,-169.0
984,154,-154.0
985,138,-138.0
986,101,-101.0
987,117,-117.0
988,156,-156.0
989,90,-90.0
990,103,-103.0
991,150,-150.0
992,166,-166.0
993,145,-145.0
994,141,-141.0
995,140,-140.0
996,93,-93.0
997,84,-84.0
998,156,-156.0
999,150,-150.0
1000,148,-148.0
1001,143,-143.0
1002,173,-173.0
1003,146,-146.0
1004,146,-146.0
1005,145,-145.0
1006,200,-200.0
1007,147,-147.0
1008,143,-143.0
1009,143,-143.0
1010,158,-158.0
1011,99,-99.0
1012,149,-149.0
1013,145,-145.0
1014,155,-155.0
1015,149,-149.0
1016,149,-149.0
1017,151,-151.0
1018,157,-157.0
1019,89,-89.0
1020,161,-161.0
1021,115,-115.0
1022,106,-106.0
1023,150,-150.0
1024,95,-95.0
1025,200,-200.0
1026,152,-152.0
1027,102,-102.0
1028,99,-99.0
1029,92,-92.0
1030,129,-129.0
1031,169,-169.0
1032,84,-84.0
1033,143,-143.0
1034,85,-85.0
1035,158,-158.0
1036,145,-145.0
1037,150,-150.0
1038,167,-167.0
1039,152,-152.0
1040,87,-87.0
1041,103,-103.0
1042,200,-200.0
1043,142,-142.0
1044,146,-146.0
1045,144,-144.0
1046,146,-146.0
1047,152,-152.0
1048,85,-85.0
1049,146,-146.0
1050,142,-142.0
1051,152,-152.0
1052,103,-103.0
1053,145,-145.0
1054,146,-146.0
1055,148,-148.0
1056,153,-153.0
1057,145,-145.0
1058,150,-150.0
1059,151,-151.0
1060,85,-85.0
1061,148,-148.0
1062,140,-140.0
1063,147,-147.0
1064,93,-93.0
1065,142,-142.0
1066,142,-142.0
1067,109,-109.0
1068,143,-143.0
1069,141,-141.0
1070,83,-83.0
1071,143,-143.0
1072,146,-146.0
1073,148,-148.0
1074,88,-88.0
1075,142,-142.0
1076,165,-165.0
1077,88,-88.0
1078,143,-143.0
1079,156,-156.0
1080,145,-145.0
1081,143,-143.0
1082,85,-85.0
1083,147,-147.0
1084,149,-149.0
1085,153,-153.0
1086,102,-102.0
1087,95,-95.0
1088,145,-145.0
1089,148,-148.0
1090,91,-91.0
1091,90,-90.0
1092,143,-143.0
1093,167,-167.0
1094,151,-151.0
1095,147,-147.0
1096,89,-89.0
1097,88,-88.0
1098,143,-143.0
1099,152,-152.0
1100,143,-143.0
1101,176,-176.0
1102,87,-87.0
1103,183,-183.0
1104,144,-144.0
1105,153,-153.0
1106,91,-91.0
1107,111,-111.0
1108,86,-86.0
1109,149,-149.0
1110,85,-85.0
1111,145,-145.0
1112,159,-159.0
1113,95,-95.0
1114,149,-149.0
1115,106,-106.0
1116,159,-159.0
1117,150,-150.0
1118,173,-173.0
1119,148,-148.0
1120,150,-150.0
1121,200,-200.0
1122,163,-163.0
1123,150,-150.0
1124,105,-105.0
1125,170,-170.0
1126,147,-147.0
1127,151,-151.0
1128,87,-87.0
1129,169,-169.0
1130,149,-149.0
1131,150,-150.0
1132,87,-87.0
1133,104,-104.0
1134,98,-98.0
1135,87,-87.0
1136,153,-153.0
1137,200,-200.0
1138,142,-142.0
1139,149,-149.0
1140,134,-134.0
1141,142,-142.0
1142,135,-135.0
1143,138,-138.0
1144,90,-90.0
1145,86,-86.0
1146,146,-146.0
1147,94,-94.0
1148,165,-165.0
1149,157,-157.0
1150,85,-85.0
1151,145,-145.0
1152,140,-140.0
1153,138,-138.0
1154,133,-133.0
1155,146,-146.0
1156,156,-156.0
1157,151,-151.0
1158,143,-143.0
1159,96,-96.0
1160,85,-85.0
1161,146,-146.0
1162,148,-148.0
1163,89,-89.0
1164,163,-163.0
1165,86,-86.0
1166,149,-149.0
1167,150,-150.0
1168,146,-146.0
1169,142,-142.0
1170,151,-151.0
1171,144,-144.0
1172,95,-95.0
1173,150,-150.0
1174,85,-85.0
1175,99,-99.0
1176,155,-155.0
1177,145,-145.0
1178,142,-142.0
1179,147,-147.0
1180,145,-145.0
1181,150,-150.0
1182,156,-156.0
1183,141,-141.0
1184,143,-143.0
1185,87,-87.0
1186,92,-92.0
1187,157,-157.0
1188,138,-138.0
1189,139,-139.0
1190,132,-132.0
1191,86,-86.0
1192,138,-138.0
1193,149,-149.0
1194,94,-94.0
1195,144,-144.0
1196,97,-97.0
1197,137,-137.0
1198,103,-103.0
1199,143,-143.0
1200,149,-149.0
1201,84,-84.0
1202,148,-148.0
1203,108,-108.0
1204,89,-89.0
1205,91,-91.0
1206,159,-159.0
1207,96,-96.0
1208,150,-150.0
1209,146,-146.0
1210,143,-143.0
1211,146,-146.0
1212,157,-157.0
1213,109,-109.0
1214,140,-140.0
1215,152,-152.0
1216,152,-152.0
1217,88,-88.0
1218,146,-146.0
1219,144,-144.0
1220,85,-85.0
1221,112,-112.0
1222,142,-142.0
1223,87,-87.0
1224,176,-176.0
1225,106,-106.0
1226,95,-95.0
1227,96,-96.0
1228,96,-96.0
1229,143,-143.0
1230,85,-85.0
1231,97,-97.0
1232,94,-94.0
1233,105,-105.0
1234,105,-105.0
1235,85,-85.0
1236,88,-88.0
1237,140,-140.0
1238,157,-157.0
1239,139,-139.0
1240,107,-107.0
1241,130,-130.0
1242,113,-113.0
1243,114,-114.0
1244,105,-105.0
1245,166,-166.0
1246,85,-85.0
1247,117,-117.0
1248,142,-142.0
1249,88,-88.0
1250,154,-154.0
1251,93,-93.0
1252,144,-144.0
1253,107,-107.0
1254,141,-141.0
1255,142,-142.0
1256,165,-165.0
1257,104,-104.0
1258,131,-131.0
1259,87,-87.0
1260,106,-106.0
1261,88,-88.0
1262,151,-151.0
1263,141,-141.0
1264,106,-106.0
1265,86,-86.0
1266,98,-98.0
1267,107,-107.0
1268,141,-141.0
1269,115,-115.0
1270,91,-91.0
1271,142,-142.0
1272,88,-88.0
1273,162,-162.0
1274,107,-107.0
1275,86,-86.0
1276,109,-109.0
1277,155,-155.0
1278,105,-105.0
1279,109,-109.0
1280,91,-91.0
1281,110,-110.0
1282,159,-159.0
1283,166,-166.0
1284,87,-87.0
1285,153,-153.0
1286,142,-142.0
1287,86,-86.0
1288,155,-155.0
1289,162,-162.0
1290,142,-142.0
1291,146,-146.0
1292,88,-88.0
1293,151,-151.0
1294,115,-115.0
1295,84,-84.0
1296,116,-116.0
1297,145,-145.0
1298,162,-162.0
1299,143,-143.0
1300,93,-93.0
1301,200,-200.0
1302,87,-87.0
1303,179,-179.0
1304,151,-151.0
1305,151,-151.0
1306,88,-88.0
1307,200,-200.0
1308,153,-153.0
1309,148,-148.0
1310,183,-183.0
1311,148,-148.0
1312,157,-157.0
1313,200,-200.0
1314,173,-173.0
1315,151,-151.0
1316,200,-200.0
1317,154,-154.0
1318,154,-154.0
1319,151,-151.0
1320,200,-200.0
1321,163,-163.0
1322,200,-200.0
1323,149,-149.0
1324,128,-128.0
1325,148,-148.0
1326,116,-116.0
1327,162,-162.0
1328,84,-84.0
1329,152,-152.0
1330,136,-136.0
1331,181,-181.0
1332,89,-89.0
1333,84,-84.0
1334,120,-120.0
1335,115,-115.0
1336,131,-131.0
1337,95,-95.0
1338,160,-160.0
1339,123,-123.0
1340,191,-191.0
1341,84,-84.0
1342,108,-108.0
1343,102,-102.0
1344,134,-134.0
1345,136,-136.0
1346,169,-169.0
1347,160,-160.0
1348,124,-124.0
1349,132,-132.0
1350,159,-159.0
1351,162,-162.0
1352,153,-153.0
1353,128,-128.0
1354,140,-140.0
1355,151,-151.0
1356,102,-102.0
1357,119,-119.0
1358,95,-95.0
1359,97,-97.0
1360,111,-111.0
1361,161,-161.0
1362,86,-86.0
1363,88,-88.0
1364,125,-125.0
1365,134,-134.0
1366,150,-150.0
1367,125,-125.0
1368,128,-128.0
1369,91,-91.0
1370,162,-162.0
1371,84,-84.0
1372,159,-159.0
1373,191,-191.0
1374,125,-125.0
1375,126,-126.0
1376,151,-151.0
1377,134,-134.0
1378,90,-90.0
1379,146,-146.0
1380,167,-167.0
1381,125,-125.0
1382,150,-150.0
1383,97,-97.0
1384,84,-84.0
1385,89,-89.0
1386,181,-181.0
1387,84,-84.0
1388,179,-179.0
1389,151,-151.0
1390,159,-159.0
1391,97,-97.0
1392,151,-151.0
1393,149,-149.0
1394,147,-147.0
1395,148,-148.0
1396,146,-146.0
1397,162,-162.0
1398,147,-147.0
1399,145,-145.0
1400,84,-84.0
1401,95,-95.0
1402,146,-146.0
1403,93,-93.0
1404,155,-155.0
1405,133,-133.0
1406,84,-84.0
1407,176,-176.0
1408,165,-165.0
1409,145,-145.0
1410,150,-150.0
1411,141,-141.0
1412,143,-143.0
1413,157,-157.0
1414,167,-167.0
1415,116,-116.0
1416,154,-154.0
1417,140,-140.0
1418,145,-145.0
1419,146,-146.0
1420,142,-142.0
1421,140,-140.0
1422,156,-156.0
1423,154,-154.0
1424,119,-119.0
1425,144,-144.0
1426,92,-92.0
1427,87,-87.0
1428,89,-89.0
1429,151,-151.0
1430,144,-144.0
1431,87,-87.0
1432,148,-148.0
1433,92,-92.0
1434,94,-94.0
1435,93,-93.0
1436,144,-144.0
1437,176,-176.0
1438,167,-167.0
1439,186,-186.0
1440,85,-85.0
1441,175,-175.0
1442,146,-146.0
1443,152,-152.0
1444,146,-146.0
1445,91,-91.0
1446,175,-175.0
1447,200,-200.0
1448,145,-145.0
1449,141,-141.0
1450,149,-149.0
1451,153,-153.0
1452,85,-85.0
1453,156,-156.0
1454,146,-146.0
1455,153,-153.0
1456,143,-143.0
1457,93,-93.0
1458,147,-147.0
1459,84,-84.0
1460,145,-145.0
1461,147,-147.0
1462,167,-167.0
1463,144,-144.0
1464,165,-165.0
1465,85,-85.0
1466,161,-161.0
1467,91,-91.0
1468,87,-87.0
1469,83,-83.0
1470,152,-152.0
1471,158,-158.0
1472,146,-146.0
1473,116,-116.0
1474,157,-157.0
1475,147,-147.0
1476,91,-91.0
1477,141,-141.0
1478,87,-87.0
1479,140,-140.0
1480,139,-139.0
1481,161,-161.0
1482,100,-100.0
1483,84,-84.0
1484,150,-150.0
1485,142,-142.0
1486,146,-146.0
1487,88,-88.0
1488,90,-90.0
1489,141,-141.0
1490,144,-144.0
1491,109,-109.0
1492,158,-158.0
1493,141,-141.0
1494,150,-150.0
1495,143,-143.0
1496,94,-94.0
1497,151,-151.0
1498,146,-146.0
1499,150,-150.0
1500,166,-166.0
1501,166,-166.0
1502,144,-144.0
1503,145,-145.0
1504,95,-95.0
1505,91,-91.0
1506,158,-158.0
1507,142,-142.0
1508,95,-95.0
1509,83,-83.0
1510,145,-145.0
1511,157,-157.0
1512,196,-196.0
1513,179,-179.0
1514,108,-108.0
1515,146,-146.0
1516,145,-145.0
1517,143,-143.0
1518,102,-102.0
1519,109,-109.0
1520,86,-86.0
1521,163,-163.0
1522,149,-149.0
1523,113,-113.0
1524,142,-142.0
1525,186,-186.0
1526,157,-157.0
1527,89,-89.0
1528,140,-140.0
1529,200,-200.0
1530,148,-148.0
1531,180,-180.0
1532,199,-199.0
1533,199,-199.0
1534,158,-158.0
1535,145,-145.0
1536,84,-84.0
1537,147,-147.0
1538,186,-186.0
1539,175,-175.0
1540,136,-136.0
1541,143,-143.0
1542,144,-144.0
1543,141,-141.0
1544,162,-162.0
1545,146,-146.0
1546,145,-145.0
1547,148,-148.0
1548,152,-152.0
1549,145,-145.0
1550,150,-150.0
1551,151,-151.0
1552,140,-140.0
1553,140,-140.0
1554,89,-89.0
1555,141,-141.0
1556,196,-196.0
1557,91,-91.0
1558,183,-183.0
1559,146,-146.0
1560,92,-92.0
1561,86,-86.0
1562,148,-148.0
1563,150,-150.0
1564,94,-94.0
1565,87,-87.0
1566,148,-148.0
1567,144,-144.0
1568,144,-144.0
1569,88,-88.0
1570,143,-143.0
1571,169,-169.0
1572,112,-112.0
1573,156,-156.0
1574,146,-146.0
1575,168,-168.0
1576,104,-104.0
1577,135,-135.0
1578,134,-134.0
1579,142,-142.0
1580,152,-152.0
1581,142,-142.0
1582,186,-186.0
1583,142,-142.0
1584,86,-86.0
1585,95,-95.0
1586,113,-113.0
1587,96,-96.0
1588,154,-154.0
1589,137,-137.0
1590,106,-106.0
1591,95,-95.0
1592,88,-88.0
1593,94,-94.0
1594,86,-86.0
1595,144,-144.0
1596,160,-160.0
1597,169,-169.0
1598,190,-190.0
1599,144,-144.0
1600,93,-93.0
1601,144,-144.0
1602,179,-179.0
1603,88,-88.0
1604,144,-144.0
1605,110,-110.0
1606,145,-145.0
1607,88,-88.0
1608,148,-148.0
1609,142,-142.0
1610,145,-145.0
1611,103,-103.0
1612,147,-147.0
1613,92,-92.0
1614,195,-195.0
1615,88,-88.0
1616,151,-151.0
1617,116,-116.0
1618,144,-144.0
1619,163,-163.0
1620,188,-188.0
1621,156,-156.0
1622,160,-160.0
1623,89,-89.0
1624,100,-100.0
1625,91,-91.0
1626,147,-147.0
1627,164,-164.0
1628,91,-91.0
1629,154,-154.0
1630,149,-149.0
1631,157,-157.0
1632,146,-146.0
1633,90,-90.0
1634,175,-175.0
1635,153,-153.0
1636,180,-180.0
1637,86,-86.0
1638,85,-85.0
1639,106,-106.0
1640,155,-155.0
1641,175,-175.0
1642,88,-88.0
1643,131,-131.0
1644,136,-136.0
1645,166,-166.0
1646,183,-183.0
1647,159,-159.0
1648,90,-90.0
1649,147,-147.0
1650,177,-177.0
1651,142,-142.0
1652,142,-142.0
1653,146,-146.0
1654,85,-85.0
1655,141,-141.0
1656,144,-144.0
1657,157,-157.0
1658,145,-145.0
1659,94,-94.0
1660,88,-88.0
1661,143,-143.0
1662,200,-200.0
1663,165,-165.0
1664,166,-166.0
1665,144,-144.0
1666,184,-184.0
1667,97,-97.0
1668,147,-147.0
1669,136,-136.0
1670,96,-96.0
1671,163,-163.0
1672,146,-146.0
1673,89,-89.0
1674,145,-145.0
1675,161,-161.0
1676,146,-146.0
1677,142,-142.0
1678,142,-142.0
1679,103,-103.0
1680,146,-146.0
1681,106,-106.0
1682,143,-143.0
1683,91,-91.0
1684,143,-143.0
1685,142,-142.0
1686,139,-139.0
1687,147,-147.0
1688,129,-129.0
1689,146,-146.0
1690,147,-147.0
1691,144,-144.0
1692,147,-147.0
1693,150,-150.0
1694,148,-148.0
1695,89,-89.0
1696,88,-88.0
1697,144,-144.0
1698,93,-93.0
1699,174,-174.0
1700,162,-162.0
1701,132,-132.0
1702,173,-173.0
1703,159,-159.0
1704,147,-147.0
1705,158,-158.0
1706,157,-157.0
1707,157,-157.0
1708,153,-153.0
1709,150,-150.0
1710,93,-93.0
1711,163,-163.0
1712,159,-159.0
1713,96,-96.0
1714,145,-145.0
1715,141,-141.0
1716,150,-150.0
1717,148,-148.0
1718,110,-110.0
1719,144,-144.0
1720,143,-143.0
1721,200,-200.0
1722,157,-157.0
1723,123,-123.0
1724,155,-155.0
1725,147,-147.0
1726,147,-147.0
1727,150,-150.0
1728,160,-160.0
1729,176,-176.0
1730,112,-112.0
1731,148,-148.0
1732,153,-153.0
1733,152,-152.0
1734,135,-135.0
1735,200,-200.0
1736,159,-159.0
1737,127,-127.0
1738,126,-126.0
1739,107,-107.0
1740,155,-155.0
1741,139,-139.0
1742,156,-156.0
1743,91,-91.0
1744,159,-159.0
1745,126,-126.0
1746,89,-89.0
1747,132,-132.0
1748,173,-173.0
1749,125,-125.0
1750,150,-150.0
1751,130,-130.0
1752,105,-105.0
1753,111,-111.0
1754,127,-127.0
1755,149,-149.0
1756,128,-128.0
1757,129,-129.0
1758,88,-88.0
1759,94,-94.0
1760,104,-104.0
1761,132,-132.0
1762,131,-131.0
1763,133,-133.0
1764,152,-152.0
1765,131,-131.0
1766,200,-200.0
1767,90,-90.0
1768,130,-130.0
1769,144,-144.0
1770,137,-137.0
1771,92,-92.0
1772,145,-145.0
1773,97,-97.0
1774,134,-134.0
1775,92,-92.0
1776,131,-131.0
1777,140,-140.0
1778,159,-159.0
1779,190,-190.0
1780,180,-180.0
1781,93,-93.0
1782,165,-165.0
1783,139,-139.0
1784,184,-184.0
1785,124,-124.0
1786,137,-137.0
1787,154,-154.0
1788,87,-87.0
1789,200,-200.0
1790,191,-191.0
1791,151,-151.0
1792,131,-131.0
1793,113,-113.0
1794,150,-150.0
1795,133,-133.0
1796,87,-87.0
1797,111,-111.0
1798,126,-126.0
1799,117,-117.0
1800,124,-124.0
1801,102,-102.0
1802,159,-159.0
1803,128,-128.0
1804,88,-88.0
1805,119,-119.0
1806,188,-188.0
1807,124,-124.0
1808,169,-169.0
1809,120,-120.0
1810,132,-132.0
1811,115,-115.0
1812,129,-129.0
1813,156,-156.0
1814,160,-160.0
1815,115,-115.0
1816,136,-136.0
1817,163,-163.0
1818,200,-200.0
1819,123,-123.0
1820,108,-108.0
1821,112,-112.0
1822,114,-114.0
1823,110,-110.0
1824,187,-187.0
1825,115,-115.0
1826,109,-109.0
1827,193,-193.0
1828,115,-115.0
1829,108,-108.0
1830,123,-123.0
1831,131,-131.0
1832,116,-116.0
1833,109,-109.0
1834,94,-94.0
1835,180,-180.0
1836,103,-103.0
1837,106,-106.0
1838,130,-130.0
1839,127,-127.0
1840,155,-155.0
1841,169,-169.0
1842,107,-107.0
1843,111,-111.0
1844,131,-131.0
1845,93,-93.0
1846,107,-107.0
1847,154,-154.0
1848,167,-167.0
1849,116,-116.0
1850,100,-100.0
1851,94,-94.0
1852,97,-97.0
1853,85,-85.0
1854,112,-112.0
1855,89,-89.0
1856,111,-111.0
1857,90,-90.0
1858,173,-173.0
1859,110,-110.0
1860,88,-88.0
1861,181,-181.0
1862,110,-110.0
1863,108,-108.0
1864,165,-165.0
1865,105,-105.0
1866,91,-91.0
1867,110,-110.0
1868,110,-110.0
1869,109,-109.0
1870,93,-93.0
1871,90,-90.0
1872,91,-91.0
1873,108,-108.0
1874,89,-89.0
1875,106,-106.0
1876,113,-113.0
1877,182,-182.0
1878,107,-107.0
1879,106,-106.0
1880,127,-127.0
1881,108,-108.0
1882,113,-113.0
1883,158,-158.0
1884,87,-87.0
1885,153,-153.0
1886,106,-106.0
1887,111,-111.0
1888,161,-161.0
1889,85,-85.0
1890,99,-99.0
1891,92,-92.0
1892,134,-134.0
1893,154,-154.0
1894,85,-85.0
1895,88,-88.0
1896,157,-157.0
1897,161,-161.0
1898,86,-86.0
1899,147,-147.0
1900,196,-196.0
1901,158,-158.0
1902,163,-163.0
1903,111,-111.0
1904,172,-172.0
1905,97,-97.0
1906,109,-109.0
1907,148,-148.0
1908,100,-100.0
1909,173,-173.0
1910,129,-129.0
1911,200,-200.0
1912,125,-125.0
1913,113,-113.0
1914,126,-126.0
1915,123,-123.0
1916,86,-86.0
1917,92,-92.0
1918,89,-89.0
1919,99,-99.0
1920,165,-165.0
1921,91,-91.0
1922,96,-96.0
1923,115,-115.0
1924,109,-109.0
1925,111,-111.0
1926,200,-200.0
1927,114,-114.0
1928,103,-103.0
1929,125,-125.0
1930,148,-148.0
1931,188,-188.0
1932,116,-116.0
1933,162,-162.0
1934,98,-98.0
1935,168,-168.0
1936,139,-139.0
1937,87,-87.0
1938,92,-92.0
1939,164,-164.0
1940,93,-93.0
1941,122,-122.0
1942,115,-115.0
1943,107,-107.0
1944,165,-165.0
1945,93,-93.0
1946,122,-122.0
1947,166,-166.0
1948,90,-90.0
1949,117,-117.0
1950,144,-144.0
1951,137,-137.0
1952,106,-106.0
1953,171,-171.0
1954,164,-164.0
1955,197,-197.0
1956,190,-190.0
1957,200,-200.0
1958,89,-89.0
1959,100,-100.0
1960,105,-105.0
1961,106,-106.0
1962,200,-200.0
1963,110,-110.0
1964,106,-106.0
1965,103,-103.0
1966,113,-113.0
1967,118,-118.0
1968,90,-90.0
1969,107,-107.0
1970,172,-172.0
1971,98,-98.0
1972,123,-123.0
1973,109,-109.0
1974,107,-107.0
1975,86,-86.0
1976,149,-149.0
1977,128,-128.0
1978,154,-154.0
1979,108,-108.0
1980,120,-120.0
1981,147,-147.0
1982,106,-106.0
1983,154,-154.0
1984,142,-142.0
1985,85,-85.0
1986,97,-97.0
1987,200,-200.0
1988,88,-88.0
1989,108,-108.0
1990,87,-87.0
1991,108,-108.0
1992,93,-93.0
1993,116,-116.0
1994,85,-85.0
1995,107,-107.0
1996,87,-87.0
1997,105,-105.0
1998,109,-109.0
1999,88,-88.0
2000,87,-87.0
2001,116,-116.0
2002,129,-129.0
2003,91,-91.0
2004,109,-109.0
2005,107,-107.0
2006,107,-107.0
2007,155,-155.0
2008,102,-102.0
2009,107,-107.0
2010,98,-98.0
2011,113,-113.0
2012,105,-105.0
2013,88,-88.0
2014,85,-85.0
2015,109,-109.0
2016,91,-91.0
2017,105,-105.0
2018,107,-107.0
2019,98,-98.0
2020,105,-105.0
2021,116,-116.0
2022,110,-110.0
2023,95,-95.0
2024,112,-112.0
2025,100,-100.0
2026,106,-106.0
2027,135,-135.0
2028,117,-117.0
2029,135,-135.0
2030,113,-113.0
2031,94,-94.0
2032,95,-95.0
2033,101,-101.0
2034,153,-153.0
2035,85,-85.0
2036,110,-110.0
2037,118,-118.0
2038,123,-123.0
2039,83,-83.0
2040,140,-140.0
2041,102,-102.0
2042,85,-85.0
2043,110,-110.0
2044,133,-133.0
2045,156,-156.0
2046,113,-113.0
2047,112,-112.0
2048,109,-109.0
2049,111,-111.0
2050,138,-138.0
2051,83,-83.0
2052,110,-110.0
2053,93,-93.0
2054,111,-111.0
2055,87,-87.0
2056,108,-108.0
2057,106,-106.0
2058,115,-115.0
2059,112,-112.0
2060,109,-109.0
2061,119,-119.0
2062,93,-93.0
2063,92,-92.0
2064,109,-109.0
2065,200,-200.0
2066,135,-135.0
2067,194,-194.0
2068,88,-88.0
2069,200,-200.0
2070,184,-184.0
2071,172,-172.0
2072,165,-165.0
2073,165,-165.0
2074,163,-163.0
2075,188,-188.0
2076,162,-162.0
2077,121,-121.0
2078,105,-105.0
2079,180,-180.0
2080,157,-157.0
2081,170,-170.0
2082,107,-107.0
2083,94,-94.0
2084,117,-117.0
2085,90,-90.0
2086,87,-87.0
2087,142,-142.0
2088,200,-200.0
2089,116,-116.0
2090,176,-176.0
2091,153,-153.0
2092,130,-130.0
2093,104,-104.0
2094,120,-120.0
2095,134,-134.0
2096,132,-132.0
2097,122,-122.0
2098,104,-104.0
2099,117,-117.0
2100,123,-123.0
2101,113,-113.0
2102,108,-108.0
2103,116,-116.0
2104,117,-117.0
2105,114,-114.0
2106,126,-126.0
2107,98,-98.0
2108,131,-131.0
2109,119,-119.0
2110,128,-128.0
2111,124,-124.0
2112,106,-106.0
2113,111,-111.0
2114,122,-122.0
2115,133,-133.0
2116,110,-110.0
2117,98,-98.0
2118,108,-108.0
2119,107,-107.0
2120,116,-116.0
2121,109,-109.0
2122,117,-117.0
2123,112,-112.0
2124,111,-111.0
2125,107,-107.0
2126,112,-112.0
2127,111,-111.0
2128,118,-118.0
2129,110,-110.0
2130,107,-107.0
2131,108,-108.0
2132,110,-110.0
2133,153,-153.0
2134,112,-112.0
2135,120,-120.0
2136,167,-167.0
2137,166,-166.0
2138,162,-162.0
2139,192,-192.0
2140,177,-177.0
2141,160,-160.0
2142,157,-157.0
2143,172,-172.0
2144,128,-128.0
2145,161,-161.0
2146,186,-186.0
2147,159,-159.0
2148,190,-190.0
2149,165,-165.0
2150,123,-123.0
2151,149,-149.0
2152,124,-124.0
2153,170,-170.0
2154,163,-163.0
2155,131,-131.0
2156,182,-182.0
2157,160,-160.0
2158,125,-125.0
2159,147,-147.0
2160,112,-112.0
2161,158,-158.0
2162,155,-155.0
2163,193,-193.0
2164,189,-189.0
2165,110,-110.0
2166,164,-164.0
2167,153,-153.0
2168,87,-87.0
2169,161,-161.0
2170,102,-102.0
2171,122,-122.0
2172,168,-168.0
2173,198,-198.0
2174,168,-168.0
2175,101,-101.0
2176,130,-130.0
2177,106,-106.0
2178,88,-88.0
2179,109,-109.0
2180,103,-103.0
2181,119,-119.0
2182,104,-104.0
2183,115,-115.0
2184,104,-104.0
2185,124,-124.0
2186,105,-105.0
2187,177,-177.0
2188,170,-170.0
2189,105,-105.0
2190,98,-98.0
2191,113,-113.0
2192,130,-130.0
2193,90,-90.0
2194,172,-172.0
2195,103,-103.0
2196,176,-176.0
2197,120,-120.0
2198,89,-89.0
2199,109,-109.0
2200,92,-92.0
2201,99,-99.0
2202,101,-101.0
2203,117,-117.0
2204,89,-89.0
2205,88,-88.0
2206,117,-117.0
2207,103,-103.0
2208,175,-175.0
2209,123,-123.0
2210,196,-196.0
2211,169,-169.0
2212,188,-188.0
2213,154,-154.0
2214,176,-176.0
2215,110,-110.0
2216,154,-154.0
2217,174,-174.0
2218,85,-85.0
2219,92,-92.0
2220,104,-104.0
2221,109,-109.0
2222,108,-108.0
2223,112,-112.0
2224,177,-177.0
2225,106,-106.0
2226,118,-118.0
2227,108,-108.0
2228,169,-169.0
2229,110,-110.0
2230,106,-106.0
2231,85,-85.0
2232,86,-86.0
2233,104,-104.0
2234,120,-120.0
2235,105,-105.0
2236,88,-88.0
2237,98,-98.0
2238,99,-99.0
2239,109,-109.0
2240,118,-118.0
2241,111,-111.0
2242,104,-104.0
2243,110,-110.0
2244,105,-105.0
2245,115,-115.0
2246,107,-107.0
2247,127,-127.0
2248,104,-104.0
2249,107,-107.0
2250,107,-107.0
2251,106,-106.0
2252,111,-111.0
2253,189,-189.0
2254,99,-99.0
2255,200,-200.0
2256,158,-158.0
2257,131,-131.0
2258,152,-152.0
2259,108,-108.0
2260,110,-110.0
2261,103,-103.0
2262,144,-144.0
2263,114,-114.0
2264,175,-175.0
2265,119,-119.0
2266,110,-110.0
2267,168,-168.0
2268,85,-85.0
2269,164,-164.0
2270,162,-162.0
2271,149,-149.0
2272,113,-113.0
2273,170,-170.0
2274,158,-158.0
2275,113,-113.0
2276,108,-108.0
2277,155,-155.0
2278,160,-160.0
2279,165,-165.0
2280,190,-190.0
2281,105,-105.0
2282,99,-99.0
2283,84,-84.0
2284,86,-86.0
2285,130,-130.0
2286,156,-156.0
2287,143,-143.0
2288,92,-92.0
2289,161,-161.0
2290,160,-160.0
2291,150,-150.0
2292,148,-148.0
2293,165,-165.0
2294,108,-108.0
2295,166,-166.0
2296,162,-162.0
2297,109,-109.0
2298,153,-153.0
2299,162,-162.0
2300,160,-160.0
2301,155,-155.0
2302,143,-143.0
2303,154,-154.0
2304,154,-154.0
2305,113,-113.0
2306,200,-200.0
2307,174,-174.0
2308,200,-200.0
2309,162,-162.0
2310,200,-200.0
2311,186,-186.0
2312,164,-164.0
2313,107,-107.0
2314,106,-106.0
2315,165,-165.0
2316,164,-164.0
2317,108,-108.0
2318,99,-99.0
2319,106,-106.0
2320,98,-98.0
2321,97,-97.0
2322,102,-102.0
2323,167,-167.0
2324,168,-168.0
2325,166,-166.0
2326,90,-90.0
2327,94,-94.0
2328,175,-175.0
2329,96,-96.0
2330,160,-160.0
2331,99,-99.0
2332,92,-92.0
2333,160,-160.0
2334,126,-126.0
2335,164,-164.0
2336,122,-122.0
2337,86,-86.0
2338,173,-173.0
2339,141,-141.0
2340,90,-90.0
2341,155,-155.0
2342,200,-200.0
2343,165,-165.0
2344,166,-166.0
2345,178,-178.0
2346,103,-103.0
2347,173,-173.0
2348,132,-132.0
2349,180,-180.0
2350,188,-188.0
2351,90,-90.0
2352,194,-194.0
2353,169,-169.0
2354,148,-148.0
2355,200,-200.0
2356,96,-96.0
2357,97,-97.0
2358,91,-91.0
2359,155,-155.0
2360,95,-95.0
2361,190,-190.0
2362,191,-191.0
2363,119,-119.0
2364,92,-92.0
2365,86,-86.0
2366,91,-91.0
2367,119,-119.0
2368,111,-111.0
2369,107,-107.0
2370,108,-108.0
2371,118,-118.0
2372,178,-178.0
2373,149,-149.0
2374,182,-182.0
2375,179,-179.0
2376,154,-154.0
2377,200,-200.0
2378,200,-200.0
2379,182,-182.0
2380,200,-200.0
2381,125,-125.0
2382,200,-200.0
2383,112,-112.0
2384,173,-173.0
2385,158,-158.0
2386,128,-128.0
2387,144,-144.0
2388,165,-165.0
2389,118,-118.0
2390,101,-101.0
2391,153,-153.0
2392,112,-112.0
2393,157,-157.0
2394,184,-184.0
2395,155,-155.0
2396,109,-109.0
2397,200,-200.0
2398,111,-111.0
2399,86,-86.0
2400,107,-107.0
2401,102,-102.0
2402,200,-200.0
2403,110,-110.0
2404,110,-110.0
2405,156,-156.0
2406,115,-115.0
2407,108,-108.0
2408,98,-98.0
2409,102,-102.0
2410,114,-114.0
2411,107,-107.0
2412,107,-107.0
2413,109,-109.0
2414,192,-192.0
2415,113,-113.0
2416,161,-161.0
2417,167,-167.0
2418,172,-172.0
2419,107,-107.0
2420,104,-104.0
2421,108,-108.0
2422,104,-104.0
2423,88,-88.0
2424,90,-90.0
2425,114,-114.0
2426,170,-170.0
2427,163,-163.0
2428,200,-200.0
2429,96,-96.0
2430,113,-113.0
2431,107,-107.0
2432,89,-89.0
2433,172,-172.0
2434,108,-108.0
2435,114,-114.0
2436,115,-115.0
2437,101,-101.0
2438,200,-200.0
2439,85,-85.0
2440,101,-101.0
2441,89,-89.0
2442,98,-98.0
2443,106,-106.0
2444,83,-83.0
2445,174,-174.0
2446,154,-154.0
2447,104,-104.0
2448,107,-107.0
2449,148,-148.0
2450,109,-109.0
2451,116,-116.0
2452,200,-200.0
2453,162,-162.0
2454,123,-123.0
2455,97,-97.0
2456,110,-110.0
2457,166,-166.0
2458,113,-113.0
2459,98,-98.0
2460,107,-107.0
2461,84,-84.0
2462,109,-109.0
2463,91,-91.0
2464,117,-117.0
2465,174,-174.0
2466,101,-101.0
2467,200,-200.0
2468,113,-113.0
2469,112,-112.0
2470,133,-133.0
2471,162,-162.0
2472,109,-109.0
2473,114,-114.0
2474,104,-104.0
2475,107,-107.0
2476,106,-106.0
2477,105,-105.0
2478,108,-108.0
2479,109,-109.0
2480,106,-106.0
2481,129,-129.0
2482,113,-113.0
2483,111,-111.0
2484,111,-111.0
2485,113,-113.0
2486,170,-170.0
2487,107,-107.0
2488,104,-104.0
2489,109,-109.0
2490,109,-109.0
2491,116,-116.0
2492,118,-118.0
2493,152,-152.0
2494,108,-108.0
2495,111,-111.0
2496,106,-106.0
2497,111,-111.0
2498,111,-111.0
2499,107,-107.0
2500,106,-106.0
2501,111,-111.0
2502,110,-110.0
2503,114,-114.0
2504,107,-107.0
2505,109,-109.0
2506,200,-200.0
2507,109,-109.0
2508,126,-126.0
2509,109,-109.0
2510,108,-108.0
2511,111,-111.0
2512,110,-110.0
2513,109,-109.0
2514,121,-121.0
2515,107,-107.0
2516,112,-112.0
2517,118,-118.0
2518,108,-108.0
2519,112,-112.0
2520,109,-109.0
2521,117,-117.0
2522,165,-165.0
2523,169,-169.0
2524,108,-108.0
2525,110,-110.0
2526,188,-188.0
2527,108,-108.0
2528,104,-104.0
2529,109,-109.0
2530,112,-112.0
2531,89,-89.0
2532,106,-106.0
2533,113,-113.0
2534,104,-104.0
2535,107,-107.0
2536,110,-110.0
2537,101,-101.0
2538,92,-92.0
2539,179,-179.0
2540,111,-111.0
2541,108,-108.0
2542,108,-108.0
2543,87,-87.0
2544,110,-110.0
2545,111,-111.0
2546,107,-107.0
2547,110,-110.0
2548,110,-110.0
2549,111,-111.0
2550,144,-144.0
2551,86,-86.0
2552,106,-106.0
2553,111,-111.0
2554,109,-109.0
2555,108,-108.0
2556,86,-86.0
2557,172,-172.0
2558,110,-110.0
2559,111,-111.0
2560,89,-89.0
2561,106,-106.0
2562,108,-108.0
2563,92,-92.0
2564,109,-109.0
2565,113,-113.0
2566,96,-96.0
2567,108,-108.0
2568,114,-114.0
2569,105,-105.0
2570,113,-113.0
2571,180,-180.0
2572,87,-87.0
2573,107,-107.0
2574,117,-117.0
2575,106,-106.0
2576,144,-144.0
2577,189,-189.0
2578,177,-177.0
2579,107,-107.0
2580,176,-176.0
2581,115,-115.0
2582,200,-200.0
2583,157,-157.0
2584,165,-165.0
2585,175,-175.0
2586,161,-161.0
2587,158,-158.0
2588,118,-118.0
2589,123,-123.0
2590,124,-124.0
2591,105,-105.0
2592,107,-107.0
2593,179,-179.0
2594,106,-106.0
2595,106,-106.0
2596,122,-122.0
2597,111,-111.0
2598,107,-107.0
2599,166,-166.0
2600,105,-105.0
2601,107,-107.0
2602,103,-103.0
2603,105,-105.0
2604,108,-108.0
2605,87,-87.0
2606,112,-112.0
2607,107,-107.0
2608,130,-130.0
2609,84,-84.0
2610,106,-106.0
2611,84,-84.0
2612,94,-94.0
2613,127,-127.0
2614,200,-200.0
2615,93,-93.0
2616,90,-90.0
2617,89,-89.0
2618,117,-117.0
2619,87,-87.0
2620,113,-113.0
2621,128,-128.0
2622,200,-200.0
2623,91,-91.0
2624,86,-86.0
2625,109,-109.0
2626,127,-127.0
2627,89,-89.0
2628,173,-173.0
2629,106,-106.0
2630,121,-121.0
2631,86,-86.0
2632,200,-200.0
2633,107,-107.0
2634,165,-165.0
2635,110,-110.0
2636,117,-117.0
2637,84,-84.0
2638,95,-95.0
2639,110,-110.0
2640,167,-167.0
2641,151,-151.0
2642,88,-88.0
2643,114,-114.0
2644,119,-119.0
2645,100,-100.0
2646,169,-169.0
2647,111,-111.0
2648,111,-111.0
2649,188,-188.0
2650,200,-200.0
2651,115,-115.0
2652,160,-160.0
2653,163,-163.0
2654,97,-97.0
2655,162,-162.0
2656,172,-172.0
2657,93,-93.0
2658,162,-162.0
2659,181,-181.0
2660,130,-130.0
2661,154,-154.0
2662,84,-84.0
2663,146,-146.0
2664,171,-171.0
2665,153,-153.0
2666,160,-160.0
2667,200,-200.0
2668,110,-110.0
2669,119,-119.0
2670,108,-108.0
2671,108,-108.0
2672,108,-108.0
2673,119,-119.0
2674,94,-94.0
2675,109,-109.0
2676,157,-157.0
2677,148,-148.0
2678,110,-110.0
2679,117,-117.0
2680,133,-133.0
2681,128,-128.0
2682,154,-154.0
2683,108,-108.0
2684,121,-121.0
2685,88,-88.0
2686,109,-109.0
2687,109,-109.0
2688,142,-142.0
2689,95,-95.0
2690,108,-108.0
2691,114,-114.0
2692,113,-113.0
2693,110,-110.0
2694,87,-87.0
2695,120,-120.0
2696,87,-87.0
2697,88,-88.0
2698,148,-148.0
2699,117,-117.0
2700,109,-109.0
2701,116,-116.0
2702,163,-163.0
2703,110,-110.0
2704,110,-110.0
2705,111,-111.0
2706,110,-110.0
2707,119,-119.0
2708,103,-103.0
2709,111,-111.0
2710,145,-145.0
2711,113,-113.0
2712,108,-108.0
2713,106,-106.0
2714,97,-97.0
2715,114,-114.0
2716,84,-84.0
2717,114,-114.0
2718,114,-114.0
2719,112,-112.0
2720,114,-114.0
2721,104,-104.0
2722,91,-91.0
2723,106,-106.0
2724,107,-107.0
2725,111,-111.0
2726,114,-114.0
2727,106,-106.0
2728,115,-115.0
2729,117,-117.0
2730,119,-119.0
2731,126,-126.0
2732,92,-92.0
2733,112,-112.0
2734,110,-110.0
2735,121,-121.0
2736,108,-108.0
2737,92,-92.0
2738,95,-95.0
2739,128,-128.0
2740,158,-158.0
2741,85,-85.0
2742,118,-118.0
2743,112,-112.0
2744,137,-137.0
2745,87,-87.0
2746,200,-200.0
2747,84,-84.0
2748,131,-131.0
2749,91,-91.0
2750,121,-121.0
2751,119,-119.0
2752,200,-200.0
2753,104,-104.0
2754,200,-200.0
2755,183,-183.0
2756,119,-119.0
2757,130,-130.0
2758,84,-84.0
2759,200,-200.0
2760,200,-200.0
2761,200,-200.0
2762,200,-200.0
2763,168,-168.0
2764,116,-116.0
2765,193,-193.0
2766,200,-200.0
2767,180,-180.0
2768,154,-154.0
2769,200,-200.0
2770,200,-200.0
2771,146,-146.0
2772,84,-84.0
2773,126,-126.0
2774,128,-128.0
2775,156,-156.0
2776,93,-93.0
2777,200,-200.0
2778,117,-117.0
2779,159,-159.0
2780,131,-131.0
2781,123,-123.0
2782,160,-160.0
2783,119,-119.0
2784,131,-131.0
2785,111,-111.0
2786,120,-120.0
2787,117,-117.0
2788,161,-161.0
2789,113,-113.0
2790,116,-116.0
2791,127,-127.0
2792,161,-161.0
2793,128,-128.0
2794,200,-200.0
2795,122,-122.0
2796,125,-125.0
2797,127,-127.0
2798,200,-200.0
2799,122,-122.0
2800,143,-143.0
2801,113,-113.0
2802,120,-120.0
2803,127,-127.0
2804,114,-114.0
2805,122,-122.0
2806,164,-164.0
2807,170,-170.0
2808,140,-140.0
2809,87,-87.0
2810,122,-122.0
2811,84,-84.0
2812,123,-123.0
2813,110,-110.0
2814,200,-200.0
2815,114,-114.0
2816,133,-133.0
2817,154,-154.0
2818,122,-122.0
2819,139,-139.0
2820,85,-85.0
2821,200,-200.0
2822,188,-188.0
2823,102,-102.0
2824,117,-117.0
2825,113,-113.0
2826,200,-200.0
2827,87,-87.0
2828,175,-175.0
2829,123,-123.0
2830,125,-125.0
2831,122,-122.0
2832,160,-160.0
2833,161,-161.0
2834,154,-154.0
2835,153,-153.0
2836,145,-145.0
2837,192,-192.0
2838,114,-114.0
2839,132,-132.0
2840,200,-200.0
2841,121,-121.0
2842,159,-159.0
2843,112,-112.0
2844,158,-158.0
2845,156,-156.0
2846,176,-176.0
2847,154,-154.0
2848,144,-144.0
2849,152,-152.0
2850,149,-149.0
2851,171,-171.0
2852,174,-174.0
2853,158,-158.0
2854,200,-200.0
2855,166,-166.0
2856,120,-120.0
2857,117,-117.0
2858,129,-129.0
2859,153,-153.0
2860,152,-152.0
2861,112,-112.0
2862,147,-147.0
2863,109,-109.0
2864,119,-119.0
2865,127,-127.0
2866,143,-143.0
2867,145,-145.0
2868,151,-151.0
2869,148,-148.0
2870,163,-163.0
2871,155,-155.0
2872,153,-153.0
2873,156,-156.0
2874,164,-164.0
2875,156,-156.0
2876,152,-152.0
2877,155,-155.0
2878,200,-200.0
2879,153,-153.0
2880,155,-155.0
2881,88,-88.0
2882,153,-153.0
2883,150,-150.0
2884,153,-153.0
2885,167,-167.0
2886,159,-159.0
2887,154,-154.0
2888,115,-115.0
2889,161,-161.0
2890,119,-119.0
2891,188,-188.0
2892,149,-149.0
2893,161,-161.0
2894,121,-121.0
2895,116,-116.0
2896,120,-120.0
2897,165,-165.0
2898,154,-154.0
2899,120,-120.0
2900,127,-127.0
2901,157,-157.0
2902,124,-124.0
2903,117,-117.0
2904,148,-148.0
2905,121,-121.0
2906,156,-156.0
2907,161,-161.0
2908,117,-117.0
2909,147,-147.0
2910,108,-108.0
2911,111,-111.0
2912,151,-151.0
2913,117,-117.0
2914,154,-154.0
2915,114,-114.0
2916,116,-116.0
2917,200,-200.0
2918,117,-117.0
2919,111,-111.0
2920,149,-149.0
2921,123,-123.0
2922,175,-175.0
2923,151,-151.0
2924,151,-151.0
2925,114,-114.0
2926,158,-158.0
2927,115,-115.0
2928,109,-109.0
2929,112,-112.0
2930,112,-112.0
2931,112,-112.0
2932,149,-149.0
2933,119,-119.0
2934,157,-157.0
2935,159,-159.0
2936,166,-166.0
2937,153,-153.0
2938,122,-122.0
2939,124,-124.0
2940,133,-133.0
2941,115,-115.0
2942,156,-156.0
2943,114,-114.0
2944,119,-119.0
2945,166,-166.0
2946,115,-115.0
2947,117,-117.0
2948,118,-118.0
2949,189,-189.0
2950,115,-115.0
2951,112,-112.0
2952,112,-112.0
2953,117,-117.0
2954,121,-121.0
2955,157,-157.0
2956,121,-121.0
2957,153,-153.0
2958,118,-118.0
2959,121,-121.0
2960,188,-188.0
2961,119,-119.0
2962,154,-154.0
2963,88,-88.0
2964,88,-88.0
2965,117,-117.0
2966,115,-115.0
2967,116,-116.0
2968,116,-116.0
2969,159,-159.0
2970,159,-159.0
2971,112,-112.0
2972,86,-86.0
2973,154,-154.0
2974,115,-115.0
2975,113,-113.0
2976,110,-110.0
2977,108,-108.0
2978,109,-109.0
2979,112,-112.0
2980,115,-115.0
2981,114,-114.0
2982,123,-123.0
2983,116,-116.0
2984,157,-157.0
2985,123,-123.0
2986,114,-114.0
2987,176,-176.0
2988,116,-116.0
2989,84,-84.0
2990,110,-110.0
2991,115,-115.0
2992,154,-154.0
2993,113,-113.0
2994,107,-107.0
2995,136,-136.0
2996,115,-115.0
2997,159,-159.0
2998,114,-114.0
2999,113,-113.0
3000,88,-88.0
3001,113,-113.0
3002,114,-114.0
3003,114,-114.0
3004,114,-114.0
3005,152,-152.0
3006,153,-153.0
3007,161,-161.0
3008,160,-160.0
3009,113,-113.0
3010,158,-158.0
3011,114,-114.0
3012,113,-113.0
3013,108,-108.0
3014,156,-156.0
3015,159,-159.0
3016,108,-108.0
3017,112,-112.0
3018,154,-154.0
3019,156,-156.0
3020,166,-166.0
3021,115,-115.0
3022,138,-138.0
3023,140,-140.0
3024,200,-200.0
3025,116,-116.0
3026,112,-112.0
3027,155,-155.0
3028,148,-148.0
3029,135,-135.0
3030,85,-85.0
3031,132,-132.0
3032,114,-114.0
3033,151,-151.0
3034,151,-151.0
3035,153,-153.0
3036,112,-112.0
3037,154,-154.0
3038,145,-145.0
3039,87,-87.0
3040,113,-113.0
3041,113,-113.0
3042,169,-169.0
3043,150,-150.0
3044,176,-176.0
3045,85,-85.0
3046,113,-113.0
3047,179,-179.0
3048,111,-111.0
3049,106,-106.0
3050,96,-96.0
3051,155,-155.0
3052,112,-112.0
3053,94,-94.0
3054,134,-134.0
3055,144,-144.0
3056,116,-116.0
3057,151,-151.0
3058,114,-114.0
3059,153,-153.0
3060,148,-148.0
3061,158,-158.0
3062,121,-121.0
3063,143,-143.0
3064,153,-153.0
3065,113,-113.0
3066,115,-115.0
3067,121,-121.0
3068,200,-200.0
3069,144,-144.0
3070,114,-114.0
3071,114,-114.0
3072,130,-130.0
3073,134,-134.0
3074,119,-119.0
3075,149,-149.0
3076,147,-147.0
3077,116,-116.0
3078,156,-156.0
3079,150,-150.0
3080,116,-116.0
3081,111,-111.0
3082,116,-116.0
3083,117,-117.0
3084,148,-148.0
3085,109,-109.0
3086,200,-200.0
3087,139,-139.0
3088,133,-133.0
3089,154,-154.0
3090,112,-112.0
3091,160,-160.0
3092,156,-156.0
3093,113,-113.0
3094,114,-114.0
3095,150,-150.0
3096,153,-153.0
3097,86,-86.0
3098,112,-112.0
3099,108,-108.0
3100,148,-148.0
3101,154,-154.0
3102,153,-153.0
3103,115,-115.0
3104,84,-84.0
3105,116,-116.0
3106,115,-115.0
3107,114,-114.0
3108,88,-88.0
3109,85,-85.0
3110,154,-154.0
3111,111,-111.0
3112,116,-116.0
3113,149,-149.0
3114,120,-120.0
3115,156,-156.0
3116,112,-112.0
3117,113,-113.0
3118,91,-91.0
3119,86,-86.0
3120,177,-177.0
3121,170,-170.0
3122,106,-106.0
3123,85,-85.0
3124,85,-85.0
3125,155,-155.0
3126,117,-117.0
3127,110,-110.0
3128,166,-166.0
3129,107,-107.0
3130,116,-116.0
3131,111,-111.0
3132,102,-102.0
3133,107,-107.0
3134,85,-85.0
3135,200,-200.0
3136,178,-178.0
3137,107,-107.0
3138,169,-169.0
3139,108,-108.0
3140,108,-108.0
3141,108,-108.0
3142,171,-171.0
3143,96,-96.0
3144,110,-110.0
3145,117,-117.0
3146,109,-109.0
3147,108,-108.0
3148,109,-109.0
3149,98,-98.0
3150,107,-107.0
3151,96,-96.0
3152,110,-110.0
3153,108,-108.0
3154,107,-107.0
3155,111,-111.0
3156,107,-107.0
3157,119,-119.0
3158,85,-85.0
3159,85,-85.0
3160,114,-114.0
3161,111,-111.0
3162,150,-150.0
3163,166,-166.0
3164,89,-89.0
3165,89,-89.0
3166,171,-171.0
3167,114,-114.0
3168,90,-90.0
3169,126,-126.0
3170,109,-109.0
3171,106,-106.0
3172,118,-118.0
3173,107,-107.0
3174,90,-90.0
3175,116,-116.0
3176,91,-91.0
3177,107,-107.0
3178,109,-109.0
3179,112,-112.0
3180,107,-107.0
3181,165,-165.0
3182,181,-181.0
3183,165,-165.0
3184,160,-160.0
3185,110,-110.0
3186,165,-165.0
3187,91,-91.0
3188,85,-85.0
3189,160,-160.0
3190,160,-160.0
3191,92,-92.0
3192,109,-109.0
3193,110,-110.0
3194,112,-112.0
3195,112,-112.0
3196,89,-89.0
3197,108,-108.0
3198,178,-178.0
3199,112,-112.0
3200,180,-180.0
3201,110,-110.0
3202,154,-154.0
3203,109,-109.0
3204,167,-167.0
3205,110,-110.0
3206,124,-124.0
3207,165,-165.0
3208,108,-108.0
3209,106,-106.0
3210,113,-113.0
3211,114,-114.0
3212,110,-110.0
3213,182,-182.0
3214,87,-87.0
3215,166,-166.0
3216,173,-173.0
3217,117,-117.0
3218,137,-137.0
3219,110,-110.0
3220,170,-170.0
3221,113,-113.0
3222,163,-163.0
3223,110,-110.0
3224,157,-157.0
3225,93,-93.0
3226,103,-103.0
3227,113,-113.0
3228,107,-107.0
3229,162,-162.0
3230,111,-111.0
3231,177,-177.0
3232,113,-113.0
3233,98,-98.0
3234,108,-108.0
3235,113,-113.0
3236,113,-113.0
3237,131,-131.0
3238,114,-114.0
3239,114,-114.0
3240,114,-114.0
3241,152,-152.0
3242,110,-110.0
3243,91,-91.0
3244,116,-116.0
3245,170,-170.0
3246,199,-199.0
3247,175,-175.0
3248,110,-110.0
3249,108,-108.0
3250,110,-110.0
3251,164,-164.0
3252,175,-175.0
3253,199,-199.0
3254,181,-181.0
3255,113,-113.0
3256,114,-114.0
3257,170,-170.0
3258,111,-111.0
3259,116,-116.0
3260,90,-90.0
3261,108,-108.0
3262,111,-111.0
3263,109,-109.0
3264,91,-91.0
3265,169,-169.0
3266,90,-90.0
3267,111,-111.0
3268,106,-106.0
3269,111,-111.0
3270,100,-100.0
3271,117,-117.0
3272,169,-169.0
3273,110,-110.0
3274,167,-167.0
3275,200,-200.0
3276,123,-123.0
3277,114,-114.0
3278,120,-120.0
3279,94,-94.0
3280,114,-114.0
3281,122,-122.0
3282,130,-130.0
3283,121,-121.0
3284,126,-126.0
3285,171,-171.0
3286,104,-104.0
3287,125,-125.0
3288,172,-172.0
3289,127,-127.0
3290,88,-88.0
3291,115,-115.0
3292,169,-169.0
3293,118,-118.0
3294,147,-147.0
3295,91,-91.0
3296,167,-167.0
3297,88,-88.0
3298,86,-86.0
3299,119,-119.0
3300,94,-94.0
3301,155,-155.0
3302,119,-119.0
3303,180,-180.0
3304,200,-200.0
3305,121,-121.0
3306,120,-120.0
3307,174,-174.0
3308,121,-121.0
3309,85,-85.0
3310,86,-86.0
3311,111,-111.0
3312,107,-107.0
3313,100,-100.0
3314,84,-84.0
3315,120,-120.0
3316,105,-105.0
3317,120,-120.0
3318,116,-116.0
3319,86,-86.0
3320,124,-124.0
3321,200,-200.0
3322,105,-105.0
3323,90,-90.0
3324,182,-182.0
3325,118,-118.0
3326,112,-112.0
3327,111,-111.0
3328,172,-172.0
3329,119,-119.0
3330,116,-116.0
3331,117,-117.0
3332,120,-120.0
3333,89,-89.0
3334,119,-119.0
3335,104,-104.0
3336,113,-113.0
3337,136,-136.0
3338,113,-113.0
3339,113,-113.0
3340,115,-115.0
3341,87,-87.0
3342,116,-116.0
3343,112,-112.0
3344,113,-113.0
3345,111,-111.0
3346,110,-110.0
3347,114,-114.0
3348,84,-84.0
3349,111,-111.0
3350,112,-112.0
3351,110,-110.0
3352,113,-113.0
3353,160,-160.0
3354,182,-182.0
3355,114,-114.0
3356,120,-120.0
3357,90,-90.0
3358,89,-89.0
3359,113,-113.0
3360,97,-97.0
3361,200,-200.0
3362,113,-113.0
3363,127,-127.0
3364,91,-91.0
3365,131,-131.0
3366,128,-128.0
3367,131,-131.0
3368,154,-154.0
3369,109,-109.0
3370,116,-116.0
3371,90,-90.0
3372,145,-145.0
3373,122,-122.0
3374,103,-103.0
3375,190,-190.0
3376,92,-92.0
3377,185,-185.0
3378,121,-121.0
3379,111,-111.0
3380,110,-110.0
3381,114,-114.0
3382,84,-84.0
3383,118,-118.0
3384,157,-157.0
3385,117,-117.0
3386,85,-85.0
3387,93,-93.0
3388,154,-154.0
3389,120,-120.0
3390,150,-150.0
3391,139,-139.0
3392,119,-119.0
3393,134,-134.0
3394,134,-134.0
3395,124,-124.0
3396,147,-147.0
3397,87,-87.0
3398,180,-180.0
3399,113,-113.0
3400,100,-100.0
3401,86,-86.0
3402,155,-155.0
3403,143,-143.0
3404,155,-155.0
3405,149,-149.0
3406,170,-170.0
3407,114,-114.0
3408,145,-145.0
3409,159,-159.0
3410,121,-121.0
3411,97,-97.0
3412,110,-110.0
3413,139,-139.0
3414,148,-148.0
3415,92,-92.0
3416,148,-148.0
3417,138,-138.0
3418,152,-152.0
3419,110,-110.0
3420,147,-147.0
3421,91,-91.0
3422,145,-145.0
3423,125,-125.0
3424,119,-119.0
3425,92,-92.0
3426,118,-118.0
3427,144,-144.0
3428,145,-145.0
3429,88,-88.0
3430,111,-111.0
3431,154,-154.0
3432,90,-90.0
3433,96,-96.0
3434,156,-156.0
3435,164,-164.0
3436,90,-90.0
3437,103,-103.0
3438,136,-136.0
3439,142,-142.0
3440,149,-149.0
3441,109,-109.0
3442,149,-149.0
3443,111,-111.0
3444,138,-138.0
3445,154,-154.0
3446,166,-166.0
3447,155,-155.0
3448,99,-99.0
3449,151,-151.0
3450,85,-85.0
3451,105,-105.0
3452,148,-148.0
3453,86,-86.0
3454,110,-110.0
3455,158,-158.0
3456,103,-103.0
3457,147,-147.0
3458,157,-157.0
3459,156,-156.0
3460,94,-94.0
3461,84,-84.0
3462,108,-108.0
3463,152,-152.0
3464,89,-89.0
3465,111,-111.0
3466,97,-97.0
3467,108,-108.0
3468,110,-110.0
3469,200,-200.0
3470,200,-200.0
3471,165,-165.0
3472,85,-85.0
3473,154,-154.0
3474,94,-94.0
3475,93,-93.0
3476,149,-149.0
3477,107,-107.0
3478,152,-152.0
3479,89,-89.0
3480,91,-91.0
3481,109,-109.0
3482,153,-153.0
3483,168,-168.0
3484,152,-152.0
3485,107,-107.0
3486,194,-194.0
3487,107,-107.0
3488,107,-107.0
3489,154,-154.0
3490,151,-151.0
3491,117,-117.0
3492,87,-87.0
3493,147,-147.0
3494,107,-107.0
3495,106,-106.0
3496,99,-99.0
3497,83,-83.0
3498,89,-89.0
3499,151,-151.0
3500,107,-107.0
3501,88,-88.0
3502,115,-115.0
3503,167,-167.0
3504,107,-107.0
3505,85,-85.0
3506,117,-117.0
3507,112,-112.0
3508,88,-88.0
3509,87,-87.0
3510,106,-106.0
3511,192,-192.0
3512,183,-183.0
3513,106,-106.0
3514,108,-108.0
3515,112,-112.0
3516,125,-125.0
3517,96,-96.0
3518,97,-97.0
3519,109,-109.0
3520,85,-85.0
3521,96,-96.0
3522,95,-95.0
3523,92,-92.0
3524,169,-169.0
3525,115,-115.0
3526,106,-106.0
3527,160,-160.0
3528,152,-152.0
3529,96,-96.0
3530,200,-200.0
3531,85,-85.0
3532,121,-121.0
3533,104,-104.0
3534,124,-124.0
3535,106,-106.0
3536,107,-107.0
3537,113,-113.0
3538,107,-107.0
3539,106,-106.0
3540,109,-109.0
3541,166,-166.0
3542,119,-119.0
3543,113,-113.0
3544,120,-120.0
3545,107,-107.0
3546,106,-106.0
3547,105,-105.0
3548,147,-147.0
3549,176,-176.0
3550,113,-113.0
3551,118,-118.0
3552,107,-107.0
3553,89,-89.0
3554,190,-190.0
3555,157,-157.0
3556,165,-165.0
3557,183,-183.0
3558,169,-169.0
3559,115,-115.0
3560,157,-157.0
3561,113,-113.0
3562,151,-151.0
3563,166,-166.0
3564,115,-115.0
3565,150,-150.0
3566,177,-177.0
3567,111,-111.0
3568,200,-200.0
3569,158,-158.0
3570,171,-171.0
3571,112,-112.0
3572,142,-142.0
3573,167,-167.0
3574,152,-152.0
3575,138,-138.0
3576,164,-164.0
3577,169,-169.0
3578,166,-166.0
3579,195,-195.0
3580,110,-110.0
3581,155,-155.0
3582,110,-110.0
3583,160,-160.0
3584,111,-111.0
3585,107,-107.0
3586,111,-111.0
3587,117,-117.0
3588,135,-135.0
3589,92,-92.0
3590,141,-141.0
3591,136,-136.0
3592,139,-139.0
3593,110,-110.0
3594,95,-95.0
3595,115,-115.0
3596,107,-107.0
3597,109,-109.0
3598,109,-109.0
3599,111,-111.0
3600,142,-142.0
3601,140,-140.0
3602,113,-113.0
3603,117,-117.0
3604,113,-113.0
3605,115,-115.0
3606,113,-113.0
3607,110,-110.0
3608,97,-97.0
3609,112,-112.0
3610,160,-160.0
3611,153,-153.0
3612,109,-109.0
3613,114,-114.0
3614,111,-111.0
3615,164,-164.0
3616,110,-110.0
3617,168,-168.0
3618,91,-91.0
3619,90,-90.0
3620,112,-112.0
3621,89,-89.0
3622,116,-116.0
3623,169,-169.0
3624,159,-159.0
3625,114,-114.0
3626,118,-118.0
3627,102,-102.0
3628,116,-116.0
3629,169,-169.0
3630,114,-114.0
3631,93,-93.0
3632,112,-112.0
3633,155,-155.0
3634,111,-111.0
3635,145,-145.0
3636,110,-110.0
3637,116,-116.0
3638,102,-102.0
3639,106,-106.0
3640,95,-95.0
3641,114,-114.0
3642,88,-88.0
3643,158,-158.0
3644,93,-93.0
3645,113,-113.0
3646,111,-111.0
3647,95,-95.0
3648,113,-113.0
3649,166,-166.0
3650,171,-171.0
3651,105,-105.0
3652,90,-90.0
3653,114,-114.0
3654,110,-110.0
3655,110,-110.0
3656,112,-112.0
3657,89,-89.0
3658,113,-113.0
3659,103,-103.0
3660,110,-110.0
3661,110,-110.0
3662,110,-110.0
3663,112,-112.0
3664,180,-180.0
3665,99,-99.0
3666,111,-111.0
3667,112,-112.0
3668,112,-112.0
3669,92,-92.0
3670,114,-114.0
3671,91,-91.0
3672,93,-93.0
3673,110,-110.0
3674,110,-110.0
3675,116,-116.0
3676,88,-88.0
3677,151,-151.0
3678,110,-110.0
3679,90,-90.0
3680,113,-113.0
3681,105,-105.0
3682,114,-114.0
3683,112,-112.0
3684,114,-114.0
3685,113,-113.0
3686,116,-116.0
3687,112,-112.0
3688,90,-90.0
3689,110,-110.0
3690,87,-87.0
3691,115,-115.0
3692,111,-111.0
3693,108,-108.0
3694,108,-108.0
3695,114,-114.0
3696,89,-89.0
3697,110,-110.0
3698,110,-110.0
3699,112,-112.0
3700,114,-114.0
3701,200,-200.0
3702,112,-112.0
3703,117,-117.0
3704,91,-91.0
3705,117,-117.0
3706,112,-112.0
3707,114,-114.0
3708,108,-108.0
3709,112,-112.0
3710,91,-91.0
3711,125,-125.0
3712,126,-126.0
3713,98,-98.0
3714,91,-91.0
3715,86,-86.0
3716,102,-102.0
3717,94,-94.0
3718,163,-163.0
3719,94,-94.0
3720,129,-129.0
3721,117,-117.0
3722,91,-91.0
3723,92,-92.0
3724,113,-113.0
3725,99,-99.0
3726,117,-117.0
3727,161,-161.0
3728,110,-110.0
3729,89,-89.0
3730,115,-115.0
3731,152,-152.0
3732,114,-114.0
3733,88,-88.0
3734,161,-161.0
3735,114,-114.0
3736,94,-94.0
3737,98,-98.0
3738,102,-102.0
3739,109,-109.0
3740,108,-108.0
3741,112,-112.0
3742,112,-112.0
3743,89,-89.0
3744,113,-113.0
3745,108,-108.0
3746,88,-88.0
3747,100,-100.0
3748,140,-140.0
3749,118,-118.0
3750,109,-109.0
3751,200,-200.0
3752,89,-89.0
3753,92,-92.0
3754,157,-157.0
3755,94,-94.0
3756,162,-162.0
3757,87,-87.0
3758,85,-85.0
3759,86,-86.0
3760,91,-91.0
3761,162,-162.0
3762,113,-113.0
3763,105,-105.0
3764,90,-90.0
3765,104,-104.0
3766,168,-168.0
3767,95,-95.0
3768,156,-156.0
3769,113,-113.0
3770,104,-104.0
3771,172,-172.0
3772,169,-169.0
3773,89,-89.0
3774,167,-167.0
3775,108,-108.0
3776,111,-111.0
3777,108,-108.0
3778,113,-113.0
3779,93,-93.0
3780,154,-154.0
3781,88,-88.0
3782,97,-97.0
3783,116,-116.0
3784,200,-200.0
3785,110,-110.0
3786,122,-122.0
3787,107,-107.0
3788,107,-107.0
3789,109,-109.0
3790,110,-110.0
3791,88,-88.0
3792,160,-160.0
3793,95,-95.0
3794,106,-106.0
3795,110,-110.0
3796,113,-113.0
3797,155,-155.0
3798,100,-100.0
3799,118,-118.0
3800,115,-115.0
3801,86,-86.0
3802,109,-109.0
3803,88,-88.0
3804,86,-86.0
3805,84,-84.0
3806,115,-115.0
3807,91,-91.0
3808,106,-106.0
3809,111,-111.0
3810,110,-110.0
3811,89,-89.0
3812,106,-106.0
3813,96,-96.0
3814,113,-113.0
3815,109,-109.0
3816,110,-110.0
3817,104,-104.0
3818,111,-111.0
3819,115,-115.0
3820,88,-88.0
3821,117,-117.0
3822,90,-90.0
3823,89,-89.0
3824,89,-89.0
3825,106,-106.0
3826,104,-104.0
3827,105,-105.0
3828,109,-109.0
3829,89,-89.0
3830,94,-94.0
3831,109,-109.0
3832,97,-97.0
3833,95,-95.0
3834,104,-104.0
3835,100,-100.0
3836,86,-86.0
3837,90,-90.0
3838,89,-89.0
3839,109,-109.0
3840,106,-106.0
3841,107,-107.0
3842,113,-113.0
3843,110,-110.0
3844,112,-112.0
3845,105,-105.0
3846,107,-107.0
3847,86,-86.0
3848,111,-111.0
3849,105,-105.0
3850,102,-102.0
3851,111,-111.0
3852,112,-112.0
