episodes,steps,rewards
0,80,-193.75036859184928
1,94,-342.4729067247572
2,65,-90.69677195765556
3,67,-70.86344020018936
4,74,-120.06911268629581
5,87,-123.77306816378271
6,85,-151.8045065541276
7,80,-295.3829744682327
8,110,-113.09018219611698
9,128,-386.85808451501396
10,108,-127.08665583954784
11,133,-275.2333331982227
12,178,-275.07149320459416
13,105,-260.8805806332597
14,847,-259.2573187081863
15,612,-301.817981190026
16,131,-174.276926933141
17,414,-138.13593632087944
18,146,-183.42580650698045
19,262,-308.4117014246016
20,1000,-202.45159289587588
21,127,-223.59510627296567
22,1000,-156.89861616163407
23,1000,-190.52833422443314
24,1000,-122.20313091617224
25,273,-245.40451224181376
26,1000,-100.77324557099834
27,115,-237.50654356094296
28,1000,-67.20153372148808
29,1000,-116.1014053461491
30,699,-132.39420179179623
31,1000,-171.21610885488522
32,1000,-113.58133588151529
33,1000,-14.043809284743169
34,1000,-20.620373073472255
35,874,-246.22979914393244
36,1000,-145.99938825934862
37,1000,-59.27358224263259
38,728,-206.32173291914123
39,1000,-74.33403378665804
40,1000,-96.76953675001155
41,1000,-137.8685096331355
42,1000,-102.38819819145095
43,1000,-93.09355655641652
44,1000,-117.13417294154152
45,1000,-91.32458507584847
46,1000,-106.83008291000785
47,1000,-134.28017841180647
48,1000,-88.8606794195497
49,1000,-81.89507035589283
50,1000,-29.218299683537378
51,1000,-166.66307785436615
52,1000,-64.11235939050326
53,1000,-77.98912762304798
54,1000,-59.47015885103335
55,129,-115.34062498244202
56,1000,-148.16076861171197
57,1000,-63.42252434360309
58,1000,-43.49418275689143
59,1000,-98.77757170767103
60,1000,-102.35883764727683
61,474,-106.94321162810483
62,1000,-29.16841461689348
63,1000,-117.17918131861936
64,1000,-130.6770302716628
65,1000,-40.19140272927177
66,1000,1.1001843566447485
67,1000,-33.27153166926901
68,1000,-35.21771788873424
69,1000,-46.183518853949366
70,1000,-41.03275088489278
71,1000,-43.978580801064616
72,1000,-17.167728290841715
73,1000,-73.03637187793953
74,1000,-44.131831893995844
75,1000,-33.8468633693814
76,1000,-37.8290553068142
77,1000,-35.28551822477411
78,1000,-22.581401682929766
79,1000,-52.26922346624761
80,1000,-54.45351528969526
81,1000,-4.2786802999122155
82,1000,-24.99409503670029
83,1000,-63.40645804413419
84,1000,-29.03827995053235
85,1000,-63.779653647891024
86,1000,-26.536880422862385
87,1000,12.38680803344289
88,1000,-30.50489650356258
89,1000,1.8831809257460606
90,1000,-23.367694010754825
91,1000,-50.88182494210996
92,1000,-61.15467579181753
93,265,-241.0018264805084
94,1000,7.794683565049253
95,1000,-9.069207847184204
96,1000,-48.601314937708935
97,1000,-63.06382831155775
98,1000,-53.15914160755322
99,1000,-32.65981669315183
100,811,-293.59161801907396
101,1000,-38.99496559100707
102,1000,-51.761001521609856
103,1000,-57.01404863985091
104,1000,-21.834757543707212
105,639,-110.78156198175758
106,1000,-17.06905078363992
107,1000,-15.868419296529503
108,1000,1.7582452924626375
109,1000,-23.55261122426644
110,1000,-20.66833408905765
111,507,-82.74106430787111
112,506,-84.86592385527734
113,819,188.57458997324306
114,1000,-50.76012625658349
115,1000,-70.85586212851479
116,1000,-27.84335364315766
117,1000,-22.279769824945834
118,1000,-80.81660004071784
119,1000,-41.77891670663998
120,1000,-37.57216921241182
121,1000,-30.22663010310686
122,1000,10.513378766808112
123,1000,-7.74800846093849
124,1000,-35.54943895610476
125,1000,-28.017900511621587
126,1000,-30.599209362097053
127,909,-305.28957726203305
128,695,-122.63724882252636
129,269,-49.78312966116433
130,1000,-47.21373267784311
131,1000,-19.792793538481803
132,698,204.31138336416683
133,635,173.03684959434818
134,102,-113.95705672365945
135,1000,-17.794428904220638
136,707,239.02860723882472
137,1000,-37.18190086056773
138,1000,-2.851575669033135
139,938,127.79874198391344
140,970,148.54989617198453
141,481,186.89812673163024
142,1000,-58.2621236637097
143,300,-225.1047071470456
144,832,205.26054935912947
145,877,160.66770893542383
146,790,180.83314784450397
147,1000,9.657408000288665
148,639,-251.38585434858047
149,672,182.17962730722502
150,1000,-43.17513283906288
151,583,238.93101352297398
152,572,-98.5350166592087
153,156,25.339173713603273
154,452,275.18476718081035
155,370,242.83643909287017
156,835,156.6071350526215
157,770,171.90701986522566
158,284,252.63860801312546
159,403,225.34757428733678
160,672,203.45471451109023
161,342,218.07417984541735
162,605,231.20126343242717
163,837,164.6082131787051
164,494,254.6422441088972
165,376,-87.97690733639254
166,398,254.07175859232171
167,342,11.673631343456861
168,360,-45.06308590316242
169,269,238.0805460376947
170,829,161.1895095797318
171,299,250.31852575073242
172,296,296.58308774544156
173,458,255.37032725045574
174,302,257.2889504030535
175,622,241.4056391147672
176,447,229.9479930229646
177,480,221.01912229298318
178,455,233.37780639222314
179,294,232.4963737433297
180,174,72.77206042355758
181,197,17.961594661063472
182,304,269.2689647292056
183,270,269.1016379156242
184,1000,-27.7636586967516
185,274,265.0830251959555
186,481,246.36622782025208
187,426,213.7332512884866
188,460,226.75135424789897
189,967,192.1030095903559
190,722,175.39716368996488
191,841,143.94239916455535
192,453,226.76091505094615
193,406,235.1580514395505
194,482,240.0720419312633
195,455,239.30698911060716
196,313,262.36579260270156
197,477,243.36200485519586
198,400,231.27830082028873
199,163,-199.30712595583356
200,360,245.49072239483883
