episodes,steps,rewards
0,200,-200.0
1,200,-200.0
2,200,-200.0
3,200,-200.0
4,200,-200.0
5,200,-200.0
6,200,-200.0
7,200,-200.0
8,200,-200.0
9,200,-200.0
10,200,-200.0
11,200,-200.0
12,200,-200.0
13,200,-200.0
14,200,-200.0
15,200,-200.0
16,200,-200.0
17,200,-200.0
18,200,-200.0
19,200,-200.0
20,200,-200.0
21,200,-200.0
22,171,-171.0
23,200,-200.0
24,200,-200.0
25,200,-200.0
26,200,-200.0
27,200,-200.0
28,200,-200.0
29,200,-200.0
30,200,-200.0
31,200,-200.0
32,200,-200.0
33,200,-200.0
34,134,-134.0
35,200,-200.0
36,200,-200.0
37,200,-200.0
38,200,-200.0
39,200,-200.0
40,200,-200.0
41,200,-200.0
42,200,-200.0
43,200,-200.0
44,200,-200.0
45,200,-200.0
46,200,-200.0
47,200,-200.0
48,200,-200.0
49,200,-200.0
50,200,-200.0
51,200,-200.0
52,177,-177.0
53,192,-192.0
54,200,-200.0
55,200,-200.0
56,200,-200.0
57,200,-200.0
58,200,-200.0
59,154,-154.0
60,200,-200.0
61,194,-194.0
62,200,-200.0
63,200,-200.0
64,200,-200.0
65,200,-200.0
66,200,-200.0
67,200,-200.0
68,111,-111.0
69,200,-200.0
70,200,-200.0
71,200,-200.0
72,159,-159.0
73,200,-200.0
74,200,-200.0
75,200,-200.0
76,200,-200.0
77,200,-200.0
78,200,-200.0
79,200,-200.0
80,200,-200.0
81,200,-200.0
82,200,-200.0
83,200,-200.0
84,200,-200.0
85,200,-200.0
86,200,-200.0
87,200,-200.0
88,200,-200.0
89,155,-155.0
90,200,-200.0
91,146,-146.0
92,200,-200.0
93,146,-146.0
94,157,-157.0
95,200,-200.0
96,108,-108.0
97,167,-167.0
98,200,-200.0
99,200,-200.0
100,200,-200.0
101,87,-87.0
102,96,-96.0
103,149,-149.0
104,200,-200.0
105,139,-139.0
106,149,-149.0
107,200,-200.0
108,157,-157.0
109,200,-200.0
110,185,-185.0
111,170,-170.0
112,132,-132.0
113,200,-200.0
114,124,-124.0
115,200,-200.0
116,200,-200.0
117,200,-200.0
118,200,-200.0
119,200,-200.0
120,169,-169.0
121,87,-87.0
122,200,-200.0
123,113,-113.0
124,200,-200.0
125,142,-142.0
126,146,-146.0
127,200,-200.0
128,181,-181.0
129,173,-173.0
130,200,-200.0
131,91,-91.0
132,105,-105.0
133,110,-110.0
134,200,-200.0
135,200,-200.0
136,200,-200.0
137,106,-106.0
138,93,-93.0
139,97,-97.0
140,151,-151.0
141,147,-147.0
142,91,-91.0
143,85,-85.0
144,200,-200.0
145,111,-111.0
146,86,-86.0
147,200,-200.0
148,124,-124.0
149,109,-109.0
150,200,-200.0
151,86,-86.0
152,90,-90.0
153,200,-200.0
154,167,-167.0
155,183,-183.0
156,200,-200.0
157,200,-200.0
158,177,-177.0
159,159,-159.0
160,91,-91.0
161,144,-144.0
162,158,-158.0
163,200,-200.0
164,200,-200.0
165,166,-166.0
166,159,-159.0
167,200,-200.0
168,111,-111.0
169,154,-154.0
170,113,-113.0
171,173,-173.0
172,137,-137.0
173,173,-173.0
174,200,-200.0
175,164,-164.0
176,105,-105.0
177,166,-166.0
178,128,-128.0
179,94,-94.0
180,191,-191.0
181,174,-174.0
182,161,-161.0
183,177,-177.0
184,177,-177.0
185,171,-171.0
186,161,-161.0
187,97,-97.0
188,130,-130.0
189,163,-163.0
190,160,-160.0
191,164,-164.0
192,113,-113.0
193,200,-200.0
194,190,-190.0
195,124,-124.0
196,162,-162.0
197,129,-129.0
198,100,-100.0
199,182,-182.0
200,161,-161.0
201,116,-116.0
202,127,-127.0
203,122,-122.0
204,192,-192.0
205,188,-188.0
206,200,-200.0
207,193,-193.0
208,114,-114.0
209,156,-156.0
210,117,-117.0
211,199,-199.0
212,176,-176.0
213,171,-171.0
214,85,-85.0
215,122,-122.0
216,87,-87.0
217,164,-164.0
218,124,-124.0
219,143,-143.0
220,170,-170.0
221,177,-177.0
222,122,-122.0
223,179,-179.0
224,166,-166.0
225,171,-171.0
226,101,-101.0
227,88,-88.0
228,122,-122.0
229,173,-173.0
230,115,-115.0
231,165,-165.0
232,109,-109.0
233,108,-108.0
234,175,-175.0
235,131,-131.0
236,157,-157.0
237,154,-154.0
238,89,-89.0
239,168,-168.0
240,121,-121.0
241,200,-200.0
242,172,-172.0
243,90,-90.0
244,118,-118.0
245,142,-142.0
246,165,-165.0
247,167,-167.0
248,174,-174.0
249,170,-170.0
250,173,-173.0
251,165,-165.0
252,96,-96.0
253,186,-186.0
254,200,-200.0
255,165,-165.0
256,88,-88.0
257,91,-91.0
258,84,-84.0
259,153,-153.0
260,167,-167.0
261,161,-161.0
262,96,-96.0
263,162,-162.0
264,193,-193.0
265,166,-166.0
266,164,-164.0
267,108,-108.0
268,167,-167.0
269,159,-159.0
270,113,-113.0
271,170,-170.0
272,158,-158.0
273,187,-187.0
274,140,-140.0
275,161,-161.0
276,150,-150.0
277,155,-155.0
278,85,-85.0
279,96,-96.0
280,86,-86.0
281,111,-111.0
282,98,-98.0
283,159,-159.0
284,90,-90.0
285,171,-171.0
286,113,-113.0
287,103,-103.0
288,111,-111.0
289,190,-190.0
290,112,-112.0
291,143,-143.0
292,160,-160.0
293,146,-146.0
294,154,-154.0
295,86,-86.0
296,96,-96.0
297,112,-112.0
298,150,-150.0
299,139,-139.0
300,162,-162.0
301,151,-151.0
302,149,-149.0
303,169,-169.0
304,144,-144.0
305,114,-114.0
306,135,-135.0
307,88,-88.0
308,184,-184.0
309,134,-134.0
310,85,-85.0
311,86,-86.0
312,129,-129.0
313,143,-143.0
314,88,-88.0
315,154,-154.0
316,89,-89.0
317,156,-156.0
318,166,-166.0
319,88,-88.0
320,153,-153.0
321,165,-165.0
322,88,-88.0
323,86,-86.0
324,153,-153.0
325,85,-85.0
326,146,-146.0
327,123,-123.0
328,140,-140.0
329,175,-175.0
330,89,-89.0
331,88,-88.0
332,157,-157.0
333,166,-166.0
334,147,-147.0
335,147,-147.0
336,153,-153.0
337,186,-186.0
338,143,-143.0
339,88,-88.0
340,177,-177.0
341,91,-91.0
342,139,-139.0
343,141,-141.0
344,146,-146.0
345,200,-200.0
346,91,-91.0
347,133,-133.0
348,145,-145.0
349,149,-149.0
350,87,-87.0
351,141,-141.0
352,112,-112.0
353,146,-146.0
354,93,-93.0
355,145,-145.0
356,147,-147.0
357,145,-145.0
358,104,-104.0
359,138,-138.0
360,138,-138.0
361,111,-111.0
362,158,-158.0
363,136,-136.0
364,138,-138.0
365,144,-144.0
366,88,-88.0
367,154,-154.0
368,137,-137.0
369,137,-137.0
370,153,-153.0
371,146,-146.0
372,140,-140.0
373,83,-83.0
374,154,-154.0
375,146,-146.0
376,145,-145.0
377,145,-145.0
378,142,-142.0
379,95,-95.0
380,144,-144.0
381,85,-85.0
382,85,-85.0
383,147,-147.0
384,155,-155.0
385,142,-142.0
386,151,-151.0
387,95,-95.0
388,91,-91.0
389,134,-134.0
390,135,-135.0
391,138,-138.0
392,186,-186.0
393,139,-139.0
394,163,-163.0
395,156,-156.0
396,143,-143.0
397,162,-162.0
398,123,-123.0
399,139,-139.0
400,160,-160.0
401,141,-141.0
402,136,-136.0
403,148,-148.0
404,144,-144.0
405,140,-140.0
406,94,-94.0
407,102,-102.0
408,148,-148.0
409,144,-144.0
410,137,-137.0
411,110,-110.0
412,113,-113.0
413,136,-136.0
414,136,-136.0
415,116,-116.0
416,110,-110.0
417,125,-125.0
418,91,-91.0
419,143,-143.0
420,133,-133.0
421,137,-137.0
422,146,-146.0
423,166,-166.0
424,168,-168.0
425,174,-174.0
426,114,-114.0
427,153,-153.0
428,154,-154.0
429,151,-151.0
430,149,-149.0
431,101,-101.0
432,111,-111.0
433,145,-145.0
434,152,-152.0
435,158,-158.0
436,153,-153.0
437,200,-200.0
438,152,-152.0
439,142,-142.0
440,86,-86.0
441,102,-102.0
442,88,-88.0
443,151,-151.0
444,149,-149.0
445,144,-144.0
446,178,-178.0
447,87,-87.0
448,148,-148.0
449,149,-149.0
450,150,-150.0
451,148,-148.0
452,95,-95.0
453,159,-159.0
454,154,-154.0
455,154,-154.0
456,147,-147.0
457,154,-154.0
458,148,-148.0
459,142,-142.0
460,83,-83.0
461,147,-147.0
462,87,-87.0
463,148,-148.0
464,154,-154.0
465,85,-85.0
466,141,-141.0
467,156,-156.0
468,157,-157.0
469,157,-157.0
470,163,-163.0
471,86,-86.0
472,154,-154.0
473,159,-159.0
474,153,-153.0
475,158,-158.0
476,161,-161.0
477,162,-162.0
478,168,-168.0
479,163,-163.0
480,157,-157.0
481,157,-157.0
482,168,-168.0
483,155,-155.0
484,151,-151.0
485,200,-200.0
486,142,-142.0
487,88,-88.0
488,157,-157.0
489,134,-134.0
490,88,-88.0
491,93,-93.0
492,145,-145.0
493,141,-141.0
494,140,-140.0
495,149,-149.0
496,142,-142.0
497,165,-165.0
498,139,-139.0
499,165,-165.0
500,85,-85.0
501,143,-143.0
502,142,-142.0
503,138,-138.0
504,148,-148.0
505,143,-143.0
506,147,-147.0
507,155,-155.0
508,146,-146.0
509,145,-145.0
510,200,-200.0
511,149,-149.0
512,145,-145.0
513,200,-200.0
514,152,-152.0
515,200,-200.0
516,145,-145.0
517,200,-200.0
518,152,-152.0
519,200,-200.0
520,143,-143.0
521,141,-141.0
522,151,-151.0
523,145,-145.0
524,145,-145.0
525,145,-145.0
526,161,-161.0
527,153,-153.0
528,141,-141.0
529,200,-200.0
530,137,-137.0
531,132,-132.0
532,85,-85.0
533,139,-139.0
534,132,-132.0
535,156,-156.0
536,91,-91.0
537,150,-150.0
538,106,-106.0
539,156,-156.0
540,142,-142.0
541,140,-140.0
542,169,-169.0
543,88,-88.0
544,136,-136.0
545,144,-144.0
546,147,-147.0
547,104,-104.0
548,98,-98.0
549,156,-156.0
550,183,-183.0
551,89,-89.0
552,161,-161.0
553,164,-164.0
554,153,-153.0
555,172,-172.0
556,90,-90.0
557,166,-166.0
558,160,-160.0
559,158,-158.0
560,156,-156.0
561,166,-166.0
562,165,-165.0
563,178,-178.0
564,162,-162.0
565,88,-88.0
566,139,-139.0
567,86,-86.0
568,88,-88.0
569,171,-171.0
570,152,-152.0
571,150,-150.0
572,139,-139.0
573,144,-144.0
574,150,-150.0
575,94,-94.0
576,99,-99.0
577,162,-162.0
578,87,-87.0
579,85,-85.0
580,170,-170.0
581,87,-87.0
582,155,-155.0
583,95,-95.0
584,150,-150.0
585,153,-153.0
586,147,-147.0
587,96,-96.0
588,146,-146.0
589,148,-148.0
590,142,-142.0
591,141,-141.0
592,180,-180.0
593,183,-183.0
594,123,-123.0
595,160,-160.0
596,141,-141.0
597,166,-166.0
598,142,-142.0
599,152,-152.0
600,163,-163.0
601,146,-146.0
602,156,-156.0
603,155,-155.0
604,158,-158.0
605,123,-123.0
606,163,-163.0
607,170,-170.0
608,148,-148.0
609,192,-192.0
610,164,-164.0
611,146,-146.0
612,173,-173.0
613,144,-144.0
614,142,-142.0
615,178,-178.0
616,145,-145.0
617,153,-153.0
618,143,-143.0
619,95,-95.0
620,160,-160.0
621,149,-149.0
622,168,-168.0
623,155,-155.0
624,167,-167.0
625,200,-200.0
626,150,-150.0
627,178,-178.0
628,186,-186.0
629,101,-101.0
630,169,-169.0
631,145,-145.0
632,150,-150.0
633,199,-199.0
634,157,-157.0
635,168,-168.0
636,174,-174.0
637,153,-153.0
638,149,-149.0
639,90,-90.0
640,96,-96.0
641,96,-96.0
642,143,-143.0
643,184,-184.0
644,169,-169.0
645,93,-93.0
646,164,-164.0
647,93,-93.0
648,113,-113.0
649,102,-102.0
650,151,-151.0
651,145,-145.0
652,161,-161.0
653,87,-87.0
654,91,-91.0
655,139,-139.0
656,167,-167.0
657,144,-144.0
658,88,-88.0
659,147,-147.0
660,88,-88.0
661,100,-100.0
662,189,-189.0
663,138,-138.0
664,159,-159.0
665,144,-144.0
666,86,-86.0
667,140,-140.0
668,200,-200.0
669,200,-200.0
670,200,-200.0
671,97,-97.0
672,90,-90.0
673,171,-171.0
674,162,-162.0
675,108,-108.0
676,163,-163.0
677,162,-162.0
678,152,-152.0
679,165,-165.0
680,159,-159.0
681,93,-93.0
682,200,-200.0
683,101,-101.0
684,163,-163.0
685,156,-156.0
686,155,-155.0
687,187,-187.0
688,200,-200.0
689,93,-93.0
690,113,-113.0
691,104,-104.0
692,145,-145.0
693,97,-97.0
694,180,-180.0
695,160,-160.0
696,144,-144.0
697,116,-116.0
698,145,-145.0
699,139,-139.0
700,200,-200.0
701,93,-93.0
702,147,-147.0
703,96,-96.0
704,148,-148.0
705,109,-109.0
706,187,-187.0
707,151,-151.0
708,168,-168.0
709,123,-123.0
710,149,-149.0
711,171,-171.0
712,200,-200.0
713,95,-95.0
714,169,-169.0
715,87,-87.0
716,86,-86.0
717,200,-200.0
718,157,-157.0
719,95,-95.0
720,103,-103.0
721,166,-166.0
722,85,-85.0
723,157,-157.0
724,111,-111.0
725,158,-158.0
726,200,-200.0
727,125,-125.0
728,88,-88.0
729,200,-200.0
730,86,-86.0
731,101,-101.0
732,158,-158.0
733,200,-200.0
734,198,-198.0
735,156,-156.0
736,108,-108.0
737,162,-162.0
738,91,-91.0
739,200,-200.0
740,162,-162.0
741,200,-200.0
742,189,-189.0
743,200,-200.0
744,161,-161.0
745,153,-153.0
746,160,-160.0
747,118,-118.0
748,159,-159.0
749,136,-136.0
750,103,-103.0
751,197,-197.0
752,200,-200.0
753,159,-159.0
754,200,-200.0
755,200,-200.0
756,125,-125.0
757,200,-200.0
758,200,-200.0
759,171,-171.0
760,138,-138.0
761,171,-171.0
762,142,-142.0
763,200,-200.0
764,200,-200.0
765,175,-175.0
766,171,-171.0
767,185,-185.0
768,200,-200.0
769,186,-186.0
770,121,-121.0
771,107,-107.0
772,200,-200.0
773,173,-173.0
774,200,-200.0
775,200,-200.0
776,135,-135.0
777,200,-200.0
778,200,-200.0
779,112,-112.0
780,200,-200.0
781,200,-200.0
782,200,-200.0
783,200,-200.0
784,200,-200.0
785,92,-92.0
786,128,-128.0
787,172,-172.0
788,192,-192.0
789,190,-190.0
790,110,-110.0
791,167,-167.0
792,194,-194.0
793,125,-125.0
794,159,-159.0
795,200,-200.0
796,200,-200.0
797,167,-167.0
798,188,-188.0
799,91,-91.0
800,87,-87.0
801,153,-153.0
802,126,-126.0
803,164,-164.0
804,175,-175.0
805,133,-133.0
806,173,-173.0
807,98,-98.0
808,95,-95.0
809,94,-94.0
810,170,-170.0
811,200,-200.0
812,103,-103.0
813,174,-174.0
814,159,-159.0
815,129,-129.0
816,98,-98.0
817,91,-91.0
818,200,-200.0
819,95,-95.0
820,161,-161.0
821,115,-115.0
822,162,-162.0
823,89,-89.0
824,126,-126.0
825,200,-200.0
826,169,-169.0
827,132,-132.0
828,91,-91.0
829,156,-156.0
830,148,-148.0
831,169,-169.0
832,148,-148.0
833,124,-124.0
834,112,-112.0
835,148,-148.0
836,158,-158.0
837,88,-88.0
838,159,-159.0
839,159,-159.0
840,149,-149.0
841,149,-149.0
842,151,-151.0
843,164,-164.0
844,154,-154.0
845,145,-145.0
846,87,-87.0
847,91,-91.0
848,182,-182.0
849,91,-91.0
850,156,-156.0
851,96,-96.0
852,189,-189.0
853,99,-99.0
854,101,-101.0
855,156,-156.0
856,151,-151.0
857,174,-174.0
858,166,-166.0
859,153,-153.0
860,196,-196.0
861,147,-147.0
862,155,-155.0
863,155,-155.0
864,147,-147.0
865,153,-153.0
866,139,-139.0
867,141,-141.0
868,178,-178.0
869,98,-98.0
870,113,-113.0
871,144,-144.0
872,89,-89.0
873,143,-143.0
874,139,-139.0
875,155,-155.0
876,151,-151.0
877,113,-113.0
878,143,-143.0
879,182,-182.0
880,159,-159.0
881,117,-117.0
882,140,-140.0
883,104,-104.0
884,114,-114.0
885,113,-113.0
886,156,-156.0
887,111,-111.0
888,155,-155.0
889,160,-160.0
890,159,-159.0
891,88,-88.0
892,118,-118.0
893,159,-159.0
894,168,-168.0
895,92,-92.0
896,84,-84.0
897,102,-102.0
898,122,-122.0
899,115,-115.0
900,156,-156.0
901,145,-145.0
902,93,-93.0
903,166,-166.0
904,187,-187.0
905,86,-86.0
906,159,-159.0
907,92,-92.0
908,164,-164.0
909,161,-161.0
910,180,-180.0
911,186,-186.0
912,157,-157.0
913,157,-157.0
914,158,-158.0
915,159,-159.0
916,157,-157.0
917,162,-162.0
918,106,-106.0
919,86,-86.0
920,160,-160.0
921,156,-156.0
922,152,-152.0
923,96,-96.0
924,192,-192.0
925,88,-88.0
926,91,-91.0
927,112,-112.0
928,161,-161.0
929,151,-151.0
930,98,-98.0
931,188,-188.0
932,157,-157.0
933,162,-162.0
934,190,-190.0
935,168,-168.0
936,100,-100.0
937,89,-89.0
938,112,-112.0
939,156,-156.0
940,174,-174.0
941,156,-156.0
942,164,-164.0
943,132,-132.0
944,158,-158.0
945,200,-200.0
946,200,-200.0
947,200,-200.0
948,85,-85.0
949,200,-200.0
950,157,-157.0
951,89,-89.0
952,192,-192.0
953,200,-200.0
954,200,-200.0
955,136,-136.0
956,200,-200.0
957,200,-200.0
958,139,-139.0
959,200,-200.0
960,114,-114.0
961,120,-120.0
962,118,-118.0
963,102,-102.0
964,165,-165.0
965,158,-158.0
966,200,-200.0
967,145,-145.0
968,121,-121.0
969,94,-94.0
970,90,-90.0
971,153,-153.0
972,180,-180.0
973,140,-140.0
974,159,-159.0
975,198,-198.0
976,115,-115.0
977,117,-117.0
978,114,-114.0
979,165,-165.0
980,99,-99.0
981,87,-87.0
982,154,-154.0
983,122,-122.0
984,117,-117.0
985,116,-116.0
986,117,-117.0
987,157,-157.0
988,101,-101.0
989,117,-117.0
990,111,-111.0
991,86,-86.0
992,150,-150.0
993,92,-92.0
994,109,-109.0
995,149,-149.0
996,86,-86.0
997,190,-190.0
998,163,-163.0
999,121,-121.0
1000,122,-122.0
1001,114,-114.0
1002,115,-115.0
1003,119,-119.0
1004,114,-114.0
1005,160,-160.0
1006,92,-92.0
1007,85,-85.0
1008,147,-147.0
1009,90,-90.0
1010,156,-156.0
1011,151,-151.0
1012,152,-152.0
1013,168,-168.0
1014,120,-120.0
1015,97,-97.0
1016,125,-125.0
1017,119,-119.0
1018,114,-114.0
1019,149,-149.0
1020,116,-116.0
1021,88,-88.0
1022,130,-130.0
1023,119,-119.0
1024,111,-111.0
1025,89,-89.0
1026,84,-84.0
1027,88,-88.0
1028,125,-125.0
1029,146,-146.0
1030,151,-151.0
1031,148,-148.0
1032,123,-123.0
1033,94,-94.0
1034,172,-172.0
1035,99,-99.0
1036,147,-147.0
1037,152,-152.0
1038,102,-102.0
1039,89,-89.0
1040,88,-88.0
1041,101,-101.0
1042,114,-114.0
1043,116,-116.0
1044,149,-149.0
1045,120,-120.0
1046,114,-114.0
1047,112,-112.0
1048,95,-95.0
1049,110,-110.0
1050,87,-87.0
1051,149,-149.0
1052,119,-119.0
1053,111,-111.0
1054,87,-87.0
1055,114,-114.0
1056,111,-111.0
1057,111,-111.0
1058,153,-153.0
1059,106,-106.0
1060,110,-110.0
1061,112,-112.0
1062,114,-114.0
1063,88,-88.0
1064,95,-95.0
1065,113,-113.0
1066,130,-130.0
1067,90,-90.0
1068,105,-105.0
1069,111,-111.0
1070,105,-105.0
1071,168,-168.0
1072,115,-115.0
1073,119,-119.0
1074,123,-123.0
1075,111,-111.0
1076,149,-149.0
1077,93,-93.0
1078,154,-154.0
1079,169,-169.0
1080,152,-152.0
1081,130,-130.0
1082,86,-86.0
1083,123,-123.0
1084,107,-107.0
1085,84,-84.0
1086,125,-125.0
1087,128,-128.0
1088,94,-94.0
1089,124,-124.0
1090,118,-118.0
1091,112,-112.0
1092,90,-90.0
1093,126,-126.0
1094,120,-120.0
1095,123,-123.0
1096,189,-189.0
1097,116,-116.0
1098,108,-108.0
1099,116,-116.0
1100,94,-94.0
1101,112,-112.0
1102,111,-111.0
1103,106,-106.0
1104,84,-84.0
1105,120,-120.0
1106,159,-159.0
1107,147,-147.0
1108,98,-98.0
1109,128,-128.0
1110,143,-143.0
1111,116,-116.0
1112,169,-169.0
1113,125,-125.0
1114,120,-120.0
1115,90,-90.0
1116,120,-120.0
1117,127,-127.0
1118,116,-116.0
1119,114,-114.0
1120,122,-122.0
1121,153,-153.0
1122,123,-123.0
1123,130,-130.0
1124,173,-173.0
1125,163,-163.0
1126,141,-141.0
1127,106,-106.0
1128,133,-133.0
1129,110,-110.0
1130,92,-92.0
1131,145,-145.0
1132,163,-163.0
1133,103,-103.0
1134,200,-200.0
1135,144,-144.0
1136,181,-181.0
1137,147,-147.0
1138,155,-155.0
1139,173,-173.0
1140,117,-117.0
1141,169,-169.0
1142,163,-163.0
1143,178,-178.0
1144,149,-149.0
1145,128,-128.0
1146,174,-174.0
1147,145,-145.0
1148,163,-163.0
1149,141,-141.0
1150,138,-138.0
1151,151,-151.0
1152,142,-142.0
1153,187,-187.0
1154,169,-169.0
1155,155,-155.0
1156,119,-119.0
1157,130,-130.0
1158,155,-155.0
1159,110,-110.0
1160,146,-146.0
1161,156,-156.0
1162,149,-149.0
1163,150,-150.0
1164,155,-155.0
1165,157,-157.0
1166,173,-173.0
1167,136,-136.0
1168,135,-135.0
1169,112,-112.0
1170,108,-108.0
1171,110,-110.0
1172,141,-141.0
1173,114,-114.0
1174,115,-115.0
1175,159,-159.0
1176,146,-146.0
1177,111,-111.0
1178,113,-113.0
1179,111,-111.0
1180,114,-114.0
1181,109,-109.0
1182,122,-122.0
1183,108,-108.0
1184,156,-156.0
1185,163,-163.0
1186,120,-120.0
1187,112,-112.0
1188,105,-105.0
1189,116,-116.0
1190,118,-118.0
1191,110,-110.0
1192,157,-157.0
1193,160,-160.0
1194,160,-160.0
1195,111,-111.0
1196,153,-153.0
1197,159,-159.0
1198,161,-161.0
1199,111,-111.0
1200,155,-155.0
1201,138,-138.0
1202,162,-162.0
1203,107,-107.0
1204,108,-108.0
1205,163,-163.0
1206,156,-156.0
1207,158,-158.0
1208,156,-156.0
1209,116,-116.0
1210,89,-89.0
1211,153,-153.0
1212,115,-115.0
1213,151,-151.0
1214,92,-92.0
1215,150,-150.0
1216,98,-98.0
1217,88,-88.0
1218,154,-154.0
1219,88,-88.0
1220,99,-99.0
1221,109,-109.0
1222,153,-153.0
1223,105,-105.0
1224,110,-110.0
1225,167,-167.0
1226,89,-89.0
1227,110,-110.0
1228,97,-97.0
1229,107,-107.0
1230,107,-107.0
1231,149,-149.0
1232,86,-86.0
1233,112,-112.0
1234,89,-89.0
1235,155,-155.0
1236,160,-160.0
1237,161,-161.0
1238,186,-186.0
1239,179,-179.0
1240,93,-93.0
1241,155,-155.0
1242,150,-150.0
1243,92,-92.0
1244,91,-91.0
1245,176,-176.0
1246,163,-163.0
1247,84,-84.0
1248,120,-120.0
1249,155,-155.0
1250,148,-148.0
1251,116,-116.0
1252,89,-89.0
1253,123,-123.0
1254,106,-106.0
1255,110,-110.0
1256,95,-95.0
1257,149,-149.0
1258,87,-87.0
1259,95,-95.0
1260,146,-146.0
1261,87,-87.0
1262,174,-174.0
1263,149,-149.0
1264,110,-110.0
1265,83,-83.0
1266,119,-119.0
1267,200,-200.0
1268,200,-200.0
1269,166,-166.0
1270,155,-155.0
1271,153,-153.0
1272,145,-145.0
1273,162,-162.0
1274,146,-146.0
1275,149,-149.0
1276,148,-148.0
1277,149,-149.0
1278,155,-155.0
1279,154,-154.0
1280,94,-94.0
1281,156,-156.0
1282,157,-157.0
1283,149,-149.0
1284,147,-147.0
1285,144,-144.0
1286,99,-99.0
1287,89,-89.0
1288,145,-145.0
1289,85,-85.0
1290,136,-136.0
1291,145,-145.0
1292,184,-184.0
1293,161,-161.0
1294,85,-85.0
1295,150,-150.0
1296,141,-141.0
1297,86,-86.0
1298,144,-144.0
1299,85,-85.0
1300,100,-100.0
1301,144,-144.0
1302,85,-85.0
1303,163,-163.0
1304,85,-85.0
1305,143,-143.0
1306,88,-88.0
1307,86,-86.0
1308,87,-87.0
1309,153,-153.0
1310,152,-152.0
1311,149,-149.0
1312,106,-106.0
1313,145,-145.0
1314,152,-152.0
1315,88,-88.0
1316,159,-159.0
1317,141,-141.0
1318,200,-200.0
1319,150,-150.0
1320,147,-147.0
1321,93,-93.0
1322,145,-145.0
1323,87,-87.0
1324,141,-141.0
1325,85,-85.0
1326,95,-95.0
1327,153,-153.0
1328,141,-141.0
1329,152,-152.0
1330,149,-149.0
1331,105,-105.0
1332,138,-138.0
1333,91,-91.0
1334,121,-121.0
1335,88,-88.0
1336,85,-85.0
1337,108,-108.0
1338,138,-138.0
1339,140,-140.0
1340,137,-137.0
1341,91,-91.0
1342,141,-141.0
1343,137,-137.0
1344,134,-134.0
1345,200,-200.0
1346,137,-137.0
1347,146,-146.0
1348,149,-149.0
1349,92,-92.0
1350,145,-145.0
1351,141,-141.0
1352,142,-142.0
1353,138,-138.0
1354,141,-141.0
1355,138,-138.0
1356,141,-141.0
1357,135,-135.0
1358,140,-140.0
1359,139,-139.0
1360,140,-140.0
1361,141,-141.0
1362,143,-143.0
1363,155,-155.0
1364,136,-136.0
1365,149,-149.0
1366,152,-152.0
1367,88,-88.0
1368,163,-163.0
1369,141,-141.0
1370,85,-85.0
1371,159,-159.0
1372,136,-136.0
1373,171,-171.0
1374,103,-103.0
1375,136,-136.0
1376,138,-138.0
1377,144,-144.0
1378,152,-152.0
1379,157,-157.0
1380,92,-92.0
1381,100,-100.0
1382,147,-147.0
1383,147,-147.0
1384,152,-152.0
1385,200,-200.0
1386,174,-174.0
1387,182,-182.0
1388,133,-133.0
1389,117,-117.0
1390,137,-137.0
1391,169,-169.0
1392,134,-134.0
1393,133,-133.0
1394,180,-180.0
1395,114,-114.0
1396,113,-113.0
1397,93,-93.0
1398,142,-142.0
1399,91,-91.0
1400,141,-141.0
1401,159,-159.0
1402,99,-99.0
1403,111,-111.0
1404,116,-116.0
1405,187,-187.0
1406,93,-93.0
1407,146,-146.0
1408,131,-131.0
1409,145,-145.0
1410,147,-147.0
1411,181,-181.0
1412,161,-161.0
1413,191,-191.0
1414,164,-164.0
1415,114,-114.0
1416,153,-153.0
1417,154,-154.0
1418,103,-103.0
1419,148,-148.0
1420,153,-153.0
1421,151,-151.0
1422,151,-151.0
1423,153,-153.0
1424,145,-145.0
1425,109,-109.0
1426,147,-147.0
1427,130,-130.0
1428,112,-112.0
1429,117,-117.0
1430,178,-178.0
1431,194,-194.0
1432,117,-117.0
1433,119,-119.0
1434,200,-200.0
1435,124,-124.0
1436,125,-125.0
1437,124,-124.0
1438,112,-112.0
1439,199,-199.0
1440,135,-135.0
1441,137,-137.0
1442,200,-200.0
1443,116,-116.0
1444,128,-128.0
1445,141,-141.0
1446,125,-125.0
1447,190,-190.0
1448,177,-177.0
1449,125,-125.0
1450,200,-200.0
1451,117,-117.0
1452,179,-179.0
1453,182,-182.0
1454,200,-200.0
1455,114,-114.0
1456,176,-176.0
1457,119,-119.0
1458,110,-110.0
1459,111,-111.0
1460,111,-111.0
1461,200,-200.0
1462,159,-159.0
1463,115,-115.0
1464,110,-110.0
1465,110,-110.0
1466,109,-109.0
1467,109,-109.0
1468,110,-110.0
1469,116,-116.0
1470,114,-114.0
1471,163,-163.0
1472,179,-179.0
1473,116,-116.0
1474,169,-169.0
1475,151,-151.0
1476,111,-111.0
1477,170,-170.0
1478,104,-104.0
1479,156,-156.0
1480,152,-152.0
1481,197,-197.0
1482,106,-106.0
1483,199,-199.0
1484,106,-106.0
1485,155,-155.0
1486,149,-149.0
1487,106,-106.0
1488,156,-156.0
1489,106,-106.0
1490,105,-105.0
1491,147,-147.0
1492,106,-106.0
1493,105,-105.0
1494,170,-170.0
1495,106,-106.0
1496,106,-106.0
1497,129,-129.0
1498,150,-150.0
1499,184,-184.0
1500,87,-87.0
1501,106,-106.0
1502,108,-108.0
1503,149,-149.0
1504,143,-143.0
1505,106,-106.0
1506,117,-117.0
1507,110,-110.0
1508,114,-114.0
1509,122,-122.0
1510,163,-163.0
1511,116,-116.0
1512,109,-109.0
1513,104,-104.0
1514,105,-105.0
1515,106,-106.0
1516,86,-86.0
1517,138,-138.0
1518,106,-106.0
1519,106,-106.0
1520,146,-146.0
1521,105,-105.0
1522,107,-107.0
1523,111,-111.0
1524,107,-107.0
1525,93,-93.0
1526,106,-106.0
1527,104,-104.0
1528,108,-108.0
1529,146,-146.0
1530,106,-106.0
1531,106,-106.0
1532,159,-159.0
1533,105,-105.0
1534,110,-110.0
1535,86,-86.0
1536,105,-105.0
1537,105,-105.0
1538,89,-89.0
1539,89,-89.0
1540,109,-109.0
1541,127,-127.0
1542,104,-104.0
1543,104,-104.0
1544,104,-104.0
1545,104,-104.0
1546,105,-105.0
1547,108,-108.0
1548,104,-104.0
1549,106,-106.0
1550,107,-107.0
1551,119,-119.0
1552,109,-109.0
1553,104,-104.0
1554,105,-105.0
1555,97,-97.0
1556,133,-133.0
1557,153,-153.0
1558,106,-106.0
1559,91,-91.0
1560,95,-95.0
1561,148,-148.0
1562,116,-116.0
1563,158,-158.0
1564,171,-171.0
1565,161,-161.0
1566,147,-147.0
1567,132,-132.0
1568,141,-141.0
1569,148,-148.0
1570,106,-106.0
1571,136,-136.0
1572,150,-150.0
1573,126,-126.0
1574,145,-145.0
1575,135,-135.0
1576,135,-135.0
1577,138,-138.0
1578,139,-139.0
1579,151,-151.0
1580,90,-90.0
1581,96,-96.0
1582,132,-132.0
1583,159,-159.0
1584,138,-138.0
1585,137,-137.0
1586,165,-165.0
1587,169,-169.0
1588,177,-177.0
1589,191,-191.0
1590,133,-133.0
1591,134,-134.0
1592,131,-131.0
1593,87,-87.0
1594,96,-96.0
1595,88,-88.0
1596,136,-136.0
1597,180,-180.0
1598,157,-157.0
1599,111,-111.0
1600,194,-194.0
1601,149,-149.0
1602,174,-174.0
1603,90,-90.0
1604,102,-102.0
1605,107,-107.0
1606,106,-106.0
1607,108,-108.0
1608,88,-88.0
1609,145,-145.0
1610,165,-165.0
1611,86,-86.0
1612,104,-104.0
1613,87,-87.0
1614,144,-144.0
1615,100,-100.0
1616,89,-89.0
1617,108,-108.0
1618,97,-97.0
1619,101,-101.0
1620,160,-160.0
1621,159,-159.0
1622,176,-176.0
1623,108,-108.0
1624,89,-89.0
1625,110,-110.0
1626,105,-105.0
1627,84,-84.0
1628,90,-90.0
1629,116,-116.0
1630,160,-160.0
1631,86,-86.0
1632,114,-114.0
1633,154,-154.0
1634,107,-107.0
1635,200,-200.0
1636,159,-159.0
1637,90,-90.0
1638,86,-86.0
1639,145,-145.0
1640,92,-92.0
1641,152,-152.0
1642,90,-90.0
1643,94,-94.0
1644,139,-139.0
1645,151,-151.0
1646,143,-143.0
1647,92,-92.0
1648,86,-86.0
1649,102,-102.0
1650,88,-88.0
1651,97,-97.0
1652,149,-149.0
1653,86,-86.0
1654,167,-167.0
1655,95,-95.0
1656,159,-159.0
1657,162,-162.0
1658,166,-166.0
1659,152,-152.0
1660,142,-142.0
1661,146,-146.0
1662,178,-178.0
1663,155,-155.0
1664,142,-142.0
1665,151,-151.0
1666,175,-175.0
1667,173,-173.0
1668,200,-200.0
1669,94,-94.0
1670,152,-152.0
1671,156,-156.0
1672,150,-150.0
1673,95,-95.0
1674,180,-180.0
1675,131,-131.0
1676,186,-186.0
1677,152,-152.0
1678,105,-105.0
1679,171,-171.0
1680,105,-105.0
1681,120,-120.0
1682,112,-112.0
1683,92,-92.0
1684,132,-132.0
1685,151,-151.0
1686,190,-190.0
1687,112,-112.0
1688,126,-126.0
1689,94,-94.0
1690,105,-105.0
1691,116,-116.0
1692,111,-111.0
1693,154,-154.0
1694,144,-144.0
1695,119,-119.0
1696,154,-154.0
1697,177,-177.0
1698,122,-122.0
1699,99,-99.0
1700,170,-170.0
1701,114,-114.0
1702,102,-102.0
1703,102,-102.0
1704,159,-159.0
1705,95,-95.0
1706,122,-122.0
1707,101,-101.0
1708,150,-150.0
1709,101,-101.0
1710,99,-99.0
1711,162,-162.0
1712,200,-200.0
1713,125,-125.0
1714,200,-200.0
1715,85,-85.0
1716,200,-200.0
1717,150,-150.0
1718,158,-158.0
1719,146,-146.0
1720,153,-153.0
1721,170,-170.0
1722,200,-200.0
1723,170,-170.0
1724,96,-96.0
1725,98,-98.0
1726,190,-190.0
1727,184,-184.0
1728,157,-157.0
1729,142,-142.0
1730,144,-144.0
1731,180,-180.0
1732,150,-150.0
1733,200,-200.0
1734,86,-86.0
1735,145,-145.0
1736,144,-144.0
1737,150,-150.0
1738,112,-112.0
1739,128,-128.0
1740,144,-144.0
1741,145,-145.0
1742,153,-153.0
1743,142,-142.0
1744,145,-145.0
1745,148,-148.0
1746,101,-101.0
1747,153,-153.0
1748,151,-151.0
1749,150,-150.0
1750,96,-96.0
1751,145,-145.0
1752,161,-161.0
1753,104,-104.0
1754,119,-119.0
1755,89,-89.0
1756,151,-151.0
1757,158,-158.0
1758,91,-91.0
1759,162,-162.0
1760,114,-114.0
1761,142,-142.0
1762,160,-160.0
1763,86,-86.0
1764,183,-183.0
1765,142,-142.0
1766,200,-200.0
1767,144,-144.0
1768,104,-104.0
1769,155,-155.0
1770,143,-143.0
1771,154,-154.0
1772,152,-152.0
1773,143,-143.0
1774,88,-88.0
1775,102,-102.0
1776,161,-161.0
1777,84,-84.0
1778,116,-116.0
1779,200,-200.0
1780,84,-84.0
1781,150,-150.0
1782,150,-150.0
1783,175,-175.0
1784,168,-168.0
1785,104,-104.0
1786,161,-161.0
1787,115,-115.0
1788,189,-189.0
1789,152,-152.0
1790,163,-163.0
1791,167,-167.0
1792,147,-147.0
1793,98,-98.0
1794,143,-143.0
1795,144,-144.0
1796,150,-150.0
1797,149,-149.0
1798,149,-149.0
1799,177,-177.0
1800,84,-84.0
