episodes,steps,rewards
0,200,-200.0
1,200,-200.0
2,200,-200.0
3,200,-200.0
4,200,-200.0
5,200,-200.0
6,200,-200.0
7,200,-200.0
8,200,-200.0
9,200,-200.0
10,200,-200.0
11,200,-200.0
12,200,-200.0
13,200,-200.0
14,200,-200.0
15,200,-200.0
16,200,-200.0
17,200,-200.0
18,200,-200.0
19,200,-200.0
20,200,-200.0
21,200,-200.0
22,200,-200.0
23,200,-200.0
24,200,-200.0
25,200,-200.0
26,200,-200.0
27,200,-200.0
28,200,-200.0
29,200,-200.0
30,200,-200.0
31,200,-200.0
32,200,-200.0
33,200,-200.0
34,200,-200.0
35,200,-200.0
36,200,-200.0
37,200,-200.0
38,200,-200.0
39,200,-200.0
40,200,-200.0
41,200,-200.0
42,200,-200.0
43,200,-200.0
44,200,-200.0
45,200,-200.0
46,200,-200.0
47,200,-200.0
48,200,-200.0
49,200,-200.0
50,200,-200.0
51,200,-200.0
52,200,-200.0
53,200,-200.0
54,200,-200.0
55,200,-200.0
56,200,-200.0
57,200,-200.0
58,200,-200.0
59,200,-200.0
60,200,-200.0
61,200,-200.0
62,200,-200.0
63,200,-200.0
64,200,-200.0
65,200,-200.0
66,200,-200.0
67,200,-200.0
68,200,-200.0
69,200,-200.0
70,200,-200.0
71,200,-200.0
72,200,-200.0
73,200,-200.0
74,200,-200.0
75,200,-200.0
76,200,-200.0
77,200,-200.0
78,200,-200.0
79,200,-200.0
80,200,-200.0
81,200,-200.0
82,200,-200.0
83,200,-200.0
84,200,-200.0
85,185,-185.0
86,200,-200.0
87,200,-200.0
88,200,-200.0
89,200,-200.0
90,200,-200.0
91,200,-200.0
92,200,-200.0
93,200,-200.0
94,200,-200.0
95,200,-200.0
96,200,-200.0
97,200,-200.0
98,200,-200.0
99,200,-200.0
100,200,-200.0
101,200,-200.0
102,200,-200.0
103,200,-200.0
104,200,-200.0
105,200,-200.0
106,200,-200.0
107,200,-200.0
108,200,-200.0
109,200,-200.0
110,200,-200.0
111,200,-200.0
112,200,-200.0
113,178,-178.0
114,200,-200.0
115,200,-200.0
116,123,-123.0
117,200,-200.0
118,200,-200.0
119,200,-200.0
120,200,-200.0
121,200,-200.0
122,200,-200.0
123,200,-200.0
124,200,-200.0
125,200,-200.0
126,200,-200.0
127,200,-200.0
128,200,-200.0
129,200,-200.0
130,200,-200.0
131,200,-200.0
132,200,-200.0
133,200,-200.0
134,200,-200.0
135,200,-200.0
136,200,-200.0
137,200,-200.0
138,200,-200.0
139,200,-200.0
140,200,-200.0
141,197,-197.0
142,200,-200.0
143,200,-200.0
144,200,-200.0
145,200,-200.0
146,200,-200.0
147,181,-181.0
148,200,-200.0
149,200,-200.0
150,180,-180.0
151,200,-200.0
152,152,-152.0
153,158,-158.0
154,200,-200.0
155,200,-200.0
156,199,-199.0
157,200,-200.0
158,200,-200.0
159,200,-200.0
160,169,-169.0
161,169,-169.0
162,121,-121.0
163,200,-200.0
164,145,-145.0
165,116,-116.0
166,138,-138.0
167,200,-200.0
168,147,-147.0
169,158,-158.0
170,153,-153.0
171,115,-115.0
172,179,-179.0
173,177,-177.0
174,169,-169.0
175,191,-191.0
176,200,-200.0
177,177,-177.0
178,160,-160.0
179,200,-200.0
180,160,-160.0
181,150,-150.0
182,198,-198.0
183,149,-149.0
184,149,-149.0
185,141,-141.0
186,123,-123.0
187,191,-191.0
188,170,-170.0
189,181,-181.0
190,143,-143.0
191,171,-171.0
192,200,-200.0
193,152,-152.0
194,150,-150.0
195,184,-184.0
196,153,-153.0
197,200,-200.0
198,160,-160.0
199,145,-145.0
200,200,-200.0
201,164,-164.0
202,169,-169.0
203,200,-200.0
204,192,-192.0
205,200,-200.0
206,146,-146.0
207,159,-159.0
208,200,-200.0
209,141,-141.0
210,193,-193.0
211,178,-178.0
212,151,-151.0
213,200,-200.0
214,159,-159.0
215,157,-157.0
216,200,-200.0
217,164,-164.0
218,120,-120.0
219,150,-150.0
220,152,-152.0
221,200,-200.0
222,111,-111.0
223,149,-149.0
224,162,-162.0
225,89,-89.0
226,110,-110.0
227,92,-92.0
228,134,-134.0
229,145,-145.0
230,149,-149.0
231,169,-169.0
232,111,-111.0
233,155,-155.0
234,119,-119.0
235,90,-90.0
236,175,-175.0
237,150,-150.0
238,152,-152.0
239,88,-88.0
240,175,-175.0
241,105,-105.0
242,200,-200.0
243,196,-196.0
244,117,-117.0
245,143,-143.0
246,197,-197.0
247,127,-127.0
248,126,-126.0
249,120,-120.0
250,176,-176.0
251,102,-102.0
252,156,-156.0
253,145,-145.0
254,176,-176.0
255,118,-118.0
256,148,-148.0
257,86,-86.0
258,112,-112.0
259,117,-117.0
260,112,-112.0
261,112,-112.0
262,84,-84.0
263,94,-94.0
264,116,-116.0
265,99,-99.0
266,93,-93.0
267,157,-157.0
268,105,-105.0
269,126,-126.0
270,124,-124.0
271,122,-122.0
272,115,-115.0
273,165,-165.0
274,119,-119.0
275,122,-122.0
276,143,-143.0
277,116,-116.0
278,123,-123.0
279,122,-122.0
280,122,-122.0
281,132,-132.0
282,85,-85.0
283,146,-146.0
284,86,-86.0
285,153,-153.0
286,116,-116.0
287,119,-119.0
288,130,-130.0
289,140,-140.0
290,115,-115.0
291,200,-200.0
292,153,-153.0
293,165,-165.0
294,166,-166.0
295,161,-161.0
296,138,-138.0
297,144,-144.0
298,127,-127.0
299,119,-119.0
300,114,-114.0
301,120,-120.0
302,173,-173.0
303,114,-114.0
304,112,-112.0
305,110,-110.0
306,159,-159.0
307,164,-164.0
308,151,-151.0
309,103,-103.0
310,111,-111.0
311,170,-170.0
312,91,-91.0
313,186,-186.0
314,137,-137.0
315,114,-114.0
316,145,-145.0
317,156,-156.0
318,154,-154.0
319,107,-107.0
320,146,-146.0
321,148,-148.0
322,149,-149.0
323,137,-137.0
324,89,-89.0
325,97,-97.0
326,145,-145.0
327,151,-151.0
328,138,-138.0
329,143,-143.0
330,148,-148.0
331,85,-85.0
332,137,-137.0
333,146,-146.0
334,149,-149.0
335,140,-140.0
336,166,-166.0
337,170,-170.0
338,163,-163.0
339,157,-157.0
340,143,-143.0
341,145,-145.0
342,138,-138.0
343,154,-154.0
344,148,-148.0
345,176,-176.0
346,146,-146.0
347,145,-145.0
348,110,-110.0
349,140,-140.0
350,143,-143.0
351,173,-173.0
352,106,-106.0
353,138,-138.0
354,88,-88.0
355,143,-143.0
356,150,-150.0
357,136,-136.0
358,144,-144.0
359,173,-173.0
360,140,-140.0
361,153,-153.0
362,105,-105.0
363,200,-200.0
364,111,-111.0
365,95,-95.0
366,139,-139.0
367,199,-199.0
368,105,-105.0
369,106,-106.0
370,99,-99.0
371,105,-105.0
372,113,-113.0
373,95,-95.0
374,134,-134.0
375,157,-157.0
376,106,-106.0
377,146,-146.0
378,109,-109.0
379,108,-108.0
380,107,-107.0
381,96,-96.0
382,148,-148.0
383,113,-113.0
384,89,-89.0
385,113,-113.0
386,107,-107.0
387,106,-106.0
388,105,-105.0
389,119,-119.0
390,106,-106.0
391,110,-110.0
392,105,-105.0
393,90,-90.0
394,147,-147.0
395,105,-105.0
396,108,-108.0
397,117,-117.0
398,113,-113.0
399,110,-110.0
400,109,-109.0
401,107,-107.0
402,149,-149.0
403,145,-145.0
404,105,-105.0
405,168,-168.0
406,149,-149.0
407,143,-143.0
408,106,-106.0
409,104,-104.0
410,84,-84.0
411,106,-106.0
412,111,-111.0
413,154,-154.0
414,95,-95.0
415,143,-143.0
416,158,-158.0
417,189,-189.0
418,85,-85.0
419,144,-144.0
420,152,-152.0
421,151,-151.0
422,142,-142.0
423,141,-141.0
424,139,-139.0
425,106,-106.0
426,176,-176.0
427,137,-137.0
428,104,-104.0
429,105,-105.0
430,119,-119.0
431,154,-154.0
432,108,-108.0
433,114,-114.0
434,200,-200.0
435,122,-122.0
436,200,-200.0
437,129,-129.0
438,141,-141.0
439,153,-153.0
440,136,-136.0
441,125,-125.0
442,160,-160.0
443,97,-97.0
444,161,-161.0
445,88,-88.0
446,141,-141.0
447,151,-151.0
448,156,-156.0
449,184,-184.0
450,155,-155.0
451,154,-154.0
452,146,-146.0
453,147,-147.0
454,95,-95.0
455,178,-178.0
456,144,-144.0
457,140,-140.0
458,151,-151.0
459,149,-149.0
460,141,-141.0
461,90,-90.0
462,111,-111.0
463,138,-138.0
464,139,-139.0
465,98,-98.0
466,153,-153.0
467,116,-116.0
468,123,-123.0
469,116,-116.0
470,148,-148.0
471,92,-92.0
472,163,-163.0
473,99,-99.0
474,155,-155.0
475,143,-143.0
476,160,-160.0
477,138,-138.0
478,147,-147.0
479,141,-141.0
480,98,-98.0
481,147,-147.0
482,107,-107.0
483,148,-148.0
484,145,-145.0
485,109,-109.0
486,109,-109.0
487,83,-83.0
488,152,-152.0
489,162,-162.0
490,152,-152.0
491,200,-200.0
492,173,-173.0
493,144,-144.0
494,157,-157.0
495,89,-89.0
496,145,-145.0
497,134,-134.0
498,164,-164.0
499,110,-110.0
500,153,-153.0
501,155,-155.0
502,158,-158.0
503,141,-141.0
504,170,-170.0
505,137,-137.0
506,175,-175.0
507,87,-87.0
508,200,-200.0
509,93,-93.0
510,145,-145.0
511,93,-93.0
512,143,-143.0
513,156,-156.0
514,116,-116.0
515,139,-139.0
516,143,-143.0
517,84,-84.0
518,109,-109.0
519,110,-110.0
520,94,-94.0
521,143,-143.0
522,147,-147.0
523,152,-152.0
524,141,-141.0
525,169,-169.0
526,101,-101.0
527,180,-180.0
528,112,-112.0
529,153,-153.0
530,147,-147.0
531,200,-200.0
532,143,-143.0
533,141,-141.0
534,142,-142.0
535,157,-157.0
536,140,-140.0
537,114,-114.0
538,140,-140.0
539,111,-111.0
540,140,-140.0
541,136,-136.0
542,134,-134.0
543,134,-134.0
544,92,-92.0
545,113,-113.0
546,93,-93.0
547,138,-138.0
548,142,-142.0
549,133,-133.0
550,142,-142.0
551,95,-95.0
552,139,-139.0
553,168,-168.0
554,176,-176.0
555,113,-113.0
556,141,-141.0
557,175,-175.0
558,138,-138.0
559,139,-139.0
560,139,-139.0
561,85,-85.0
562,143,-143.0
563,145,-145.0
564,84,-84.0
565,143,-143.0
566,142,-142.0
567,139,-139.0
568,145,-145.0
569,162,-162.0
570,143,-143.0
571,141,-141.0
572,147,-147.0
573,148,-148.0
574,128,-128.0
575,141,-141.0
576,139,-139.0
577,176,-176.0
578,145,-145.0
579,150,-150.0
580,154,-154.0
581,139,-139.0
582,161,-161.0
583,148,-148.0
584,140,-140.0
585,161,-161.0
586,146,-146.0
587,146,-146.0
588,144,-144.0
589,139,-139.0
590,95,-95.0
591,171,-171.0
592,145,-145.0
593,155,-155.0
594,163,-163.0
595,182,-182.0
596,117,-117.0
597,166,-166.0
598,101,-101.0
599,140,-140.0
600,89,-89.0
601,85,-85.0
602,145,-145.0
603,174,-174.0
604,162,-162.0
605,153,-153.0
606,118,-118.0
607,146,-146.0
608,162,-162.0
609,157,-157.0
610,150,-150.0
611,110,-110.0
612,149,-149.0
613,142,-142.0
614,85,-85.0
615,177,-177.0
616,161,-161.0
617,152,-152.0
618,149,-149.0
619,84,-84.0
620,145,-145.0
621,159,-159.0
622,97,-97.0
623,87,-87.0
624,152,-152.0
625,161,-161.0
626,140,-140.0
627,143,-143.0
628,86,-86.0
629,155,-155.0
630,164,-164.0
631,175,-175.0
632,149,-149.0
633,144,-144.0
634,200,-200.0
635,139,-139.0
636,136,-136.0
637,167,-167.0
638,144,-144.0
639,138,-138.0
640,143,-143.0
641,146,-146.0
642,130,-130.0
643,133,-133.0
644,154,-154.0
645,175,-175.0
646,200,-200.0
647,197,-197.0
648,141,-141.0
649,173,-173.0
650,175,-175.0
651,200,-200.0
652,181,-181.0
653,144,-144.0
654,104,-104.0
655,163,-163.0
656,160,-160.0
657,162,-162.0
658,188,-188.0
659,92,-92.0
660,151,-151.0
661,152,-152.0
662,107,-107.0
663,123,-123.0
664,86,-86.0
665,168,-168.0
666,99,-99.0
667,178,-178.0
668,124,-124.0
669,138,-138.0
670,148,-148.0
671,91,-91.0
672,88,-88.0
673,99,-99.0
674,152,-152.0
675,88,-88.0
676,85,-85.0
677,84,-84.0
678,102,-102.0
679,188,-188.0
680,173,-173.0
681,86,-86.0
682,89,-89.0
683,87,-87.0
684,100,-100.0
685,177,-177.0
686,135,-135.0
687,175,-175.0
688,194,-194.0
689,90,-90.0
690,85,-85.0
691,130,-130.0
692,91,-91.0
693,99,-99.0
694,89,-89.0
695,155,-155.0
696,89,-89.0
697,144,-144.0
698,167,-167.0
699,102,-102.0
700,159,-159.0
701,96,-96.0
702,87,-87.0
703,126,-126.0
704,93,-93.0
705,149,-149.0
706,147,-147.0
707,140,-140.0
708,119,-119.0
709,150,-150.0
710,184,-184.0
711,147,-147.0
712,97,-97.0
713,142,-142.0
714,200,-200.0
715,89,-89.0
716,95,-95.0
717,85,-85.0
718,167,-167.0
719,84,-84.0
720,144,-144.0
721,87,-87.0
722,151,-151.0
723,152,-152.0
724,142,-142.0
725,151,-151.0
726,90,-90.0
727,148,-148.0
728,178,-178.0
729,159,-159.0
730,200,-200.0
731,200,-200.0
732,92,-92.0
733,164,-164.0
734,113,-113.0
735,160,-160.0
736,101,-101.0
737,146,-146.0
738,150,-150.0
739,145,-145.0
740,173,-173.0
741,148,-148.0
742,138,-138.0
743,97,-97.0
744,83,-83.0
745,149,-149.0
746,93,-93.0
747,102,-102.0
748,153,-153.0
749,94,-94.0
750,144,-144.0
751,148,-148.0
752,90,-90.0
753,155,-155.0
754,86,-86.0
755,200,-200.0
756,149,-149.0
757,149,-149.0
758,148,-148.0
759,141,-141.0
760,150,-150.0
761,154,-154.0
762,85,-85.0
763,108,-108.0
764,90,-90.0
765,149,-149.0
766,150,-150.0
767,157,-157.0
768,149,-149.0
769,146,-146.0
770,155,-155.0
771,150,-150.0
772,146,-146.0
773,149,-149.0
774,139,-139.0
775,146,-146.0
776,145,-145.0
777,86,-86.0
778,100,-100.0
779,142,-142.0
780,142,-142.0
781,156,-156.0
782,152,-152.0
783,89,-89.0
784,148,-148.0
785,138,-138.0
786,93,-93.0
787,200,-200.0
788,145,-145.0
789,102,-102.0
790,148,-148.0
791,147,-147.0
792,157,-157.0
793,145,-145.0
794,160,-160.0
795,153,-153.0
796,99,-99.0
797,105,-105.0
798,93,-93.0
799,147,-147.0
800,160,-160.0
801,200,-200.0
802,111,-111.0
803,98,-98.0
804,149,-149.0
805,174,-174.0
806,200,-200.0
807,165,-165.0
808,166,-166.0
809,89,-89.0
810,89,-89.0
811,159,-159.0
812,159,-159.0
813,100,-100.0
814,100,-100.0
815,141,-141.0
816,92,-92.0
817,110,-110.0
818,157,-157.0
819,101,-101.0
820,88,-88.0
821,158,-158.0
822,102,-102.0
823,88,-88.0
824,159,-159.0
825,154,-154.0
826,90,-90.0
827,88,-88.0
828,200,-200.0
829,176,-176.0
830,184,-184.0
831,182,-182.0
832,188,-188.0
833,169,-169.0
834,152,-152.0
835,200,-200.0
836,174,-174.0
837,162,-162.0
838,156,-156.0
839,158,-158.0
840,163,-163.0
841,163,-163.0
842,155,-155.0
843,90,-90.0
844,155,-155.0
845,159,-159.0
846,157,-157.0
847,147,-147.0
848,89,-89.0
849,159,-159.0
850,161,-161.0
851,200,-200.0
852,200,-200.0
853,152,-152.0
854,200,-200.0
855,90,-90.0
856,200,-200.0
857,200,-200.0
858,200,-200.0
859,200,-200.0
860,150,-150.0
861,106,-106.0
862,88,-88.0
863,200,-200.0
864,160,-160.0
865,146,-146.0
866,155,-155.0
867,151,-151.0
868,99,-99.0
869,96,-96.0
870,92,-92.0
871,148,-148.0
872,151,-151.0
873,149,-149.0
874,200,-200.0
875,147,-147.0
876,145,-145.0
877,89,-89.0
878,179,-179.0
879,174,-174.0
880,148,-148.0
881,90,-90.0
882,166,-166.0
883,145,-145.0
884,89,-89.0
885,190,-190.0
886,93,-93.0
887,97,-97.0
888,93,-93.0
889,173,-173.0
890,200,-200.0
891,200,-200.0
892,200,-200.0
893,200,-200.0
894,96,-96.0
895,200,-200.0
896,112,-112.0
897,113,-113.0
898,162,-162.0
899,149,-149.0
900,200,-200.0
901,88,-88.0
902,156,-156.0
903,200,-200.0
904,157,-157.0
905,116,-116.0
906,159,-159.0
907,87,-87.0
908,97,-97.0
909,155,-155.0
910,152,-152.0
911,176,-176.0
912,153,-153.0
913,89,-89.0
914,190,-190.0
915,174,-174.0
916,150,-150.0
917,168,-168.0
918,86,-86.0
919,168,-168.0
920,141,-141.0
921,200,-200.0
922,200,-200.0
923,200,-200.0
924,200,-200.0
925,149,-149.0
926,149,-149.0
927,100,-100.0
928,174,-174.0
929,154,-154.0
930,156,-156.0
931,152,-152.0
932,200,-200.0
933,145,-145.0
934,148,-148.0
935,133,-133.0
936,149,-149.0
937,102,-102.0
938,200,-200.0
939,160,-160.0
940,153,-153.0
941,114,-114.0
942,200,-200.0
943,200,-200.0
944,200,-200.0
945,146,-146.0
946,154,-154.0
947,176,-176.0
948,200,-200.0
949,149,-149.0
950,149,-149.0
951,197,-197.0
952,114,-114.0
953,92,-92.0
954,129,-129.0
955,200,-200.0
956,200,-200.0
957,200,-200.0
958,200,-200.0
959,167,-167.0
960,153,-153.0
961,189,-189.0
962,200,-200.0
963,200,-200.0
964,126,-126.0
965,84,-84.0
966,200,-200.0
967,152,-152.0
968,193,-193.0
969,192,-192.0
970,175,-175.0
971,148,-148.0
972,200,-200.0
973,157,-157.0
974,89,-89.0
975,200,-200.0
976,156,-156.0
977,200,-200.0
978,110,-110.0
979,200,-200.0
980,116,-116.0
981,178,-178.0
982,160,-160.0
983,200,-200.0
984,160,-160.0
985,200,-200.0
986,169,-169.0
987,154,-154.0
988,200,-200.0
989,87,-87.0
990,159,-159.0
991,200,-200.0
992,164,-164.0
993,200,-200.0
994,103,-103.0
995,92,-92.0
996,87,-87.0
997,157,-157.0
998,99,-99.0
999,200,-200.0
1000,84,-84.0
