episodes,steps,rewards
0,138,-229.02112132478922
1,83,-397.61013671713556
2,74,-113.01674310967307
3,98,-248.39268022575612
4,115,-312.5160251183177
5,108,-89.19206850465261
6,87,-131.01196596124515
7,67,-68.25205649058806
8,65,-142.15845423219542
9,90,-93.57271608563866
10,113,-0.33437127218230955
11,90,-288.45712059107825
12,126,-41.24007004587594
13,91,-266.72233954635124
14,105,-28.194532021636988
15,238,-79.37555610865445
16,223,-101.13629743596483
17,95,-92.73770183262795
18,183,-69.03233411901546
19,106,-435.63266865430415
20,467,-53.90200016616398
21,263,-289.3413654066927
22,173,-243.51165291197182
23,273,-225.16951820857335
24,694,-191.66857802813036
25,394,-186.42807902477062
26,141,-123.07210898945515
27,260,-224.20842728497968
28,244,-188.76693498238183
29,349,-90.05686573959154
30,558,-241.04090727156716
31,212,-134.45067680382513
32,205,-86.61456193899282
33,167,-149.84288926045465
34,293,-250.66819437651398
35,553,-251.47061548150407
36,257,-178.71277990924096
37,408,-200.7017981447982
38,1000,-165.24558452420789
39,1000,-137.82436638080705
40,760,-252.40636968908558
41,1000,-104.941119825096
42,1000,-107.23353704712133
43,1000,-86.66823563270715
44,1000,-66.98132708808518
45,1000,-67.37540880585551
46,1000,-75.16955044294085
47,1000,-35.565043205804834
48,1000,-76.2289645016036
49,1000,-111.68033881888162
50,1000,-26.171545750837367
51,1000,-64.91975789865656
52,1000,-15.502648305273546
53,1000,-44.38874827385457
54,1000,-31.462385441009534
55,1000,-28.031603211562704
56,1000,-111.51656957355354
57,1000,-33.202609491093526
58,1000,-5.424765928558316
59,615,195.7677511649646
60,741,96.16122331316615
61,381,-225.83605464692846
62,810,-63.07007347896294
63,1000,-52.04142702438534
64,464,1.2064418488555049
65,229,69.62966837563027
66,1000,-130.21350739927234
67,1000,-47.97435440110324
68,693,-223.3520060279035
69,1000,-39.658895480403594
70,1000,-9.827587255823726
71,1000,-30.340209325168193
72,1000,-49.75996029258395
73,1000,-129.83717265228006
74,138,-162.0904313034117
75,157,-201.99550719901572
76,295,-207.7495714076185
77,1000,-70.36958996498585
78,769,168.72755808912734
79,388,6.338521813677417
80,758,-77.20435533734269
81,579,-77.48273750812174
82,482,223.91897055233974
83,1000,-24.059521753561356
84,1000,-63.19702193929265
85,1000,-51.40311578825464
86,1000,-110.32042484779521
87,1000,-1.6885486544868331
88,1000,-40.322163831673876
89,1000,-117.87439936484822
90,1000,-17.29636718722193
91,1000,-50.8779129691676
92,1000,-23.326906042116605
93,1000,-16.48103125730125
94,1000,-65.63127482874522
95,1000,-3.0954790560077
96,1000,-41.045314697447736
97,383,0.6393268293411154
98,1000,-63.946347416632506
99,1000,-30.123999237506037
100,1000,-3.016296088238666
101,1000,-8.117030175131383
102,1000,-87.49522555377587
103,1000,-81.39047072137356
104,1000,-72.81826293659466
105,67,-178.85877057990743
106,668,-309.3534216755719
107,1000,-40.02634453103156
108,1000,-29.390284914621546
109,1000,-25.236889126311645
110,1000,-50.506730144929385
111,1000,-29.66435076734831
112,1000,-28.51767893752429
113,1000,-30.592202070230915
114,237,-317.91269312248374
115,137,-182.2889796235075
116,1000,-57.03373314047477
117,1000,-51.94770682333913
118,1000,-93.28494754355235
119,242,-180.35227388903274
120,713,-162.67367836176183
121,1000,-68.49983892557673
122,345,-48.53209801680276
123,1000,-47.49558923473576
124,100,-100.48968935049145
125,1000,-44.78393220340506
126,1000,-41.63440557565204
127,1000,18.18775673034946
128,334,225.63148149788512
129,1000,-110.18100475542315
130,1000,-14.811948814914075
131,1000,-23.623348129576797
132,1000,-49.290436048291284
133,1000,-7.293966003713006
134,684,-104.92475179842464
135,1000,-0.26566274693817293
136,953,110.30468951954634
137,1000,-34.483964234440585
138,1000,-17.69275914599986
139,1000,-105.72368326539818
140,181,-148.67617000391496
141,1000,-42.384911186276504
142,627,162.1362814720533
143,1000,-9.557299410696523
144,1000,13.019825160635566
145,309,288.5546197021083
146,1000,-33.02007463887985
147,963,-218.8027987522792
148,62,-110.9155762319085
149,64,-124.07436426885992
150,976,-232.9153223151996
151,1000,9.416985036745682
152,558,216.34792874021943
153,542,226.9092180259271
154,428,-12.663186730609226
155,293,-54.362876981667185
156,1000,-58.33307321526582
157,590,226.10106639258674
158,1000,7.8756856092523915
159,1000,-58.1743546380038
160,1000,-33.721720693327846
161,1000,-55.693615851815494
162,1000,-82.38282525895288
163,694,-150.78412728163562
164,1000,-61.43086081925932
165,445,234.07992708455228
166,1000,11.849957603166397
167,1000,20.1836882419042
168,222,-249.2651956970937
169,1000,-100.39643371932502
170,1000,-188.52450745461007
171,799,-181.57930933005886
172,820,-158.29513775134035
173,1000,-96.03509786889713
174,1000,-47.06664302817624
175,521,183.57212102776532
176,1000,-81.93706076757024
177,310,235.88941628242816
178,1000,-64.23308473664203
179,725,-140.31998707213222
180,1000,-5.20503682350034
181,1000,-46.28273279062026
182,1000,-33.424207924136745
183,1000,-63.3089381151122
184,1000,-38.90512725874796
185,1000,-52.94720777027712
186,539,164.29238816055548
187,1000,-45.866518212770856
188,209,-56.161717717965615
189,856,-129.06231823801593
190,268,-249.71707321602855
191,593,231.38585098970418
192,1000,15.084169887524265
193,656,184.39626873432968
194,1000,-38.59796191846389
195,992,-256.3685673170024
196,640,179.48004062741637
197,880,-363.26760429348275
198,388,-382.54074180007757
199,96,-182.83000712485142
200,336,-142.82710757838356
201,1000,-22.98393657704608
202,1000,-5.112678536813874
203,525,266.8202971847791
204,297,255.25965774080777
205,1000,-98.83415761129488
206,471,228.24838221621133
207,495,-274.2007857207799
208,429,249.61910576464643
209,318,272.37856024341136
210,145,-101.44376508981081
211,440,236.44609550681054
212,405,244.26976693158525
213,269,-113.60204326335977
214,282,224.8132298373339
215,598,185.56666603833395
216,341,263.39036013568034
217,707,-151.980543521151
218,449,215.6329593609371
219,93,-47.10828715024596
220,143,-15.896532160367641
221,322,224.9519843051135
222,414,-203.24316462526954
223,446,255.7680106174158
224,361,229.4773785581856
225,206,32.499536680091296
226,536,251.5005423165143
227,420,220.4274320006055
228,340,256.72324181239486
229,330,222.43076683205823
230,415,263.35630228039224
231,583,237.0595020625331
232,696,-82.76364369884266
233,780,168.59068495917774
234,372,21.263208529230695
235,696,213.84778847370617
236,381,211.922822326666
237,713,237.03979363638433
238,278,268.13992479351555
239,632,210.1127304626084
240,387,242.28560888002065
241,483,210.59085452920527
242,431,249.27942130098717
243,320,259.4536152379793
244,859,160.4701250305132
245,376,196.71067681968788
246,307,260.4403004992143
247,221,254.46665994343005
248,324,194.03559482968524
249,324,-20.91908194556575
250,329,180.06115629003781
