episodes,steps,rewards
0,200,-200.0
1,200,-200.0
2,200,-200.0
3,200,-200.0
4,200,-200.0
5,200,-200.0
6,200,-200.0
7,200,-200.0
8,200,-200.0
9,200,-200.0
10,200,-200.0
11,200,-200.0
12,200,-200.0
13,200,-200.0
14,200,-200.0
15,200,-200.0
16,200,-200.0
17,200,-200.0
18,200,-200.0
19,200,-200.0
20,177,-177.0
21,200,-200.0
22,200,-200.0
23,200,-200.0
24,200,-200.0
25,200,-200.0
26,200,-200.0
27,200,-200.0
28,200,-200.0
29,200,-200.0
30,177,-177.0
31,200,-200.0
32,187,-187.0
33,200,-200.0
34,200,-200.0
35,200,-200.0
36,146,-146.0
37,200,-200.0
38,200,-200.0
39,176,-176.0
40,200,-200.0
41,200,-200.0
42,200,-200.0
43,200,-200.0
44,200,-200.0
45,200,-200.0
46,200,-200.0
47,107,-107.0
48,200,-200.0
49,200,-200.0
50,200,-200.0
51,200,-200.0
52,200,-200.0
53,200,-200.0
54,200,-200.0
55,200,-200.0
56,164,-164.0
57,106,-106.0
58,148,-148.0
59,133,-133.0
60,200,-200.0
61,154,-154.0
62,200,-200.0
63,164,-164.0
64,200,-200.0
65,152,-152.0
66,179,-179.0
67,104,-104.0
68,177,-177.0
69,134,-134.0
70,200,-200.0
71,200,-200.0
72,200,-200.0
73,167,-167.0
74,114,-114.0
75,200,-200.0
76,141,-141.0
77,191,-191.0
78,200,-200.0
79,137,-137.0
80,136,-136.0
81,142,-142.0
82,200,-200.0
83,109,-109.0
84,200,-200.0
85,159,-159.0
86,127,-127.0
87,145,-145.0
88,200,-200.0
89,200,-200.0
90,85,-85.0
91,200,-200.0
92,179,-179.0
93,151,-151.0
94,163,-163.0
95,109,-109.0
96,148,-148.0
97,110,-110.0
98,148,-148.0
99,125,-125.0
100,200,-200.0
101,200,-200.0
102,200,-200.0
103,166,-166.0
104,110,-110.0
105,150,-150.0
106,200,-200.0
107,200,-200.0
108,110,-110.0
109,173,-173.0
110,174,-174.0
111,197,-197.0
112,200,-200.0
113,161,-161.0
114,182,-182.0
115,200,-200.0
116,99,-99.0
117,200,-200.0
118,169,-169.0
119,200,-200.0
120,167,-167.0
121,170,-170.0
122,178,-178.0
123,200,-200.0
124,175,-175.0
125,159,-159.0
126,166,-166.0
127,200,-200.0
128,200,-200.0
129,104,-104.0
130,141,-141.0
131,171,-171.0
132,200,-200.0
133,162,-162.0
134,174,-174.0
135,200,-200.0
136,147,-147.0
137,141,-141.0
138,154,-154.0
139,184,-184.0
140,119,-119.0
141,165,-165.0
142,104,-104.0
143,106,-106.0
144,159,-159.0
145,122,-122.0
146,157,-157.0
147,161,-161.0
148,149,-149.0
149,167,-167.0
150,147,-147.0
151,88,-88.0
152,121,-121.0
153,89,-89.0
154,88,-88.0
155,150,-150.0
156,144,-144.0
157,171,-171.0
158,119,-119.0
159,118,-118.0
160,148,-148.0
161,111,-111.0
162,145,-145.0
163,84,-84.0
164,140,-140.0
165,90,-90.0
166,141,-141.0
167,116,-116.0
168,85,-85.0
169,146,-146.0
170,143,-143.0
171,147,-147.0
172,127,-127.0
173,150,-150.0
174,105,-105.0
175,116,-116.0
176,133,-133.0
177,155,-155.0
178,169,-169.0
179,148,-148.0
180,162,-162.0
181,92,-92.0
182,163,-163.0
183,157,-157.0
184,89,-89.0
185,144,-144.0
186,133,-133.0
187,156,-156.0
188,94,-94.0
189,87,-87.0
190,150,-150.0
191,155,-155.0
192,84,-84.0
193,142,-142.0
194,151,-151.0
195,98,-98.0
196,150,-150.0
197,151,-151.0
198,187,-187.0
199,100,-100.0
200,110,-110.0
201,144,-144.0
202,143,-143.0
203,91,-91.0
204,171,-171.0
205,148,-148.0
206,141,-141.0
207,108,-108.0
208,142,-142.0
209,133,-133.0
210,163,-163.0
211,142,-142.0
212,141,-141.0
213,153,-153.0
214,100,-100.0
215,143,-143.0
216,145,-145.0
217,93,-93.0
218,88,-88.0
219,149,-149.0
220,138,-138.0
221,150,-150.0
222,166,-166.0
223,108,-108.0
224,151,-151.0
225,106,-106.0
226,173,-173.0
227,155,-155.0
228,97,-97.0
229,138,-138.0
230,164,-164.0
231,136,-136.0
232,136,-136.0
233,132,-132.0
234,150,-150.0
235,150,-150.0
236,159,-159.0
237,135,-135.0
238,106,-106.0
239,109,-109.0
240,190,-190.0
241,145,-145.0
242,144,-144.0
243,146,-146.0
244,146,-146.0
245,138,-138.0
246,96,-96.0
247,84,-84.0
248,153,-153.0
249,146,-146.0
250,154,-154.0
251,154,-154.0
252,120,-120.0
253,159,-159.0
254,92,-92.0
255,153,-153.0
256,162,-162.0
257,143,-143.0
258,144,-144.0
259,134,-134.0
260,110,-110.0
261,153,-153.0
262,101,-101.0
263,135,-135.0
264,154,-154.0
265,91,-91.0
266,144,-144.0
267,100,-100.0
268,200,-200.0
269,93,-93.0
270,144,-144.0
271,85,-85.0
272,104,-104.0
273,143,-143.0
274,170,-170.0
275,146,-146.0
276,97,-97.0
277,86,-86.0
278,200,-200.0
279,118,-118.0
280,200,-200.0
281,152,-152.0
282,148,-148.0
283,151,-151.0
284,149,-149.0
285,158,-158.0
286,154,-154.0
287,200,-200.0
288,150,-150.0
289,99,-99.0
290,87,-87.0
291,168,-168.0
292,152,-152.0
293,157,-157.0
294,109,-109.0
295,115,-115.0
296,156,-156.0
297,191,-191.0
298,148,-148.0
299,125,-125.0
300,172,-172.0
301,167,-167.0
302,156,-156.0
303,134,-134.0
304,149,-149.0
305,153,-153.0
306,162,-162.0
307,108,-108.0
308,149,-149.0
309,161,-161.0
310,100,-100.0
311,151,-151.0
312,161,-161.0
313,150,-150.0
314,156,-156.0
315,153,-153.0
316,144,-144.0
317,152,-152.0
318,105,-105.0
319,147,-147.0
320,89,-89.0
321,144,-144.0
322,149,-149.0
323,149,-149.0
324,165,-165.0
325,150,-150.0
326,90,-90.0
327,200,-200.0
328,145,-145.0
329,108,-108.0
330,138,-138.0
331,84,-84.0
332,140,-140.0
333,143,-143.0
334,154,-154.0
335,143,-143.0
336,142,-142.0
337,149,-149.0
338,147,-147.0
339,144,-144.0
340,138,-138.0
341,89,-89.0
342,173,-173.0
343,149,-149.0
344,108,-108.0
345,154,-154.0
346,156,-156.0
347,101,-101.0
348,96,-96.0
349,88,-88.0
350,158,-158.0
351,156,-156.0
352,144,-144.0
353,141,-141.0
354,94,-94.0
355,144,-144.0
356,147,-147.0
357,91,-91.0
358,144,-144.0
359,147,-147.0
360,162,-162.0
361,151,-151.0
362,146,-146.0
363,89,-89.0
364,86,-86.0
365,144,-144.0
366,102,-102.0
367,87,-87.0
368,85,-85.0
369,149,-149.0
370,200,-200.0
371,172,-172.0
372,90,-90.0
373,153,-153.0
374,200,-200.0
375,155,-155.0
376,153,-153.0
377,170,-170.0
378,160,-160.0
379,106,-106.0
380,172,-172.0
381,153,-153.0
382,94,-94.0
383,88,-88.0
384,159,-159.0
385,155,-155.0
386,148,-148.0
387,91,-91.0
388,91,-91.0
389,161,-161.0
390,200,-200.0
391,161,-161.0
392,160,-160.0
393,87,-87.0
394,94,-94.0
395,85,-85.0
396,152,-152.0
397,148,-148.0
398,167,-167.0
399,85,-85.0
400,111,-111.0
401,94,-94.0
402,103,-103.0
403,155,-155.0
404,154,-154.0
405,91,-91.0
406,141,-141.0
407,146,-146.0
408,85,-85.0
409,96,-96.0
410,161,-161.0
411,184,-184.0
412,166,-166.0
413,84,-84.0
414,156,-156.0
415,146,-146.0
416,152,-152.0
417,155,-155.0
418,88,-88.0
419,153,-153.0
420,160,-160.0
421,143,-143.0
422,145,-145.0
423,111,-111.0
424,148,-148.0
425,151,-151.0
426,105,-105.0
427,174,-174.0
428,148,-148.0
429,200,-200.0
430,109,-109.0
431,150,-150.0
432,149,-149.0
433,153,-153.0
434,160,-160.0
435,90,-90.0
436,169,-169.0
437,87,-87.0
438,162,-162.0
439,94,-94.0
440,156,-156.0
441,158,-158.0
442,151,-151.0
443,84,-84.0
444,159,-159.0
445,146,-146.0
446,143,-143.0
447,91,-91.0
448,152,-152.0
449,91,-91.0
450,179,-179.0
451,148,-148.0
452,97,-97.0
453,127,-127.0
454,92,-92.0
455,92,-92.0
456,148,-148.0
457,200,-200.0
458,151,-151.0
459,95,-95.0
460,200,-200.0
461,154,-154.0
462,152,-152.0
463,186,-186.0
464,154,-154.0
465,147,-147.0
466,152,-152.0
467,149,-149.0
468,145,-145.0
469,152,-152.0
470,100,-100.0
471,86,-86.0
472,92,-92.0
473,150,-150.0
474,159,-159.0
475,92,-92.0
476,149,-149.0
477,152,-152.0
478,162,-162.0
479,193,-193.0
480,159,-159.0
481,151,-151.0
482,173,-173.0
483,149,-149.0
484,153,-153.0
485,109,-109.0
486,151,-151.0
487,169,-169.0
488,98,-98.0
489,166,-166.0
490,144,-144.0
491,200,-200.0
492,148,-148.0
493,200,-200.0
494,139,-139.0
495,157,-157.0
496,160,-160.0
497,200,-200.0
498,147,-147.0
499,150,-150.0
500,98,-98.0
501,144,-144.0
502,89,-89.0
503,189,-189.0
504,131,-131.0
505,200,-200.0
506,200,-200.0
507,130,-130.0
508,156,-156.0
509,200,-200.0
510,200,-200.0
511,173,-173.0
512,160,-160.0
513,164,-164.0
514,200,-200.0
515,200,-200.0
516,154,-154.0
517,160,-160.0
518,89,-89.0
519,151,-151.0
520,94,-94.0
521,159,-159.0
522,153,-153.0
523,95,-95.0
524,191,-191.0
525,149,-149.0
526,200,-200.0
527,149,-149.0
528,96,-96.0
529,155,-155.0
530,167,-167.0
531,200,-200.0
532,152,-152.0
533,152,-152.0
534,151,-151.0
535,89,-89.0
536,85,-85.0
537,149,-149.0
538,96,-96.0
539,111,-111.0
540,159,-159.0
541,115,-115.0
542,167,-167.0
543,155,-155.0
544,148,-148.0
545,158,-158.0
546,151,-151.0
547,150,-150.0
548,97,-97.0
549,147,-147.0
550,156,-156.0
551,111,-111.0
552,148,-148.0
553,89,-89.0
554,84,-84.0
555,159,-159.0
556,160,-160.0
557,155,-155.0
558,152,-152.0
559,157,-157.0
560,200,-200.0
561,85,-85.0
562,86,-86.0
563,89,-89.0
564,167,-167.0
565,156,-156.0
566,91,-91.0
567,156,-156.0
568,200,-200.0
569,90,-90.0
570,172,-172.0
571,122,-122.0
572,94,-94.0
573,139,-139.0
574,104,-104.0
575,90,-90.0
576,155,-155.0
577,159,-159.0
578,200,-200.0
579,155,-155.0
580,176,-176.0
581,155,-155.0
582,152,-152.0
583,200,-200.0
584,165,-165.0
585,200,-200.0
586,164,-164.0
587,150,-150.0
588,169,-169.0
589,164,-164.0
590,171,-171.0
591,94,-94.0
592,200,-200.0
593,113,-113.0
594,148,-148.0
595,200,-200.0
596,103,-103.0
597,104,-104.0
598,99,-99.0
599,200,-200.0
600,86,-86.0
601,89,-89.0
602,93,-93.0
603,163,-163.0
604,87,-87.0
605,86,-86.0
606,96,-96.0
607,145,-145.0
608,149,-149.0
609,156,-156.0
610,87,-87.0
611,149,-149.0
612,142,-142.0
613,144,-144.0
614,200,-200.0
615,142,-142.0
616,86,-86.0
617,200,-200.0
618,142,-142.0
619,88,-88.0
620,150,-150.0
621,150,-150.0
622,149,-149.0
623,86,-86.0
624,182,-182.0
625,199,-199.0
626,90,-90.0
627,154,-154.0
628,93,-93.0
629,199,-199.0
630,92,-92.0
631,87,-87.0
632,148,-148.0
633,100,-100.0
634,173,-173.0
635,103,-103.0
636,148,-148.0
637,106,-106.0
638,86,-86.0
639,87,-87.0
640,90,-90.0
641,148,-148.0
642,146,-146.0
643,170,-170.0
644,89,-89.0
645,114,-114.0
646,167,-167.0
647,95,-95.0
648,170,-170.0
649,85,-85.0
650,176,-176.0
651,176,-176.0
652,124,-124.0
653,194,-194.0
654,190,-190.0
655,150,-150.0
656,139,-139.0
657,144,-144.0
658,90,-90.0
659,96,-96.0
660,149,-149.0
661,200,-200.0
662,88,-88.0
663,106,-106.0
664,86,-86.0
665,85,-85.0
666,146,-146.0
667,152,-152.0
668,144,-144.0
669,200,-200.0
670,86,-86.0
671,85,-85.0
672,95,-95.0
673,149,-149.0
674,140,-140.0
675,84,-84.0
676,97,-97.0
677,87,-87.0
678,95,-95.0
679,146,-146.0
680,146,-146.0
681,85,-85.0
682,159,-159.0
683,141,-141.0
684,138,-138.0
685,118,-118.0
686,148,-148.0
687,179,-179.0
688,193,-193.0
689,90,-90.0
690,153,-153.0
691,163,-163.0
692,146,-146.0
693,87,-87.0
694,93,-93.0
695,145,-145.0
696,95,-95.0
697,131,-131.0
698,92,-92.0
699,147,-147.0
700,91,-91.0
701,85,-85.0
702,179,-179.0
703,154,-154.0
704,153,-153.0
705,178,-178.0
706,89,-89.0
707,91,-91.0
708,158,-158.0
709,152,-152.0
710,160,-160.0
711,151,-151.0
712,87,-87.0
713,120,-120.0
714,106,-106.0
715,152,-152.0
716,161,-161.0
717,122,-122.0
718,145,-145.0
719,200,-200.0
720,149,-149.0
721,157,-157.0
722,168,-168.0
723,86,-86.0
724,88,-88.0
725,196,-196.0
726,191,-191.0
727,163,-163.0
728,170,-170.0
729,154,-154.0
730,153,-153.0
731,159,-159.0
732,97,-97.0
733,174,-174.0
734,158,-158.0
735,93,-93.0
736,161,-161.0
737,144,-144.0
738,137,-137.0
739,96,-96.0
740,101,-101.0
741,142,-142.0
742,147,-147.0
743,141,-141.0
744,131,-131.0
745,94,-94.0
746,142,-142.0
747,148,-148.0
748,87,-87.0
749,141,-141.0
750,143,-143.0
751,87,-87.0
752,86,-86.0
753,90,-90.0
754,139,-139.0
755,153,-153.0
756,92,-92.0
757,87,-87.0
758,94,-94.0
759,147,-147.0
760,135,-135.0
761,87,-87.0
762,145,-145.0
763,86,-86.0
764,148,-148.0
765,140,-140.0
766,85,-85.0
767,147,-147.0
768,143,-143.0
769,157,-157.0
770,158,-158.0
771,141,-141.0
772,149,-149.0
773,164,-164.0
774,141,-141.0
775,143,-143.0
776,156,-156.0
777,144,-144.0
778,87,-87.0
779,86,-86.0
780,96,-96.0
781,87,-87.0
782,94,-94.0
783,142,-142.0
784,138,-138.0
785,108,-108.0
786,143,-143.0
787,87,-87.0
788,144,-144.0
789,146,-146.0
790,144,-144.0
791,147,-147.0
792,139,-139.0
793,146,-146.0
794,140,-140.0
795,153,-153.0
796,84,-84.0
797,83,-83.0
798,87,-87.0
799,200,-200.0
800,95,-95.0
