episodes,steps,rewards
0,95,-308.973981315834
1,79,-79.4705732240807
2,144,-44.47073790330637
3,124,-40.10042699296443
4,70,-158.10468371433
5,100,-286.869882009251
6,115,-151.42410692544036
7,62,-125.78420962374013
8,80,-134.79977238441757
9,98,-429.6320613632232
10,65,-69.76092647098197
11,165,-93.10003623402909
12,132,-280.20320284946786
13,117,-327.1421875460209
14,147,-82.91315503007255
15,613,-68.79662842139751
16,1000,-121.63831458089352
17,337,-280.28041524103963
18,527,-159.04050684689076
19,1000,-139.3635193858477
20,1000,-157.94396075230856
21,1000,-131.30795091886625
22,1000,-146.5778542973425
23,1000,-111.94559731618757
24,1000,-146.21751879485865
25,1000,-121.51911613207324
26,105,-188.75202250474024
27,1000,-207.27740133758684
28,1000,-195.02582814707657
29,1000,-180.4741386803288
30,1000,-195.41633697938377
31,1000,-175.56656507608227
32,1000,-160.5383712974257
33,1000,-179.16830214269064
34,1000,-206.1547576590465
35,412,-238.4731838609699
36,1000,-194.97508671556685
37,938,125.99849182814242
38,225,-174.80060513915282
39,137,-174.67174025698128
40,204,-227.06797185226327
41,250,-188.03188134240486
42,798,-34.885931607127844
43,394,-62.069963378783385
44,429,-123.40540405954724
45,583,-354.83792295249464
46,177,-189.62711230627167
47,334,-333.8946741498101
48,129,-575.1194901935482
49,304,-464.112861729898
50,563,-202.7640167407239
51,99,-205.46602759723925
52,126,-126.8435653952539
53,376,-111.59136916573969
54,1000,-181.98113529423037
55,1000,-201.30963855837854
56,237,-225.66354940445828
57,393,-220.71045249230764
58,946,-291.8459652013067
59,1000,-319.9810936738233
60,521,-284.01317368540083
61,134,-97.21991730482364
62,359,-337.32206581106834
63,1000,-35.714519030738884
64,887,178.83766052151663
65,559,-64.31644226347558
66,1000,-55.99744312274804
67,335,-145.60013964773663
68,1000,-194.59491212494896
69,709,-319.9274118977647
70,1000,-105.33331335159365
71,250,-259.91250151522433
72,469,-382.97142925918246
73,1000,-129.43156606641153
74,513,-332.5045122925367
75,1000,-91.79763195590452
76,1000,-93.31614888769053
77,1000,-36.56300817545516
78,1000,-84.26076145117564
79,1000,-49.14277341339129
80,1000,-143.71491818443843
81,156,-99.81323032495602
82,1000,-49.22114106574594
83,1000,-59.399139795624606
84,1000,-112.32995367582934
85,1000,-117.28687170678896
86,1000,-73.8535823194867
87,1000,-66.61789214672615
88,118,-147.91088808347027
89,203,-93.84964473440766
90,1000,-184.3732526224394
91,1000,-116.41094424073496
92,1000,-80.88543462055948
93,1000,-91.27549565599982
94,1000,-59.311707423742284
95,1000,-80.5322412149215
96,1000,-85.74023076545512
97,1000,-45.62574670360515
98,255,-72.68290574655252
99,94,-266.4318668423151
100,1000,-63.88154032139845
101,1000,14.793595924341366
102,586,-134.86713499630605
103,507,-264.29326735176704
104,165,-386.4886122975698
105,1000,-492.61893941063926
106,240,-216.67302577009787
107,108,0.5752214038631678
108,995,-205.02091401026394
109,100,-148.7321373195523
110,777,-760.3297767766222
111,101,-36.53062954592063
112,172,-257.13198325827443
113,1000,-17.239000309466082
114,1000,-17.27218461287153
115,1000,-36.168658900331536
116,1000,46.13136820287764
117,1000,-94.96336844415349
118,1000,-128.7311491811086
119,425,-271.5318395226768
120,173,-310.42038598689135
121,100,-368.48668645907503
122,120,-244.50668732064733
123,604,169.56076843176598
124,124,-160.16897829417715
125,162,-205.37682152133812
126,245,-229.53008290760334
127,128,-140.22994690589155
128,525,-272.4636746851846
129,391,-13.703633253331006
130,413,-233.9851237872108
131,335,-207.99214631516702
132,1000,-53.85973234792545
133,257,-44.810443315401486
134,612,-190.72798499696012
135,546,242.67409906730626
136,359,-49.92017577424146
137,349,232.40242359985973
138,702,179.2436558571941
139,572,147.41369015198816
140,99,-162.81861141182446
141,172,-81.14371337393374
142,421,-306.42882155583607
143,688,225.27140162587105
144,369,212.7830431704774
145,107,-137.98761316806815
146,291,-22.916389803327732
147,311,-0.9109279900683873
148,262,-197.79619727331755
149,805,183.93817183006644
150,287,-229.76648909862405
151,114,-1.116857011753467
152,433,-61.74533353135199
153,464,209.07901402904955
154,455,-68.41547337442583
155,519,203.07810038714868
156,172,20.82567486673767
157,158,-112.9917428791959
158,127,-197.46451835176717
159,331,-150.3986433463702
160,129,-66.32987558130195
161,370,-374.21012231089907
162,426,239.41488487450252
163,478,-281.17368077557546
164,1000,-40.95359001958196
165,1000,-76.78152194473202
166,1000,-147.19463494869083
167,377,-129.86160819240047
168,207,-381.653418971953
169,79,-98.52170504545498
170,94,-271.5481273632147
171,100,-119.5356865669086
172,120,-220.45330297804063
173,154,-695.5628086799704
174,97,-349.9529890951786
175,75,-433.6002058673797
176,137,-1070.0278536488026
177,159,-380.21919918994246
178,171,-308.90591544727835
179,296,-200.2168596190204
180,188,-586.9298248560613
181,633,-867.3703862420866
182,656,-639.5724292865111
183,275,-45.919029538803116
184,1000,-72.16714770383072
185,541,-277.54262044248753
186,920,111.63349050099276
187,1000,-21.23471652941255
188,282,-264.2205514928389
189,241,-180.16164837897617
190,552,-108.07466992070229
191,562,-93.85803852548997
192,658,-95.31052534301594
193,228,-246.25781628688037
194,1000,-23.253934753878397
195,1000,-17.213993747518707
196,1000,-147.8195415058646
197,97,-461.4244477726397
198,1000,-93.83058854448959
199,402,-279.46469690189747
200,253,-295.3482022201812
201,211,-334.2687902613594
202,1000,-129.66707838859568
203,937,-325.95572193766054
204,300,-113.72570489241988
205,379,-106.86967181778715
206,1000,-122.47614153819093
207,376,-159.46865778239626
208,1000,-148.33007931571188
209,494,-197.1744396496581
210,1000,-80.67767549167564
211,1000,-129.84056328968845
212,129,-280.75366018367123
213,1000,-104.6351537084999
214,1000,-124.98707869225561
215,1000,-218.8252114857373
216,1000,-180.7449228781901
217,1000,-150.7623015048295
218,1000,-145.81912428275453
219,176,-360.23228117139763
220,513,-242.19075366253813
221,310,-260.90464940339103
222,128,-177.21412954861114
223,137,-160.0063413198357
224,1000,-172.65283315156867
225,1000,-171.11021590300896
226,1000,-169.83550858890337
227,516,-145.53724971175689
228,442,-125.67424413867579
229,745,-211.99387827372004
230,511,-216.4723139469965
231,1000,-144.0945770672339
232,789,-395.4557654466257
233,317,-359.92538658421245
234,1000,-197.8103715990582
235,759,-337.26519868882883
236,628,134.32589631616952
237,158,-299.78306878336434
238,1000,-62.66021445475933
239,1000,-34.66364603476905
240,1000,-23.034137914563555
241,992,-438.8935883241774
242,155,-343.6345457367496
243,214,-176.22705991308587
244,279,-474.79377400321624
245,89,-435.179291019916
246,130,-312.5669528749421
247,270,-115.23588791305109
248,377,-206.9026625564252
249,570,-171.83772678007767
250,189,-276.55768550660366
251,962,-447.72987806515744
252,1000,-105.35534919934881
253,1000,-144.64935187132826
254,247,-291.84147799938864
255,1000,-84.96180846731413
256,182,-160.42972919400978
257,248,-184.46536359431212
258,368,-147.79755887004686
259,344,-122.1960264253008
260,160,-172.9453932123982
261,461,-325.7787849598342
262,324,-286.7100261069681
263,451,-201.52038306951698
264,1000,-422.97274464005426
265,1000,-282.68032944816053
266,1000,-328.12936517504676
267,351,-325.7732395985233
268,187,-243.99670941792135
269,124,-131.96753893930187
270,852,-565.4714023752227
271,203,-220.55941804309936
272,1000,-260.6662222324288
273,1000,-191.99549040706347
274,1000,-170.35005802456385
275,664,-413.6964527094642
276,1000,-192.49580214702706
277,1000,-317.70209083882844
278,591,-262.02500306257537
279,1000,-374.2522680782164
280,1000,-176.17410265492228
281,300,-337.0380439105942
282,1000,-198.6955916183874
283,481,-332.3341115784102
284,233,-193.49521361865214
285,124,-175.33733083910943
286,1000,-194.86656929276575
287,710,-273.302093343367
288,219,-74.60787612855594
289,774,-372.96573551771894
290,417,-72.3270027514835
291,131,-134.86942693161242
292,511,-170.73450706384972
293,1000,-211.78772404706058
294,1000,-131.00020785573454
295,677,-296.250340797264
296,245,-160.31767317021368
297,1000,-99.56420488285727
298,293,-64.05555988836642
299,200,-102.06026557222057
300,248,-245.102601637889
301,1000,-102.07800975242122
302,1000,-83.10949211054209
303,1000,-111.34562227918948
304,134,-144.86135367391378
305,1000,-99.87459422072027
306,122,-168.60209737983035
307,416,-59.89334752108057
308,1000,-98.14654001128744
309,824,-342.8837469570585
310,776,-372.6933317095399
311,276,-316.1726614906214
312,176,-454.5953858944418
313,123,-356.8214587796253
314,103,-257.3128919894233
315,261,-250.15618854458222
316,139,-184.01187170757078
317,58,-526.7116512361105
318,78,-676.7455649583686
319,97,-570.7584820924426
320,66,-586.0070307307493
321,90,-527.0114852115087
322,96,-627.4591665306576
323,110,-377.7868509327064
324,100,-7.096954588147227
325,934,-275.5227005645647
326,149,-196.05605891061427
327,158,-41.8935504154325
328,147,-272.8844744287218
329,176,-338.99073890472005
330,258,-326.54411116087965
331,116,-155.0676061981555
332,234,-346.0889460970824
333,1000,-180.31703892809844
334,102,-272.13889151311344
335,255,-332.6417798460259
336,721,-145.89409704641483
337,333,-73.67842925496117
338,384,-144.27910558919405
339,371,-56.38482738242483
340,339,-74.29355077441419
341,327,-67.60475671201722
342,333,-90.00427557712906
343,1000,-67.81467312544237
344,1000,-109.0628035480186
345,360,-297.1825587030519
346,268,-483.08420383940285
347,241,-536.6173179589907
348,119,-444.3293222480653
349,133,-429.58202540502475
350,164,-241.54291336689693
351,117,-282.6129685265917
352,145,-746.2496079027437
353,61,-586.437726135206
354,97,-478.0322615508178
355,191,-495.07403724005854
356,189,-270.5025362787479
357,1000,-175.85638458380933
358,750,-325.92913685642725
359,889,-146.2563064659361
360,1000,-34.45313777540574
361,128,-264.36104599643465
362,530,-103.78235843050086
363,1000,-112.55517564393666
364,715,-52.15408725223666
365,176,-55.748049518289534
366,631,-146.10284001000508
367,269,-268.07418943290884
368,413,-243.91312155108827
369,349,-281.54571162780553
370,272,-243.11074305902778
371,1000,-23.94546627086309
372,295,-191.90376079553744
373,278,-235.74911788564924
374,299,-225.8986388226543
375,383,-267.599624790629
376,436,-206.68126909855238
377,923,127.37926345547157
378,142,-13.523193020612368
379,1000,-25.631566645731585
380,1000,-64.82452485206333
381,263,-536.4658523619934
382,283,-368.6576352003916
383,272,-164.76470315436558
384,154,-140.58759943764503
385,1000,-166.96364096392787
386,391,-462.0658266541389
387,1000,-365.88557869025936
388,1000,-516.1289375562548
389,1000,-415.0947294571284
390,1000,-148.87168963293198
391,1000,-179.91925292272103
392,945,-496.58882674191625
393,1000,-186.22805065618888
394,1000,-153.13502915492737
395,513,-424.58723577565786
396,1000,-147.42321811901743
397,1000,-190.76117488802038
398,1000,-163.63439537409536
399,1000,-184.47886468586523
400,1000,-164.7613796889673
401,1000,-174.50944135270174
402,1000,-147.34307018212974
403,314,-631.0685491285464
404,1000,-94.39731250658467
405,1000,-163.90318085026257
406,1000,-164.5786967750925
407,1000,-259.2343833240996
408,89,-367.7483835021305
409,521,-230.38456096609116
410,1000,-79.14265260032249
411,144,-247.72140921434274
412,1000,-167.708192105107
413,1000,-3.2354813056933915
414,133,-140.76030084419807
415,1000,-93.84001297117528
416,590,-217.35799207125746
417,553,-222.31165412832527
418,748,-166.05089252401797
419,413,-163.46384828845083
420,577,-151.2342394441032
421,1000,-127.82560635806628
422,1000,-159.09359538110795
423,369,-471.766058089779
424,1000,-155.84125931867038
425,1000,-152.922750814967
426,1000,-138.40261137585742
427,1000,-177.7258247578416
428,437,-183.8556849995893
429,1000,-204.69352353339326
430,215,-165.57771795919967
431,1000,-148.09204550283556
432,1000,-152.65463617854053
433,289,-304.64168397925687
434,482,-378.1908843388072
435,129,-238.45929063673293
436,157,-262.49232676966426
437,1000,-256.423793988315
438,1000,-236.3288033366682
439,1000,-260.8745420656699
440,1000,-206.2168649778171
441,1000,-220.1894906268307
442,1000,-191.17167049092166
443,1000,-205.91337862739468
444,896,-751.8139482670271
445,1000,-284.28608063623494
446,1000,-261.49014876641695
447,154,-597.4382520585004
448,667,-182.43236676865666
449,1000,-92.15394007436863
450,256,-185.2824077175565
451,387,-701.1838506142185
452,261,-195.8219868728396
453,651,-511.0929929883122
454,1000,-344.2633639597086
455,293,-141.54125323544497
456,1000,-170.71266055616488
457,1000,-133.09291963501207
458,1000,-285.8407213465251
459,1000,-77.43479380928387
460,283,-60.50093292816521
461,450,-135.46293483074075
462,370,-160.86103482785512
463,135,-138.8525275252348
464,875,-491.1770386835842
465,108,-214.1321992275113
466,265,-50.44378334207547
467,241,-59.168681241672196
468,211,-155.88299465805085
469,1000,-196.23200793605128
470,113,-232.8976194794773
471,294,-341.9901033780351
472,231,-251.46652765257303
473,247,-267.1182319983479
474,391,-454.8825571670021
475,243,-309.5609686795251
476,1000,-121.97284215918272
477,263,-344.91730580489923
478,1000,-144.09417060656438
479,776,-287.21244625150365
480,98,-179.0221785033338
481,516,-95.52531396970471
482,126,-195.99648424766065
483,1000,-52.08521829647002
484,433,-65.91444413504036
485,502,-173.72949481255557
486,608,169.52074465974067
487,413,4.33674084139183
488,1000,21.951805717077356
489,556,-64.72574700495811
490,973,130.9225458177072
491,431,-68.06921133353262
492,1000,-29.573679559478876
493,194,47.1045827939179
494,1000,-83.20576471290605
495,195,-17.042465784293114
496,1000,-37.84827380609086
497,1000,-28.429835360971747
498,347,-135.90146024518972
499,507,-341.68034750708665
500,1000,-161.46527900716853
