episodes,steps,rewards
0,200,-200.0
1,200,-200.0
2,200,-200.0
3,200,-200.0
4,200,-200.0
5,200,-200.0
6,200,-200.0
7,200,-200.0
8,200,-200.0
9,200,-200.0
10,200,-200.0
11,200,-200.0
12,200,-200.0
13,200,-200.0
14,200,-200.0
15,200,-200.0
16,200,-200.0
17,200,-200.0
18,200,-200.0
19,200,-200.0
20,200,-200.0
21,200,-200.0
22,200,-200.0
23,200,-200.0
24,200,-200.0
25,200,-200.0
26,200,-200.0
27,200,-200.0
28,200,-200.0
29,200,-200.0
30,200,-200.0
31,200,-200.0
32,200,-200.0
33,200,-200.0
34,200,-200.0
35,200,-200.0
36,200,-200.0
37,200,-200.0
38,200,-200.0
39,200,-200.0
40,200,-200.0
41,200,-200.0
42,200,-200.0
43,200,-200.0
44,200,-200.0
45,200,-200.0
46,200,-200.0
47,200,-200.0
48,200,-200.0
49,200,-200.0
50,200,-200.0
51,200,-200.0
52,200,-200.0
53,200,-200.0
54,200,-200.0
55,200,-200.0
56,200,-200.0
57,200,-200.0
58,200,-200.0
59,200,-200.0
60,200,-200.0
61,200,-200.0
62,200,-200.0
63,200,-200.0
64,200,-200.0
65,200,-200.0
66,200,-200.0
67,200,-200.0
68,200,-200.0
69,200,-200.0
70,200,-200.0
71,200,-200.0
72,200,-200.0
73,200,-200.0
74,200,-200.0
75,200,-200.0
76,200,-200.0
77,200,-200.0
78,200,-200.0
79,200,-200.0
80,200,-200.0
81,200,-200.0
82,200,-200.0
83,200,-200.0
84,200,-200.0
85,200,-200.0
86,200,-200.0
87,200,-200.0
88,200,-200.0
89,200,-200.0
90,200,-200.0
91,200,-200.0
92,200,-200.0
93,200,-200.0
94,200,-200.0
95,200,-200.0
96,200,-200.0
97,200,-200.0
98,200,-200.0
99,200,-200.0
100,200,-200.0
101,200,-200.0
102,200,-200.0
103,200,-200.0
104,200,-200.0
105,200,-200.0
106,200,-200.0
107,200,-200.0
108,200,-200.0
109,200,-200.0
110,200,-200.0
111,200,-200.0
112,200,-200.0
113,200,-200.0
114,200,-200.0
115,200,-200.0
116,200,-200.0
117,200,-200.0
118,200,-200.0
119,200,-200.0
120,200,-200.0
121,200,-200.0
122,200,-200.0
123,200,-200.0
124,200,-200.0
125,200,-200.0
126,200,-200.0
127,200,-200.0
128,200,-200.0
129,200,-200.0
130,200,-200.0
131,200,-200.0
132,200,-200.0
133,200,-200.0
134,200,-200.0
135,200,-200.0
136,200,-200.0
137,200,-200.0
138,200,-200.0
139,200,-200.0
140,200,-200.0
141,200,-200.0
142,200,-200.0
143,200,-200.0
144,200,-200.0
145,200,-200.0
146,200,-200.0
147,200,-200.0
148,200,-200.0
149,200,-200.0
150,200,-200.0
151,200,-200.0
152,200,-200.0
153,200,-200.0
154,200,-200.0
155,200,-200.0
156,200,-200.0
157,200,-200.0
158,200,-200.0
159,200,-200.0
160,200,-200.0
161,200,-200.0
162,200,-200.0
163,200,-200.0
164,200,-200.0
165,200,-200.0
166,200,-200.0
167,200,-200.0
168,200,-200.0
169,200,-200.0
170,200,-200.0
171,200,-200.0
172,200,-200.0
173,200,-200.0
174,200,-200.0
175,182,-182.0
176,200,-200.0
177,200,-200.0
178,200,-200.0
179,200,-200.0
180,200,-200.0
181,200,-200.0
182,200,-200.0
183,200,-200.0
184,181,-181.0
185,152,-152.0
186,183,-183.0
187,189,-189.0
188,200,-200.0
189,200,-200.0
190,155,-155.0
191,163,-163.0
192,200,-200.0
193,200,-200.0
194,157,-157.0
195,160,-160.0
196,200,-200.0
197,176,-176.0
198,200,-200.0
199,89,-89.0
200,176,-176.0
201,165,-165.0
202,162,-162.0
203,88,-88.0
204,169,-169.0
205,200,-200.0
206,170,-170.0
207,196,-196.0
208,187,-187.0
209,184,-184.0
210,94,-94.0
211,128,-128.0
212,127,-127.0
213,200,-200.0
214,134,-134.0
215,167,-167.0
216,145,-145.0
217,114,-114.0
218,117,-117.0
219,144,-144.0
220,155,-155.0
221,105,-105.0
222,116,-116.0
223,144,-144.0
224,166,-166.0
225,156,-156.0
226,180,-180.0
227,145,-145.0
228,182,-182.0
229,151,-151.0
230,156,-156.0
231,160,-160.0
232,171,-171.0
233,178,-178.0
234,93,-93.0
235,156,-156.0
236,181,-181.0
237,147,-147.0
238,162,-162.0
239,196,-196.0
240,157,-157.0
241,99,-99.0
242,158,-158.0
243,157,-157.0
244,153,-153.0
245,142,-142.0
246,154,-154.0
247,90,-90.0
248,200,-200.0
249,154,-154.0
250,168,-168.0
251,148,-148.0
252,162,-162.0
253,200,-200.0
254,148,-148.0
255,168,-168.0
256,200,-200.0
257,170,-170.0
258,181,-181.0
259,178,-178.0
260,153,-153.0
261,88,-88.0
262,169,-169.0
263,171,-171.0
264,110,-110.0
265,200,-200.0
266,170,-170.0
267,161,-161.0
268,161,-161.0
269,200,-200.0
270,168,-168.0
271,93,-93.0
272,88,-88.0
273,93,-93.0
274,199,-199.0
275,200,-200.0
276,171,-171.0
277,168,-168.0
278,98,-98.0
279,200,-200.0
280,99,-99.0
281,151,-151.0
282,166,-166.0
283,164,-164.0
284,175,-175.0
285,153,-153.0
286,159,-159.0
287,87,-87.0
288,200,-200.0
289,166,-166.0
290,187,-187.0
291,160,-160.0
292,93,-93.0
293,162,-162.0
294,178,-178.0
295,161,-161.0
296,162,-162.0
297,99,-99.0
298,150,-150.0
299,163,-163.0
300,84,-84.0
301,93,-93.0
302,87,-87.0
303,161,-161.0
304,159,-159.0
305,148,-148.0
306,142,-142.0
307,148,-148.0
308,96,-96.0
309,200,-200.0
310,158,-158.0
311,150,-150.0
312,158,-158.0
313,153,-153.0
314,144,-144.0
315,146,-146.0
316,151,-151.0
317,148,-148.0
318,88,-88.0
319,111,-111.0
320,151,-151.0
321,86,-86.0
322,200,-200.0
323,135,-135.0
324,93,-93.0
325,158,-158.0
326,93,-93.0
327,146,-146.0
328,149,-149.0
329,97,-97.0
330,147,-147.0
331,92,-92.0
332,167,-167.0
333,91,-91.0
334,118,-118.0
335,147,-147.0
336,85,-85.0
337,164,-164.0
338,153,-153.0
339,98,-98.0
340,159,-159.0
341,133,-133.0
342,142,-142.0
343,148,-148.0
344,85,-85.0
345,144,-144.0
346,144,-144.0
347,144,-144.0
348,117,-117.0
349,155,-155.0
350,86,-86.0
