episodes,steps,rewards
0,93,-53.289646746709025
1,125,-292.512149331672
2,76,-158.40102000897429
3,141,-142.46917680060525
4,108,-42.386398965394875
5,175,-148.7853168052411
6,87,-132.88034305091432
7,162,-95.06294332871705
8,88,-201.20928485684985
9,112,-183.6392540889686
10,80,-363.61635910882967
11,78,-201.7748295130052
12,101,-298.44090482266574
13,197,-352.40293251755173
14,239,-119.92885502765165
15,330,-63.013329366611075
16,81,-199.0740250098037
17,160,-216.35699120093
18,512,-186.17315460312608
19,1000,-250.8629877808434
20,72,-106.17779264249211
21,1000,-81.68411365954123
22,237,-181.8944423473657
23,55,-112.32188548087603
24,82,-49.49183831317556
25,331,-96.46272761119795
26,722,-709.3527892702236
27,1000,-98.80143679383696
28,376,-182.99776738297902
29,395,-137.81773256473693
30,1000,-128.61457340019498
31,1000,-77.21200287554542
32,1000,-75.64088019937066
33,142,-380.3947419177022
34,76,-53.31496543817619
35,231,-190.1182364252296
36,382,-245.57392742712995
37,219,-161.4782619275428
38,104,5.770965757473263
39,856,-255.34363014632154
40,500,-345.1914826063902
41,400,-198.64056065403338
42,1000,-80.7284789212
43,87,-90.35188097510496
44,89,-181.48471996547738
45,1000,-51.1703080360657
46,152,-218.16338457942032
47,119,-54.96483983018448
48,1000,-101.51389097495347
49,743,-400.75174235195266
50,155,-225.71489619340676
51,137,-155.54883350185156
52,130,-138.60978290659185
53,690,-178.54855998344158
54,301,-72.70991739082149
55,458,-269.86674748005396
56,101,-151.45567152577604
57,1000,-88.00414919777218
58,1000,-128.61017827355406
59,1000,-98.63078384375552
60,249,-77.00060070208926
61,511,-102.55429818052275
62,921,-232.73807535369747
63,1000,-68.54882801875377
64,511,-157.4799485169027
65,435,-347.47483711223356
66,1000,-157.78601893306617
67,870,-219.50751124641405
68,473,-354.54631155553056
69,1000,-88.16819834301002
70,927,-143.2092113736103
71,866,-118.53810596413818
72,1000,-158.704017191506
73,206,-70.50867409672333
74,1000,-72.79700038976549
75,838,-442.9129838625237
76,1000,-128.34743462566715
77,1000,-66.32732621904714
78,1000,-138.8623474101335
79,1000,-76.73291009779524
80,1000,-46.97855368628928
81,493,-215.92472524536424
82,1000,-107.22673143529056
83,380,-139.83716847757952
84,727,-141.55563458365134
85,89,-77.1623953750218
86,1000,-45.47578404854241
87,533,-253.32239598485972
88,89,-66.29302997856499
89,581,-390.25146916566433
90,631,-54.63990720516045
91,122,39.247197397224454
92,268,-90.53123686874409
93,764,-225.75445872632827
94,144,-70.31272443191979
95,232,-437.3069416220987
96,113,-611.6193095023144
97,979,-328.6641479729674
98,188,-170.992474053513
99,1000,-132.31027411087157
100,1000,-71.4861635173889
101,1000,-89.0499903242081
102,574,-78.09199019419252
103,1000,-108.81695400355856
104,1000,-129.8435430475522
105,1000,-125.56828399284343
106,1000,-166.71766620688024
107,1000,-75.58197070969057
108,962,77.30700668903906
109,1000,-25.989196519952284
110,1000,-52.068129704023605
111,1000,-43.06798674424992
112,461,-441.8880122751008
113,1000,-48.04105897356569
114,1000,-16.385368562425665
115,1000,-44.65059349085717
116,755,155.8902701009607
117,1000,-64.70397463150398
118,419,191.53626929640848
119,1000,-22.84538736700415
120,595,134.4301834712603
121,986,173.2161533567423
122,218,-48.05565553732694
123,101,-38.512032557468814
124,81,-64.08190514135912
125,216,-49.36396058122058
126,492,145.13616093964788
127,872,104.70579811463193
128,329,-31.534588030091115
129,487,-66.96960652571104
130,387,-83.63253994567513
131,114,18.262746207578203
132,312,-64.60144518775124
133,171,-1.473406336342535
134,460,188.12702245888838
135,75,-152.2087201625164
136,76,-91.76282825434461
137,86,-50.23414774040239
138,94,-238.7206142104182
139,429,-81.0103724450678
140,847,-103.74520123270459
141,577,-271.69177632163587
142,1000,-46.339984671703704
143,1000,-29.945529379994014
144,1000,-56.57070965516904
145,1000,-28.124392584129538
146,1000,-34.836766783742554
147,522,-204.40470503532035
148,1000,-69.89958759233025
149,279,-101.47782635276758
150,473,-93.62310372506252
151,1000,-31.187777223787773
152,1000,-20.19729402857977
153,275,226.31262513220423
154,354,167.5745481350906
155,755,146.31061195321905
156,1000,-32.57976554954254
157,303,227.24204185189444
158,209,241.81918724268883
159,550,110.74759545025135
160,668,194.94731907388314
161,399,179.50311029119385
162,323,212.9641130166013
163,1000,42.325772217474665
164,342,-262.6004034654028
165,452,-18.370544035047928
166,374,-181.04060014104232
167,554,144.03876666102056
168,163,-178.44365057979218
169,508,-285.2044872991945
170,484,124.20431423891894
171,310,-32.41191359408715
172,1000,-39.84060422173532
173,1000,-56.10353957575516
174,108,5.718571557633183
175,114,-82.45480760260578
176,85,-137.14797821743338
177,389,226.5927831106967
178,463,237.76724295316743
179,350,283.89976533909754
180,340,205.91500176403588
181,727,-153.77965739389498
182,680,182.7915224745957
183,1000,-144.92627971851294
184,746,174.80880035842537
185,1000,-38.41359929525714
186,75,27.63313838974554
187,164,-59.01038413598965
188,85,-83.68737529920787
189,919,-416.9985608710443
190,1000,-87.54778669934123
191,1000,37.92218572120784
192,446,216.52476919884788
193,77,-171.68347339121567
194,194,-12.601381842218089
195,357,172.90954923444048
196,655,238.2558024999566
197,1000,-28.00826365416425
198,463,153.77598589762448
199,102,-81.11787741695252
200,1000,-72.48188133647653
201,1000,-51.913984467917864
202,427,241.9671626106081
203,254,254.7616512487712
204,92,-189.331250789551
205,1000,-46.53035642410853
206,418,160.0186783683142
207,124,-72.18139479441814
208,179,-48.62506725361416
209,645,206.83600583713337
210,417,161.92596592183065
211,99,-87.16263084978493
212,528,206.08694807251496
213,1000,-61.27216886091838
214,815,141.52565265138128
215,474,217.36588506064118
216,391,219.01580828815872
217,859,149.30696587546544
218,134,-321.9806152005542
219,922,93.86251089981684
220,459,207.1463107096962
221,536,222.04075379964698
222,548,226.40446800360115
223,379,244.49906614065375
224,233,56.436495395689946
225,387,241.09494998093732
226,536,155.667011570785
227,267,231.22689024722567
228,417,214.19511419316802
229,232,-10.934619344556467
230,1000,-41.37134851647785
231,404,244.92316278240145
232,290,224.80739651213588
233,92,-16.97963397612395
234,1000,-22.509801238334283
235,490,302.7698516432062
236,275,206.3898294672921
237,263,229.4882626518598
238,356,-116.7813110377173
239,1000,109.7516937841737
240,418,219.91121584958904
241,92,-122.45450004765156
242,261,217.01160554042445
243,427,191.33274924433266
244,461,233.69844555164656
245,164,-153.85498127521606
246,442,263.5074233090864
247,231,-128.23983617673292
248,771,211.88869833096646
249,359,288.1892630883784
250,604,170.95481639281195
251,586,223.66288781600434
252,577,199.65810656433777
253,565,194.08407868551504
254,200,243.960943594202
255,860,166.95983097385732
256,344,213.3355089356379
257,246,262.67909212162084
258,246,213.774770601493
259,771,153.51018425950704
260,340,256.3410350863169
261,587,182.4779661604265
262,270,260.20521403976034
263,367,222.97833103548243
264,1000,-15.593012095558153
265,400,207.9917436159927
266,410,181.5445000841463
267,226,242.39142951350192
268,572,198.14771401478362
269,320,-103.1870265514617
270,172,-297.5830012056085
271,679,207.60835529736443
272,353,281.2451668388959
273,828,152.86883019288473
274,277,247.07681552238043
275,279,207.7742950218603
276,459,253.604197521514
277,451,212.51760578550306
278,603,160.77735581587496
279,352,131.30071743616978
280,437,217.1623514330336
281,364,249.94943623426957
282,227,-38.89303191047392
283,240,243.12243781058848
284,714,204.20563736259777
285,419,209.97207159589703
286,345,243.09716391419474
287,302,290.96038670822475
288,111,-136.14800011799417
289,420,171.94817600749036
290,180,14.659107958692474
291,355,242.40173758262262
292,123,2.5009570846137876
293,165,213.09093301379153
294,336,246.91847774367432
295,335,274.44741975109
296,402,269.53767192227247
297,513,236.26654512488344
298,595,191.32418307231495
299,1000,-56.17420651875101
300,483,218.86999444019352
