episodes,steps,rewards
0,84,-494.7617806299885
1,63,-62.383167415691595
2,119,-158.9260358147743
3,84,-435.54133759153706
4,64,-204.54588884494606
5,60,-84.14563900884083
6,109,-397.79493773783565
7,80,-9.399771414453753
8,121,-283.8146371377287
9,98,-219.27252793692907
10,67,-137.16591390975236
11,69,-42.30618793597976
12,127,-79.49324991502975
13,80,-163.77738269039355
14,150,-269.1947510600339
15,295,-343.96099217820006
16,82,-135.63206424911593
17,53,-313.62423178960535
18,89,-100.8263696167061
19,85,-52.418531435890785
20,1000,-46.0768492832181
21,1000,-67.111484096584
22,287,-480.8097663199247
23,236,-233.2169323291527
24,1000,-46.89460117982277
25,1000,-86.68336755216892
26,1000,-84.59484916085948
27,1000,-119.17873474412751
28,170,-74.76826930024714
29,117,-75.1237025935823
30,1000,-93.95941015818752
31,1000,-35.5169970320063
32,1000,-81.83928182537768
33,252,-276.613155286227
34,1000,-85.9504819080133
35,1000,-86.87409370440214
36,1000,-20.315896861516176
37,1000,-60.237768942833256
38,1000,-69.45897312660686
39,1000,-82.60069153915617
40,1000,-129.96754770576095
41,1000,-99.8740343420675
42,827,-269.23190825883023
43,140,-466.17432691156415
44,112,-301.0109031207216
45,695,-614.5523818818947
46,395,-123.57105559284614
47,1000,-160.94137785826575
48,1000,-161.53753441226695
49,1000,-138.24739561530956
50,1000,-125.56871125235594
