episodes,steps,rewards
0,200,-200.0
1,200,-200.0
2,200,-200.0
3,200,-200.0
4,200,-200.0
5,200,-200.0
6,200,-200.0
7,200,-200.0
8,200,-200.0
9,200,-200.0
10,200,-200.0
11,200,-200.0
12,200,-200.0
13,200,-200.0
14,200,-200.0
15,200,-200.0
16,200,-200.0
17,200,-200.0
18,200,-200.0
19,200,-200.0
20,200,-200.0
21,200,-200.0
22,200,-200.0
23,200,-200.0
24,200,-200.0
25,200,-200.0
26,200,-200.0
27,200,-200.0
28,200,-200.0
29,200,-200.0
30,200,-200.0
31,200,-200.0
32,200,-200.0
33,200,-200.0
34,200,-200.0
35,200,-200.0
36,200,-200.0
37,200,-200.0
38,200,-200.0
39,200,-200.0
40,200,-200.0
41,200,-200.0
42,200,-200.0
43,200,-200.0
44,200,-200.0
45,200,-200.0
46,200,-200.0
47,200,-200.0
48,200,-200.0
49,200,-200.0
50,200,-200.0
51,200,-200.0
52,200,-200.0
53,200,-200.0
54,200,-200.0
55,200,-200.0
56,200,-200.0
57,200,-200.0
58,200,-200.0
59,200,-200.0
60,200,-200.0
61,200,-200.0
62,200,-200.0
63,200,-200.0
64,200,-200.0
65,200,-200.0
66,200,-200.0
67,200,-200.0
68,200,-200.0
69,200,-200.0
70,200,-200.0
71,200,-200.0
72,200,-200.0
73,200,-200.0
74,200,-200.0
75,200,-200.0
76,200,-200.0
77,200,-200.0
78,200,-200.0
79,200,-200.0
80,200,-200.0
81,200,-200.0
82,200,-200.0
83,200,-200.0
84,200,-200.0
85,200,-200.0
86,200,-200.0
87,200,-200.0
88,200,-200.0
89,200,-200.0
90,200,-200.0
91,200,-200.0
92,200,-200.0
93,200,-200.0
94,200,-200.0
95,200,-200.0
96,200,-200.0
97,200,-200.0
98,200,-200.0
99,200,-200.0
100,200,-200.0
101,200,-200.0
102,200,-200.0
103,200,-200.0
104,200,-200.0
105,200,-200.0
106,200,-200.0
107,200,-200.0
108,200,-200.0
109,200,-200.0
110,200,-200.0
111,200,-200.0
112,200,-200.0
113,200,-200.0
114,200,-200.0
115,200,-200.0
116,200,-200.0
117,200,-200.0
118,200,-200.0
119,200,-200.0
120,200,-200.0
121,200,-200.0
122,200,-200.0
123,200,-200.0
124,200,-200.0
125,200,-200.0
126,200,-200.0
127,200,-200.0
128,200,-200.0
129,200,-200.0
130,200,-200.0
131,200,-200.0
132,200,-200.0
133,200,-200.0
134,200,-200.0
135,200,-200.0
136,200,-200.0
137,200,-200.0
138,200,-200.0
139,200,-200.0
140,200,-200.0
141,200,-200.0
142,200,-200.0
143,200,-200.0
144,200,-200.0
145,200,-200.0
146,200,-200.0
147,200,-200.0
148,200,-200.0
149,200,-200.0
150,200,-200.0
151,200,-200.0
152,200,-200.0
153,200,-200.0
154,200,-200.0
155,200,-200.0
156,200,-200.0
157,200,-200.0
158,200,-200.0
159,200,-200.0
160,200,-200.0
161,200,-200.0
162,200,-200.0
163,200,-200.0
164,200,-200.0
165,200,-200.0
166,200,-200.0
167,200,-200.0
168,200,-200.0
169,200,-200.0
170,200,-200.0
171,200,-200.0
172,200,-200.0
173,200,-200.0
174,200,-200.0
175,200,-200.0
176,200,-200.0
177,200,-200.0
178,200,-200.0
179,200,-200.0
180,200,-200.0
181,200,-200.0
182,200,-200.0
183,200,-200.0
184,200,-200.0
185,200,-200.0
186,200,-200.0
187,200,-200.0
188,200,-200.0
189,200,-200.0
190,200,-200.0
191,200,-200.0
192,200,-200.0
193,200,-200.0
194,200,-200.0
195,200,-200.0
196,200,-200.0
197,200,-200.0
198,200,-200.0
199,200,-200.0
200,200,-200.0
201,200,-200.0
202,200,-200.0
203,200,-200.0
204,200,-200.0
205,200,-200.0
206,193,-193.0
207,200,-200.0
208,200,-200.0
209,200,-200.0
210,200,-200.0
211,200,-200.0
212,119,-119.0
213,200,-200.0
214,200,-200.0
215,200,-200.0
216,200,-200.0
217,200,-200.0
218,200,-200.0
219,200,-200.0
220,200,-200.0
221,200,-200.0
222,200,-200.0
223,200,-200.0
224,200,-200.0
225,200,-200.0
226,200,-200.0
227,200,-200.0
228,200,-200.0
229,200,-200.0
230,200,-200.0
231,200,-200.0
232,200,-200.0
233,200,-200.0
234,200,-200.0
235,200,-200.0
236,200,-200.0
237,200,-200.0
238,200,-200.0
239,200,-200.0
240,200,-200.0
241,200,-200.0
242,200,-200.0
243,200,-200.0
244,200,-200.0
245,200,-200.0
246,200,-200.0
247,200,-200.0
248,200,-200.0
249,200,-200.0
250,200,-200.0
251,200,-200.0
252,200,-200.0
253,200,-200.0
254,200,-200.0
255,200,-200.0
256,200,-200.0
257,200,-200.0
258,200,-200.0
259,200,-200.0
260,200,-200.0
261,200,-200.0
262,188,-188.0
263,200,-200.0
264,200,-200.0
265,170,-170.0
266,200,-200.0
267,200,-200.0
268,141,-141.0
269,200,-200.0
270,200,-200.0
271,200,-200.0
272,200,-200.0
273,200,-200.0
274,181,-181.0
275,200,-200.0
276,200,-200.0
277,200,-200.0
278,200,-200.0
279,200,-200.0
280,182,-182.0
281,200,-200.0
282,187,-187.0
283,200,-200.0
284,200,-200.0
285,179,-179.0
286,200,-200.0
287,200,-200.0
288,175,-175.0
289,200,-200.0
290,200,-200.0
291,200,-200.0
292,200,-200.0
293,200,-200.0
294,200,-200.0
295,171,-171.0
296,200,-200.0
297,172,-172.0
298,200,-200.0
299,200,-200.0
300,200,-200.0
301,200,-200.0
302,200,-200.0
303,200,-200.0
304,200,-200.0
305,171,-171.0
306,200,-200.0
307,200,-200.0
308,200,-200.0
309,200,-200.0
310,200,-200.0
311,200,-200.0
312,200,-200.0
313,200,-200.0
314,200,-200.0
315,200,-200.0
316,200,-200.0
317,200,-200.0
318,199,-199.0
319,200,-200.0
320,200,-200.0
321,173,-173.0
322,165,-165.0
323,144,-144.0
324,200,-200.0
325,169,-169.0
326,130,-130.0
327,199,-199.0
328,166,-166.0
329,159,-159.0
330,166,-166.0
331,200,-200.0
332,200,-200.0
333,164,-164.0
334,200,-200.0
335,152,-152.0
336,200,-200.0
337,200,-200.0
338,200,-200.0
339,200,-200.0
340,200,-200.0
341,200,-200.0
342,156,-156.0
343,154,-154.0
344,200,-200.0
345,200,-200.0
346,155,-155.0
347,200,-200.0
348,156,-156.0
349,158,-158.0
350,200,-200.0
351,200,-200.0
352,200,-200.0
353,200,-200.0
354,200,-200.0
355,200,-200.0
356,200,-200.0
357,157,-157.0
358,200,-200.0
359,200,-200.0
360,200,-200.0
361,200,-200.0
362,200,-200.0
363,146,-146.0
364,147,-147.0
365,200,-200.0
366,200,-200.0
367,158,-158.0
368,161,-161.0
369,200,-200.0
370,200,-200.0
371,200,-200.0
372,200,-200.0
373,200,-200.0
374,160,-160.0
375,158,-158.0
376,159,-159.0
377,200,-200.0
378,200,-200.0
379,200,-200.0
380,152,-152.0
381,200,-200.0
382,156,-156.0
383,154,-154.0
384,200,-200.0
385,200,-200.0
386,191,-191.0
387,149,-149.0
388,169,-169.0
389,153,-153.0
390,166,-166.0
391,150,-150.0
392,153,-153.0
393,200,-200.0
394,127,-127.0
395,194,-194.0
396,156,-156.0
397,159,-159.0
398,156,-156.0
399,200,-200.0
400,160,-160.0
401,200,-200.0
402,150,-150.0
403,200,-200.0
404,200,-200.0
405,175,-175.0
406,200,-200.0
407,200,-200.0
408,200,-200.0
409,200,-200.0
410,200,-200.0
411,200,-200.0
412,200,-200.0
413,200,-200.0
414,200,-200.0
415,200,-200.0
416,200,-200.0
417,200,-200.0
418,200,-200.0
419,200,-200.0
420,200,-200.0
421,200,-200.0
422,200,-200.0
423,200,-200.0
424,200,-200.0
425,200,-200.0
426,200,-200.0
427,200,-200.0
428,200,-200.0
429,200,-200.0
430,200,-200.0
431,200,-200.0
432,200,-200.0
433,200,-200.0
434,200,-200.0
435,200,-200.0
436,200,-200.0
437,200,-200.0
438,200,-200.0
439,200,-200.0
440,200,-200.0
441,191,-191.0
442,200,-200.0
443,172,-172.0
444,200,-200.0
445,157,-157.0
446,168,-168.0
447,158,-158.0
448,200,-200.0
449,200,-200.0
450,200,-200.0
451,200,-200.0
452,200,-200.0
453,200,-200.0
454,158,-158.0
455,200,-200.0
456,200,-200.0
457,200,-200.0
458,200,-200.0
459,200,-200.0
460,200,-200.0
461,200,-200.0
462,177,-177.0
463,200,-200.0
464,174,-174.0
465,200,-200.0
466,183,-183.0
467,200,-200.0
468,118,-118.0
469,200,-200.0
470,200,-200.0
471,183,-183.0
472,172,-172.0
473,174,-174.0
474,177,-177.0
475,179,-179.0
476,200,-200.0
477,102,-102.0
478,169,-169.0
479,107,-107.0
480,200,-200.0
481,88,-88.0
482,200,-200.0
483,189,-189.0
484,200,-200.0
485,200,-200.0
486,200,-200.0
487,200,-200.0
488,182,-182.0
489,185,-185.0
490,200,-200.0
491,172,-172.0
492,167,-167.0
493,91,-91.0
494,169,-169.0
495,98,-98.0
496,181,-181.0
497,165,-165.0
498,179,-179.0
499,106,-106.0
500,174,-174.0
501,200,-200.0
502,126,-126.0
503,181,-181.0
504,86,-86.0
505,132,-132.0
506,131,-131.0
507,137,-137.0
508,137,-137.0
509,122,-122.0
510,95,-95.0
511,133,-133.0
512,125,-125.0
513,130,-130.0
514,126,-126.0
515,131,-131.0
516,128,-128.0
517,200,-200.0
518,164,-164.0
519,167,-167.0
520,90,-90.0
521,167,-167.0
522,162,-162.0
523,200,-200.0
524,192,-192.0
525,159,-159.0
526,87,-87.0
527,170,-170.0
528,132,-132.0
529,162,-162.0
530,127,-127.0
531,183,-183.0
532,178,-178.0
533,163,-163.0
534,200,-200.0
535,200,-200.0
536,193,-193.0
537,161,-161.0
538,96,-96.0
539,147,-147.0
540,157,-157.0
541,152,-152.0
542,198,-198.0
543,153,-153.0
544,149,-149.0
545,148,-148.0
546,180,-180.0
547,157,-157.0
548,162,-162.0
549,84,-84.0
550,158,-158.0
551,96,-96.0
552,173,-173.0
553,198,-198.0
554,181,-181.0
555,167,-167.0
556,167,-167.0
557,152,-152.0
558,87,-87.0
559,153,-153.0
560,200,-200.0
561,144,-144.0
562,161,-161.0
563,161,-161.0
564,178,-178.0
565,163,-163.0
566,85,-85.0
567,144,-144.0
568,149,-149.0
569,148,-148.0
570,84,-84.0
571,196,-196.0
572,87,-87.0
573,101,-101.0
574,166,-166.0
575,186,-186.0
576,200,-200.0
577,126,-126.0
578,84,-84.0
579,93,-93.0
580,143,-143.0
581,184,-184.0
582,151,-151.0
583,93,-93.0
584,87,-87.0
585,94,-94.0
586,89,-89.0
587,152,-152.0
588,144,-144.0
589,200,-200.0
590,87,-87.0
591,200,-200.0
592,161,-161.0
593,140,-140.0
594,151,-151.0
595,140,-140.0
596,143,-143.0
597,200,-200.0
598,141,-141.0
599,87,-87.0
600,139,-139.0
601,143,-143.0
602,137,-137.0
603,165,-165.0
604,90,-90.0
605,143,-143.0
606,150,-150.0
607,157,-157.0
608,139,-139.0
609,139,-139.0
610,91,-91.0
611,139,-139.0
612,169,-169.0
613,182,-182.0
614,153,-153.0
615,138,-138.0
616,86,-86.0
617,134,-134.0
618,152,-152.0
619,87,-87.0
620,86,-86.0
621,160,-160.0
622,172,-172.0
623,139,-139.0
624,136,-136.0
625,170,-170.0
626,142,-142.0
627,140,-140.0
628,141,-141.0
629,91,-91.0
630,139,-139.0
631,146,-146.0
632,138,-138.0
633,152,-152.0
634,108,-108.0
635,140,-140.0
636,200,-200.0
637,146,-146.0
638,140,-140.0
639,145,-145.0
640,143,-143.0
641,177,-177.0
642,89,-89.0
643,89,-89.0
644,140,-140.0
645,86,-86.0
646,144,-144.0
647,200,-200.0
648,153,-153.0
649,143,-143.0
650,88,-88.0
651,152,-152.0
652,113,-113.0
653,94,-94.0
654,142,-142.0
655,143,-143.0
656,150,-150.0
657,179,-179.0
658,93,-93.0
659,140,-140.0
660,86,-86.0
661,145,-145.0
662,146,-146.0
663,85,-85.0
664,157,-157.0
665,99,-99.0
666,129,-129.0
667,107,-107.0
668,85,-85.0
669,153,-153.0
670,145,-145.0
671,147,-147.0
672,89,-89.0
673,167,-167.0
674,200,-200.0
675,89,-89.0
676,93,-93.0
677,162,-162.0
678,156,-156.0
679,152,-152.0
680,169,-169.0
681,86,-86.0
682,96,-96.0
683,102,-102.0
684,86,-86.0
685,170,-170.0
686,96,-96.0
687,200,-200.0
688,145,-145.0
689,200,-200.0
690,200,-200.0
691,150,-150.0
692,200,-200.0
693,161,-161.0
694,84,-84.0
695,187,-187.0
696,88,-88.0
697,147,-147.0
698,190,-190.0
699,159,-159.0
700,89,-89.0
701,87,-87.0
702,84,-84.0
703,86,-86.0
704,94,-94.0
705,152,-152.0
706,86,-86.0
707,106,-106.0
708,152,-152.0
709,151,-151.0
710,200,-200.0
711,100,-100.0
712,165,-165.0
713,152,-152.0
714,84,-84.0
715,152,-152.0
716,147,-147.0
717,147,-147.0
718,140,-140.0
719,149,-149.0
720,147,-147.0
721,152,-152.0
722,152,-152.0
723,150,-150.0
724,200,-200.0
725,152,-152.0
726,155,-155.0
727,143,-143.0
728,143,-143.0
729,94,-94.0
730,200,-200.0
731,97,-97.0
732,142,-142.0
733,144,-144.0
734,153,-153.0
735,149,-149.0
736,145,-145.0
737,149,-149.0
738,146,-146.0
739,93,-93.0
740,142,-142.0
741,140,-140.0
742,144,-144.0
743,142,-142.0
744,151,-151.0
745,142,-142.0
746,200,-200.0
747,142,-142.0
748,91,-91.0
749,141,-141.0
750,91,-91.0
751,97,-97.0
752,90,-90.0
753,153,-153.0
754,200,-200.0
755,149,-149.0
756,90,-90.0
757,200,-200.0
758,145,-145.0
759,107,-107.0
760,103,-103.0
761,147,-147.0
762,151,-151.0
763,143,-143.0
764,143,-143.0
765,142,-142.0
766,146,-146.0
767,145,-145.0
768,160,-160.0
769,143,-143.0
770,200,-200.0
771,155,-155.0
772,147,-147.0
773,142,-142.0
774,143,-143.0
775,149,-149.0
776,147,-147.0
777,198,-198.0
778,147,-147.0
779,144,-144.0
780,137,-137.0
781,185,-185.0
782,147,-147.0
783,156,-156.0
784,200,-200.0
785,197,-197.0
786,142,-142.0
787,139,-139.0
788,144,-144.0
789,141,-141.0
790,150,-150.0
791,151,-151.0
792,145,-145.0
793,141,-141.0
794,144,-144.0
795,144,-144.0
796,146,-146.0
797,142,-142.0
798,138,-138.0
799,146,-146.0
800,144,-144.0
801,200,-200.0
802,142,-142.0
803,147,-147.0
804,162,-162.0
805,154,-154.0
806,154,-154.0
807,150,-150.0
808,136,-136.0
809,162,-162.0
810,200,-200.0
811,142,-142.0
812,146,-146.0
813,143,-143.0
814,155,-155.0
815,155,-155.0
816,148,-148.0
817,145,-145.0
818,147,-147.0
819,148,-148.0
820,153,-153.0
821,150,-150.0
822,144,-144.0
823,143,-143.0
824,143,-143.0
825,143,-143.0
826,144,-144.0
827,149,-149.0
828,143,-143.0
829,142,-142.0
830,142,-142.0
831,147,-147.0
832,152,-152.0
833,151,-151.0
834,200,-200.0
835,200,-200.0
836,152,-152.0
837,148,-148.0
838,167,-167.0
839,149,-149.0
840,137,-137.0
841,141,-141.0
842,142,-142.0
843,145,-145.0
844,142,-142.0
845,143,-143.0
846,147,-147.0
847,131,-131.0
848,144,-144.0
849,153,-153.0
850,144,-144.0
851,143,-143.0
852,146,-146.0
853,144,-144.0
854,152,-152.0
855,200,-200.0
856,158,-158.0
857,142,-142.0
858,145,-145.0
859,148,-148.0
860,185,-185.0
861,177,-177.0
862,145,-145.0
863,117,-117.0
864,116,-116.0
865,113,-113.0
866,112,-112.0
867,113,-113.0
868,138,-138.0
869,116,-116.0
870,113,-113.0
871,114,-114.0
872,153,-153.0
873,116,-116.0
874,157,-157.0
875,111,-111.0
876,142,-142.0
877,143,-143.0
878,113,-113.0
879,182,-182.0
880,106,-106.0
881,112,-112.0
882,111,-111.0
883,117,-117.0
884,112,-112.0
885,152,-152.0
886,111,-111.0
887,158,-158.0
888,154,-154.0
889,121,-121.0
890,115,-115.0
891,136,-136.0
892,112,-112.0
893,119,-119.0
894,116,-116.0
895,114,-114.0
896,117,-117.0
897,114,-114.0
898,114,-114.0
899,110,-110.0
900,143,-143.0
901,112,-112.0
902,149,-149.0
903,114,-114.0
904,137,-137.0
905,200,-200.0
906,157,-157.0
907,154,-154.0
908,92,-92.0
909,94,-94.0
910,94,-94.0
911,97,-97.0
912,89,-89.0
913,159,-159.0
914,103,-103.0
915,91,-91.0
916,91,-91.0
917,153,-153.0
918,133,-133.0
919,86,-86.0
920,158,-158.0
921,149,-149.0
922,98,-98.0
923,148,-148.0
924,150,-150.0
925,147,-147.0
926,200,-200.0
927,149,-149.0
928,151,-151.0
929,181,-181.0
930,86,-86.0
931,144,-144.0
932,146,-146.0
933,173,-173.0
934,146,-146.0
935,155,-155.0
936,162,-162.0
937,191,-191.0
938,146,-146.0
939,90,-90.0
940,150,-150.0
941,146,-146.0
942,200,-200.0
943,160,-160.0
944,171,-171.0
945,200,-200.0
946,154,-154.0
947,150,-150.0
948,168,-168.0
949,160,-160.0
950,200,-200.0
951,117,-117.0
952,149,-149.0
953,200,-200.0
954,98,-98.0
955,200,-200.0
956,93,-93.0
957,97,-97.0
958,104,-104.0
959,154,-154.0
960,161,-161.0
961,200,-200.0
962,148,-148.0
963,152,-152.0
964,200,-200.0
965,152,-152.0
966,140,-140.0
967,144,-144.0
968,143,-143.0
969,131,-131.0
970,140,-140.0
971,200,-200.0
972,94,-94.0
973,200,-200.0
974,200,-200.0
975,151,-151.0
976,142,-142.0
977,200,-200.0
978,200,-200.0
979,200,-200.0
980,141,-141.0
981,200,-200.0
982,143,-143.0
983,137,-137.0
984,140,-140.0
985,156,-156.0
986,146,-146.0
987,190,-190.0
988,168,-168.0
989,176,-176.0
990,156,-156.0
991,156,-156.0
992,194,-194.0
993,179,-179.0
994,200,-200.0
995,172,-172.0
996,138,-138.0
997,172,-172.0
998,157,-157.0
999,163,-163.0
1000,166,-166.0
1001,155,-155.0
1002,85,-85.0
1003,175,-175.0
1004,84,-84.0
1005,122,-122.0
1006,157,-157.0
1007,200,-200.0
1008,146,-146.0
1009,151,-151.0
1010,86,-86.0
1011,150,-150.0
1012,159,-159.0
1013,200,-200.0
1014,200,-200.0
1015,183,-183.0
1016,200,-200.0
1017,173,-173.0
1018,154,-154.0
1019,138,-138.0
1020,157,-157.0
1021,119,-119.0
1022,87,-87.0
1023,92,-92.0
1024,163,-163.0
1025,180,-180.0
1026,92,-92.0
1027,157,-157.0
1028,91,-91.0
1029,160,-160.0
1030,100,-100.0
1031,186,-186.0
1032,176,-176.0
1033,144,-144.0
1034,100,-100.0
1035,97,-97.0
1036,95,-95.0
1037,91,-91.0
1038,153,-153.0
1039,169,-169.0
1040,167,-167.0
1041,200,-200.0
1042,200,-200.0
1043,152,-152.0
1044,153,-153.0
1045,166,-166.0
1046,167,-167.0
1047,163,-163.0
1048,149,-149.0
1049,161,-161.0
1050,158,-158.0
1051,146,-146.0
1052,154,-154.0
1053,86,-86.0
1054,161,-161.0
1055,149,-149.0
1056,149,-149.0
1057,85,-85.0
1058,105,-105.0
1059,157,-157.0
1060,161,-161.0
1061,92,-92.0
1062,148,-148.0
1063,94,-94.0
1064,145,-145.0
1065,162,-162.0
1066,90,-90.0
1067,163,-163.0
1068,151,-151.0
1069,165,-165.0
1070,100,-100.0
1071,102,-102.0
1072,200,-200.0
1073,159,-159.0
1074,149,-149.0
1075,157,-157.0
1076,180,-180.0
1077,89,-89.0
1078,86,-86.0
1079,90,-90.0
1080,141,-141.0
1081,101,-101.0
1082,146,-146.0
1083,150,-150.0
1084,95,-95.0
1085,152,-152.0
1086,166,-166.0
1087,93,-93.0
1088,91,-91.0
1089,88,-88.0
1090,100,-100.0
1091,98,-98.0
1092,96,-96.0
1093,92,-92.0
1094,151,-151.0
1095,156,-156.0
1096,89,-89.0
1097,152,-152.0
1098,144,-144.0
1099,147,-147.0
1100,144,-144.0
1101,89,-89.0
1102,88,-88.0
1103,88,-88.0
1104,167,-167.0
1105,200,-200.0
1106,154,-154.0
1107,144,-144.0
1108,151,-151.0
1109,145,-145.0
1110,148,-148.0
1111,148,-148.0
1112,157,-157.0
1113,164,-164.0
1114,200,-200.0
1115,150,-150.0
1116,173,-173.0
1117,155,-155.0
1118,200,-200.0
1119,161,-161.0
1120,144,-144.0
1121,149,-149.0
1122,145,-145.0
1123,138,-138.0
1124,141,-141.0
1125,95,-95.0
1126,136,-136.0
1127,157,-157.0
1128,144,-144.0
1129,157,-157.0
1130,139,-139.0
1131,165,-165.0
1132,200,-200.0
1133,141,-141.0
1134,142,-142.0
1135,200,-200.0
1136,144,-144.0
1137,148,-148.0
1138,139,-139.0
1139,148,-148.0
1140,138,-138.0
1141,135,-135.0
1142,142,-142.0
1143,140,-140.0
1144,143,-143.0
1145,149,-149.0
1146,146,-146.0
1147,145,-145.0
1148,139,-139.0
1149,137,-137.0
1150,151,-151.0
1151,149,-149.0
1152,146,-146.0
1153,200,-200.0
1154,141,-141.0
1155,160,-160.0
1156,192,-192.0
1157,200,-200.0
1158,136,-136.0
1159,133,-133.0
1160,128,-128.0
1161,91,-91.0
1162,146,-146.0
1163,143,-143.0
1164,148,-148.0
1165,168,-168.0
1166,149,-149.0
1167,157,-157.0
1168,151,-151.0
1169,182,-182.0
1170,96,-96.0
1171,200,-200.0
1172,151,-151.0
1173,89,-89.0
1174,200,-200.0
1175,200,-200.0
1176,158,-158.0
1177,154,-154.0
1178,200,-200.0
1179,151,-151.0
1180,142,-142.0
1181,154,-154.0
1182,157,-157.0
1183,151,-151.0
1184,160,-160.0
1185,146,-146.0
1186,200,-200.0
1187,142,-142.0
1188,90,-90.0
1189,143,-143.0
1190,91,-91.0
1191,169,-169.0
1192,99,-99.0
1193,173,-173.0
1194,200,-200.0
1195,134,-134.0
1196,147,-147.0
1197,88,-88.0
1198,86,-86.0
1199,140,-140.0
1200,140,-140.0
1201,200,-200.0
1202,152,-152.0
1203,152,-152.0
1204,171,-171.0
1205,156,-156.0
1206,84,-84.0
1207,130,-130.0
1208,111,-111.0
1209,136,-136.0
1210,139,-139.0
1211,133,-133.0
1212,90,-90.0
1213,138,-138.0
1214,96,-96.0
1215,159,-159.0
1216,168,-168.0
1217,193,-193.0
1218,147,-147.0
1219,168,-168.0
1220,146,-146.0
1221,145,-145.0
1222,145,-145.0
1223,136,-136.0
1224,143,-143.0
1225,139,-139.0
1226,135,-135.0
1227,138,-138.0
1228,170,-170.0
1229,163,-163.0
1230,96,-96.0
1231,91,-91.0
1232,155,-155.0
1233,84,-84.0
1234,189,-189.0
1235,140,-140.0
1236,159,-159.0
1237,140,-140.0
1238,138,-138.0
1239,139,-139.0
1240,139,-139.0
1241,143,-143.0
1242,184,-184.0
1243,163,-163.0
1244,101,-101.0
1245,145,-145.0
1246,141,-141.0
1247,142,-142.0
1248,137,-137.0
1249,158,-158.0
1250,138,-138.0
1251,143,-143.0
1252,135,-135.0
1253,139,-139.0
1254,132,-132.0
1255,153,-153.0
1256,138,-138.0
1257,136,-136.0
1258,161,-161.0
1259,138,-138.0
1260,135,-135.0
1261,150,-150.0
1262,134,-134.0
1263,135,-135.0
1264,146,-146.0
1265,169,-169.0
1266,138,-138.0
1267,103,-103.0
1268,141,-141.0
1269,144,-144.0
1270,141,-141.0
1271,142,-142.0
1272,147,-147.0
1273,174,-174.0
1274,152,-152.0
1275,200,-200.0
1276,141,-141.0
1277,200,-200.0
1278,200,-200.0
1279,200,-200.0
1280,200,-200.0
1281,200,-200.0
1282,167,-167.0
1283,159,-159.0
1284,87,-87.0
1285,182,-182.0
1286,200,-200.0
1287,200,-200.0
1288,200,-200.0
1289,119,-119.0
1290,200,-200.0
1291,200,-200.0
1292,200,-200.0
1293,200,-200.0
1294,138,-138.0
1295,200,-200.0
1296,150,-150.0
1297,144,-144.0
1298,200,-200.0
1299,200,-200.0
1300,88,-88.0
1301,200,-200.0
1302,200,-200.0
1303,200,-200.0
1304,200,-200.0
1305,200,-200.0
1306,152,-152.0
1307,200,-200.0
1308,139,-139.0
1309,200,-200.0
1310,151,-151.0
1311,89,-89.0
1312,87,-87.0
1313,158,-158.0
1314,156,-156.0
1315,148,-148.0
1316,200,-200.0
1317,97,-97.0
1318,192,-192.0
1319,200,-200.0
1320,88,-88.0
1321,200,-200.0
1322,200,-200.0
1323,149,-149.0
1324,100,-100.0
1325,91,-91.0
1326,91,-91.0
1327,167,-167.0
1328,151,-151.0
1329,186,-186.0
1330,154,-154.0
1331,152,-152.0
1332,117,-117.0
1333,146,-146.0
1334,118,-118.0
1335,86,-86.0
1336,144,-144.0
1337,144,-144.0
1338,88,-88.0
1339,144,-144.0
1340,148,-148.0
1341,92,-92.0
1342,148,-148.0
1343,143,-143.0
1344,149,-149.0
1345,200,-200.0
1346,144,-144.0
1347,153,-153.0
1348,140,-140.0
1349,142,-142.0
1350,160,-160.0
1351,144,-144.0
1352,144,-144.0
1353,200,-200.0
1354,148,-148.0
1355,93,-93.0
1356,200,-200.0
1357,139,-139.0
1358,200,-200.0
1359,96,-96.0
1360,96,-96.0
1361,93,-93.0
1362,154,-154.0
1363,147,-147.0
1364,183,-183.0
1365,168,-168.0
1366,157,-157.0
1367,143,-143.0
1368,89,-89.0
1369,147,-147.0
1370,168,-168.0
1371,150,-150.0
1372,149,-149.0
1373,97,-97.0
1374,90,-90.0
1375,145,-145.0
1376,89,-89.0
1377,168,-168.0
1378,87,-87.0
1379,88,-88.0
1380,146,-146.0
1381,146,-146.0
1382,179,-179.0
1383,182,-182.0
1384,147,-147.0
1385,149,-149.0
1386,200,-200.0
1387,102,-102.0
1388,142,-142.0
1389,145,-145.0
1390,97,-97.0
1391,200,-200.0
1392,150,-150.0
1393,151,-151.0
1394,141,-141.0
1395,141,-141.0
1396,142,-142.0
1397,140,-140.0
1398,174,-174.0
1399,91,-91.0
1400,144,-144.0
1401,87,-87.0
1402,145,-145.0
1403,142,-142.0
1404,103,-103.0
1405,89,-89.0
1406,112,-112.0
1407,200,-200.0
1408,110,-110.0
1409,149,-149.0
1410,200,-200.0
1411,85,-85.0
1412,90,-90.0
1413,89,-89.0
1414,144,-144.0
1415,143,-143.0
1416,93,-93.0
1417,157,-157.0
1418,200,-200.0
1419,98,-98.0
1420,143,-143.0
1421,157,-157.0
1422,150,-150.0
1423,100,-100.0
1424,94,-94.0
1425,153,-153.0
1426,147,-147.0
1427,87,-87.0
1428,92,-92.0
1429,91,-91.0
1430,147,-147.0
1431,147,-147.0
1432,144,-144.0
1433,148,-148.0
1434,150,-150.0
1435,91,-91.0
1436,147,-147.0
1437,151,-151.0
1438,147,-147.0
1439,178,-178.0
1440,149,-149.0
1441,157,-157.0
1442,139,-139.0
1443,145,-145.0
1444,137,-137.0
1445,153,-153.0
1446,137,-137.0
1447,139,-139.0
1448,143,-143.0
1449,144,-144.0
1450,149,-149.0
1451,200,-200.0
1452,200,-200.0
1453,200,-200.0
1454,150,-150.0
1455,157,-157.0
1456,148,-148.0
1457,149,-149.0
1458,151,-151.0
1459,153,-153.0
1460,165,-165.0
1461,91,-91.0
1462,149,-149.0
1463,87,-87.0
1464,146,-146.0
1465,147,-147.0
1466,148,-148.0
1467,139,-139.0
1468,160,-160.0
1469,153,-153.0
1470,109,-109.0
1471,140,-140.0
1472,148,-148.0
1473,200,-200.0
1474,200,-200.0
1475,200,-200.0
1476,147,-147.0
1477,151,-151.0
1478,153,-153.0
1479,88,-88.0
1480,95,-95.0
1481,145,-145.0
1482,143,-143.0
1483,142,-142.0
1484,151,-151.0
1485,149,-149.0
1486,147,-147.0
1487,153,-153.0
1488,149,-149.0
1489,150,-150.0
1490,200,-200.0
1491,200,-200.0
1492,200,-200.0
1493,151,-151.0
1494,90,-90.0
1495,200,-200.0
1496,155,-155.0
1497,143,-143.0
1498,141,-141.0
1499,165,-165.0
1500,92,-92.0
1501,200,-200.0
1502,200,-200.0
1503,149,-149.0
1504,200,-200.0
1505,160,-160.0
1506,151,-151.0
1507,151,-151.0
1508,160,-160.0
1509,149,-149.0
1510,105,-105.0
1511,142,-142.0
1512,147,-147.0
1513,152,-152.0
1514,157,-157.0
1515,171,-171.0
1516,88,-88.0
1517,200,-200.0
1518,184,-184.0
1519,200,-200.0
1520,200,-200.0
1521,183,-183.0
1522,200,-200.0
1523,200,-200.0
1524,148,-148.0
1525,147,-147.0
1526,151,-151.0
1527,161,-161.0
1528,150,-150.0
1529,149,-149.0
1530,87,-87.0
1531,85,-85.0
1532,151,-151.0
1533,97,-97.0
1534,170,-170.0
1535,151,-151.0
1536,157,-157.0
1537,86,-86.0
1538,174,-174.0
1539,200,-200.0
1540,154,-154.0
1541,200,-200.0
1542,146,-146.0
1543,200,-200.0
1544,200,-200.0
1545,200,-200.0
1546,147,-147.0
1547,154,-154.0
1548,141,-141.0
1549,190,-190.0
1550,150,-150.0
1551,149,-149.0
1552,200,-200.0
1553,141,-141.0
1554,155,-155.0
1555,86,-86.0
1556,149,-149.0
1557,200,-200.0
1558,141,-141.0
1559,143,-143.0
1560,141,-141.0
1561,143,-143.0
1562,155,-155.0
1563,141,-141.0
1564,138,-138.0
1565,138,-138.0
1566,137,-137.0
1567,148,-148.0
1568,140,-140.0
1569,154,-154.0
1570,147,-147.0
1571,146,-146.0
1572,144,-144.0
1573,143,-143.0
1574,147,-147.0
1575,149,-149.0
1576,200,-200.0
1577,95,-95.0
1578,158,-158.0
1579,150,-150.0
1580,143,-143.0
1581,143,-143.0
1582,200,-200.0
1583,151,-151.0
1584,140,-140.0
1585,150,-150.0
1586,159,-159.0
1587,150,-150.0
1588,152,-152.0
1589,96,-96.0
1590,200,-200.0
1591,155,-155.0
1592,175,-175.0
1593,153,-153.0
1594,200,-200.0
1595,183,-183.0
1596,109,-109.0
1597,174,-174.0
1598,200,-200.0
1599,200,-200.0
1600,179,-179.0
1601,93,-93.0
1602,160,-160.0
1603,200,-200.0
1604,93,-93.0
1605,96,-96.0
1606,87,-87.0
1607,87,-87.0
1608,150,-150.0
1609,110,-110.0
1610,86,-86.0
1611,148,-148.0
1612,151,-151.0
1613,96,-96.0
1614,87,-87.0
1615,150,-150.0
1616,148,-148.0
1617,200,-200.0
1618,95,-95.0
1619,162,-162.0
1620,168,-168.0
1621,163,-163.0
1622,200,-200.0
1623,200,-200.0
1624,200,-200.0
1625,152,-152.0
1626,99,-99.0
1627,168,-168.0
1628,200,-200.0
1629,177,-177.0
1630,200,-200.0
1631,103,-103.0
1632,200,-200.0
1633,200,-200.0
1634,137,-137.0
1635,105,-105.0
1636,141,-141.0
1637,158,-158.0
1638,90,-90.0
1639,150,-150.0
1640,161,-161.0
1641,147,-147.0
1642,151,-151.0
1643,153,-153.0
1644,148,-148.0
1645,200,-200.0
1646,162,-162.0
1647,200,-200.0
1648,93,-93.0
1649,200,-200.0
1650,91,-91.0
1651,191,-191.0
1652,200,-200.0
1653,155,-155.0
1654,179,-179.0
1655,158,-158.0
1656,161,-161.0
1657,88,-88.0
1658,200,-200.0
1659,178,-178.0
1660,176,-176.0
1661,151,-151.0
1662,102,-102.0
1663,148,-148.0
1664,200,-200.0
1665,102,-102.0
1666,150,-150.0
1667,106,-106.0
1668,145,-145.0
1669,139,-139.0
1670,200,-200.0
1671,143,-143.0
1672,145,-145.0
1673,84,-84.0
1674,113,-113.0
1675,153,-153.0
1676,143,-143.0
1677,150,-150.0
1678,148,-148.0
1679,143,-143.0
1680,149,-149.0
1681,149,-149.0
1682,170,-170.0
1683,143,-143.0
1684,143,-143.0
1685,144,-144.0
1686,87,-87.0
1687,92,-92.0
1688,142,-142.0
1689,148,-148.0
1690,143,-143.0
1691,145,-145.0
1692,85,-85.0
1693,146,-146.0
1694,143,-143.0
1695,161,-161.0
1696,143,-143.0
1697,90,-90.0
1698,104,-104.0
1699,158,-158.0
1700,146,-146.0
1701,100,-100.0
1702,142,-142.0
1703,157,-157.0
1704,97,-97.0
1705,93,-93.0
1706,146,-146.0
1707,94,-94.0
1708,120,-120.0
1709,91,-91.0
1710,90,-90.0
1711,145,-145.0
1712,142,-142.0
1713,200,-200.0
1714,150,-150.0
1715,167,-167.0
1716,146,-146.0
1717,189,-189.0
1718,144,-144.0
1719,141,-141.0
1720,200,-200.0
1721,138,-138.0
1722,145,-145.0
1723,143,-143.0
1724,141,-141.0
1725,147,-147.0
1726,144,-144.0
1727,140,-140.0
1728,139,-139.0
1729,140,-140.0
1730,141,-141.0
1731,147,-147.0
1732,146,-146.0
1733,139,-139.0
1734,139,-139.0
1735,145,-145.0
1736,86,-86.0
1737,85,-85.0
1738,143,-143.0
1739,140,-140.0
1740,85,-85.0
1741,95,-95.0
1742,200,-200.0
1743,144,-144.0
1744,132,-132.0
1745,159,-159.0
1746,102,-102.0
1747,140,-140.0
1748,97,-97.0
1749,141,-141.0
1750,118,-118.0
1751,163,-163.0
1752,145,-145.0
1753,84,-84.0
1754,142,-142.0
1755,151,-151.0
1756,170,-170.0
1757,139,-139.0
1758,147,-147.0
1759,86,-86.0
1760,139,-139.0
1761,140,-140.0
1762,140,-140.0
1763,181,-181.0
1764,142,-142.0
1765,140,-140.0
1766,93,-93.0
1767,143,-143.0
1768,140,-140.0
1769,90,-90.0
1770,100,-100.0
1771,93,-93.0
1772,139,-139.0
1773,139,-139.0
1774,143,-143.0
1775,160,-160.0
1776,139,-139.0
1777,175,-175.0
1778,138,-138.0
1779,145,-145.0
1780,142,-142.0
1781,139,-139.0
1782,141,-141.0
1783,138,-138.0
1784,140,-140.0
1785,140,-140.0
1786,93,-93.0
1787,85,-85.0
1788,150,-150.0
1789,137,-137.0
1790,139,-139.0
1791,142,-142.0
1792,141,-141.0
1793,135,-135.0
1794,97,-97.0
1795,140,-140.0
1796,161,-161.0
1797,166,-166.0
1798,99,-99.0
1799,143,-143.0
1800,98,-98.0
1801,140,-140.0
1802,165,-165.0
1803,170,-170.0
1804,144,-144.0
1805,142,-142.0
1806,141,-141.0
1807,136,-136.0
1808,143,-143.0
1809,141,-141.0
1810,91,-91.0
1811,200,-200.0
1812,140,-140.0
1813,139,-139.0
1814,138,-138.0
1815,138,-138.0
1816,85,-85.0
1817,137,-137.0
1818,138,-138.0
1819,136,-136.0
1820,140,-140.0
1821,138,-138.0
1822,137,-137.0
1823,138,-138.0
1824,137,-137.0
1825,136,-136.0
1826,135,-135.0
1827,143,-143.0
1828,136,-136.0
1829,137,-137.0
1830,149,-149.0
1831,159,-159.0
1832,136,-136.0
1833,182,-182.0
1834,141,-141.0
1835,136,-136.0
1836,139,-139.0
1837,134,-134.0
1838,140,-140.0
1839,98,-98.0
1840,101,-101.0
1841,97,-97.0
1842,138,-138.0
1843,156,-156.0
1844,154,-154.0
1845,137,-137.0
1846,157,-157.0
1847,151,-151.0
1848,145,-145.0
1849,146,-146.0
1850,142,-142.0
1851,156,-156.0
1852,145,-145.0
1853,139,-139.0
1854,147,-147.0
1855,200,-200.0
1856,200,-200.0
1857,136,-136.0
1858,159,-159.0
1859,138,-138.0
1860,137,-137.0
1861,109,-109.0
1862,138,-138.0
1863,99,-99.0
1864,149,-149.0
1865,200,-200.0
1866,140,-140.0
1867,138,-138.0
1868,186,-186.0
1869,148,-148.0
1870,90,-90.0
1871,151,-151.0
1872,88,-88.0
1873,144,-144.0
1874,145,-145.0
1875,153,-153.0
1876,162,-162.0
1877,170,-170.0
1878,99,-99.0
1879,89,-89.0
1880,149,-149.0
1881,141,-141.0
1882,106,-106.0
1883,200,-200.0
1884,200,-200.0
1885,143,-143.0
1886,163,-163.0
1887,200,-200.0
1888,200,-200.0
1889,110,-110.0
1890,142,-142.0
1891,200,-200.0
1892,109,-109.0
1893,140,-140.0
1894,84,-84.0
1895,142,-142.0
1896,141,-141.0
1897,148,-148.0
1898,145,-145.0
1899,107,-107.0
1900,146,-146.0
1901,176,-176.0
1902,164,-164.0
1903,200,-200.0
1904,90,-90.0
1905,154,-154.0
1906,111,-111.0
1907,145,-145.0
1908,104,-104.0
1909,144,-144.0
1910,170,-170.0
1911,102,-102.0
1912,200,-200.0
1913,89,-89.0
1914,200,-200.0
1915,200,-200.0
1916,154,-154.0
1917,181,-181.0
1918,200,-200.0
1919,139,-139.0
1920,144,-144.0
1921,146,-146.0
1922,153,-153.0
1923,139,-139.0
1924,148,-148.0
1925,142,-142.0
1926,138,-138.0
1927,148,-148.0
1928,195,-195.0
1929,195,-195.0
1930,134,-134.0
1931,137,-137.0
1932,136,-136.0
1933,200,-200.0
1934,200,-200.0
1935,200,-200.0
1936,200,-200.0
1937,200,-200.0
1938,142,-142.0
1939,136,-136.0
1940,200,-200.0
1941,148,-148.0
1942,146,-146.0
1943,200,-200.0
1944,142,-142.0
1945,142,-142.0
1946,200,-200.0
1947,162,-162.0
1948,148,-148.0
1949,200,-200.0
1950,148,-148.0
1951,154,-154.0
1952,147,-147.0
1953,149,-149.0
1954,149,-149.0
1955,145,-145.0
1956,145,-145.0
1957,139,-139.0
1958,139,-139.0
1959,141,-141.0
1960,138,-138.0
1961,138,-138.0
1962,136,-136.0
1963,137,-137.0
1964,138,-138.0
1965,138,-138.0
1966,134,-134.0
1967,139,-139.0
1968,140,-140.0
1969,142,-142.0
1970,134,-134.0
1971,136,-136.0
1972,146,-146.0
1973,156,-156.0
1974,134,-134.0
1975,144,-144.0
1976,145,-145.0
1977,148,-148.0
1978,147,-147.0
1979,200,-200.0
1980,143,-143.0
1981,141,-141.0
1982,141,-141.0
1983,142,-142.0
1984,154,-154.0
1985,144,-144.0
1986,142,-142.0
1987,139,-139.0
1988,141,-141.0
1989,200,-200.0
1990,147,-147.0
1991,151,-151.0
1992,155,-155.0
1993,143,-143.0
1994,149,-149.0
1995,146,-146.0
1996,145,-145.0
1997,154,-154.0
1998,148,-148.0
1999,145,-145.0
2000,144,-144.0
2001,146,-146.0
2002,147,-147.0
2003,146,-146.0
2004,149,-149.0
2005,147,-147.0
2006,147,-147.0
2007,149,-149.0
2008,147,-147.0
2009,150,-150.0
2010,200,-200.0
2011,148,-148.0
2012,145,-145.0
2013,145,-145.0
2014,152,-152.0
2015,148,-148.0
2016,150,-150.0
2017,200,-200.0
2018,139,-139.0
2019,139,-139.0
2020,148,-148.0
2021,150,-150.0
2022,147,-147.0
2023,175,-175.0
2024,113,-113.0
2025,151,-151.0
2026,146,-146.0
2027,156,-156.0
2028,156,-156.0
2029,152,-152.0
2030,114,-114.0
2031,149,-149.0
2032,157,-157.0
2033,155,-155.0
2034,143,-143.0
2035,147,-147.0
2036,147,-147.0
2037,143,-143.0
2038,157,-157.0
2039,157,-157.0
2040,158,-158.0
2041,150,-150.0
2042,146,-146.0
2043,163,-163.0
2044,150,-150.0
2045,160,-160.0
2046,190,-190.0
2047,200,-200.0
2048,200,-200.0
2049,200,-200.0
2050,158,-158.0
2051,156,-156.0
2052,152,-152.0
2053,172,-172.0
2054,141,-141.0
2055,200,-200.0
2056,156,-156.0
2057,140,-140.0
2058,151,-151.0
2059,176,-176.0
2060,200,-200.0
2061,148,-148.0
2062,200,-200.0
2063,148,-148.0
2064,146,-146.0
2065,147,-147.0
2066,145,-145.0
2067,151,-151.0
2068,200,-200.0
2069,200,-200.0
2070,200,-200.0
2071,200,-200.0
2072,163,-163.0
2073,200,-200.0
2074,200,-200.0
2075,180,-180.0
2076,200,-200.0
2077,200,-200.0
2078,200,-200.0
2079,200,-200.0
2080,200,-200.0
2081,174,-174.0
2082,200,-200.0
2083,200,-200.0
2084,187,-187.0
2085,169,-169.0
2086,188,-188.0
2087,200,-200.0
2088,156,-156.0
2089,133,-133.0
2090,173,-173.0
2091,200,-200.0
2092,153,-153.0
2093,120,-120.0
2094,130,-130.0
2095,156,-156.0
2096,193,-193.0
2097,113,-113.0
2098,128,-128.0
2099,141,-141.0
2100,115,-115.0
2101,164,-164.0
2102,111,-111.0
2103,163,-163.0
2104,150,-150.0
2105,159,-159.0
2106,194,-194.0
2107,115,-115.0
2108,200,-200.0
2109,113,-113.0
2110,143,-143.0
2111,151,-151.0
2112,146,-146.0
2113,139,-139.0
2114,147,-147.0
2115,152,-152.0
2116,144,-144.0
2117,158,-158.0
2118,153,-153.0
2119,168,-168.0
2120,151,-151.0
2121,152,-152.0
2122,86,-86.0
2123,147,-147.0
2124,159,-159.0
2125,91,-91.0
2126,200,-200.0
2127,141,-141.0
2128,91,-91.0
2129,157,-157.0
2130,154,-154.0
2131,153,-153.0
2132,117,-117.0
2133,168,-168.0
2134,146,-146.0
2135,114,-114.0
2136,133,-133.0
2137,166,-166.0
2138,153,-153.0
2139,151,-151.0
2140,153,-153.0
2141,181,-181.0
2142,145,-145.0
2143,144,-144.0
2144,182,-182.0
2145,177,-177.0
2146,181,-181.0
2147,155,-155.0
2148,151,-151.0
2149,85,-85.0
2150,89,-89.0
2151,119,-119.0
2152,167,-167.0
2153,84,-84.0
2154,160,-160.0
2155,152,-152.0
2156,141,-141.0
2157,154,-154.0
2158,156,-156.0
2159,93,-93.0
2160,148,-148.0
2161,88,-88.0
2162,154,-154.0
2163,158,-158.0
2164,86,-86.0
2165,90,-90.0
2166,158,-158.0
2167,147,-147.0
2168,146,-146.0
2169,151,-151.0
2170,94,-94.0
2171,155,-155.0
2172,153,-153.0
2173,87,-87.0
2174,167,-167.0
2175,128,-128.0
2176,148,-148.0
2177,148,-148.0
2178,146,-146.0
2179,142,-142.0
2180,140,-140.0
2181,89,-89.0
2182,85,-85.0
2183,84,-84.0
2184,116,-116.0
2185,117,-117.0
2186,115,-115.0
2187,173,-173.0
2188,85,-85.0
2189,111,-111.0
2190,169,-169.0
2191,141,-141.0
2192,152,-152.0
2193,153,-153.0
2194,85,-85.0
2195,88,-88.0
2196,84,-84.0
2197,113,-113.0
2198,114,-114.0
2199,114,-114.0
2200,121,-121.0
2201,122,-122.0
2202,86,-86.0
2203,112,-112.0
2204,85,-85.0
2205,114,-114.0
2206,120,-120.0
2207,168,-168.0
2208,85,-85.0
2209,121,-121.0
2210,119,-119.0
2211,114,-114.0
2212,115,-115.0
2213,120,-120.0
2214,118,-118.0
2215,116,-116.0
2216,86,-86.0
2217,116,-116.0
2218,92,-92.0
2219,94,-94.0
2220,115,-115.0
2221,120,-120.0
2222,120,-120.0
2223,120,-120.0
2224,85,-85.0
2225,116,-116.0
2226,151,-151.0
2227,200,-200.0
2228,160,-160.0
2229,157,-157.0
2230,150,-150.0
2231,136,-136.0
2232,147,-147.0
2233,86,-86.0
2234,159,-159.0
2235,160,-160.0
2236,151,-151.0
2237,115,-115.0
2238,162,-162.0
2239,162,-162.0
2240,162,-162.0
2241,183,-183.0
2242,89,-89.0
2243,155,-155.0
2244,195,-195.0
2245,98,-98.0
2246,160,-160.0
2247,121,-121.0
2248,136,-136.0
2249,155,-155.0
2250,87,-87.0
2251,158,-158.0
2252,87,-87.0
2253,152,-152.0
2254,152,-152.0
2255,153,-153.0
2256,154,-154.0
2257,157,-157.0
2258,142,-142.0
2259,88,-88.0
2260,189,-189.0
2261,149,-149.0
2262,149,-149.0
2263,146,-146.0
2264,150,-150.0
2265,158,-158.0
2266,104,-104.0
2267,163,-163.0
2268,169,-169.0
2269,154,-154.0
2270,147,-147.0
2271,111,-111.0
2272,155,-155.0
2273,85,-85.0
2274,158,-158.0
2275,156,-156.0
2276,148,-148.0
2277,134,-134.0
2278,144,-144.0
2279,148,-148.0
2280,146,-146.0
2281,97,-97.0
2282,169,-169.0
2283,151,-151.0
2284,146,-146.0
2285,145,-145.0
2286,95,-95.0
2287,192,-192.0
2288,148,-148.0
2289,147,-147.0
2290,147,-147.0
2291,147,-147.0
2292,153,-153.0
2293,150,-150.0
2294,149,-149.0
2295,153,-153.0
2296,91,-91.0
2297,151,-151.0
2298,100,-100.0
2299,149,-149.0
2300,147,-147.0
2301,177,-177.0
2302,98,-98.0
2303,156,-156.0
2304,150,-150.0
2305,153,-153.0
2306,116,-116.0
2307,147,-147.0
2308,181,-181.0
2309,95,-95.0
2310,158,-158.0
2311,157,-157.0
2312,84,-84.0
2313,157,-157.0
2314,148,-148.0
2315,150,-150.0
2316,96,-96.0
2317,149,-149.0
2318,84,-84.0
2319,96,-96.0
2320,153,-153.0
2321,159,-159.0
2322,153,-153.0
2323,90,-90.0
2324,154,-154.0
2325,200,-200.0
2326,151,-151.0
2327,155,-155.0
2328,152,-152.0
2329,158,-158.0
2330,92,-92.0
2331,89,-89.0
2332,154,-154.0
2333,160,-160.0
2334,150,-150.0
2335,87,-87.0
2336,89,-89.0
2337,159,-159.0
2338,105,-105.0
2339,200,-200.0
2340,200,-200.0
2341,200,-200.0
2342,153,-153.0
2343,164,-164.0
2344,88,-88.0
2345,200,-200.0
2346,86,-86.0
2347,87,-87.0
2348,163,-163.0
2349,200,-200.0
2350,150,-150.0
2351,141,-141.0
2352,97,-97.0
2353,161,-161.0
2354,89,-89.0
2355,157,-157.0
2356,162,-162.0
2357,149,-149.0
2358,158,-158.0
2359,156,-156.0
2360,160,-160.0
2361,200,-200.0
2362,146,-146.0
2363,160,-160.0
2364,176,-176.0
2365,157,-157.0
2366,155,-155.0
2367,157,-157.0
2368,97,-97.0
2369,90,-90.0
2370,91,-91.0
2371,164,-164.0
2372,174,-174.0
2373,160,-160.0
2374,160,-160.0
2375,109,-109.0
2376,88,-88.0
2377,200,-200.0
2378,200,-200.0
2379,88,-88.0
2380,156,-156.0
2381,87,-87.0
2382,173,-173.0
2383,156,-156.0
2384,156,-156.0
2385,90,-90.0
2386,200,-200.0
2387,160,-160.0
2388,155,-155.0
2389,94,-94.0
2390,152,-152.0
2391,91,-91.0
2392,150,-150.0
2393,155,-155.0
2394,153,-153.0
2395,154,-154.0
2396,151,-151.0
2397,157,-157.0
2398,158,-158.0
2399,157,-157.0
2400,152,-152.0
2401,156,-156.0
2402,200,-200.0
2403,200,-200.0
2404,87,-87.0
2405,151,-151.0
2406,153,-153.0
2407,155,-155.0
2408,200,-200.0
2409,200,-200.0
2410,96,-96.0
2411,200,-200.0
2412,200,-200.0
2413,155,-155.0
2414,152,-152.0
2415,156,-156.0
2416,94,-94.0
2417,200,-200.0
2418,200,-200.0
2419,152,-152.0
2420,150,-150.0
2421,145,-145.0
2422,145,-145.0
2423,159,-159.0
2424,150,-150.0
2425,200,-200.0
2426,200,-200.0
2427,148,-148.0
2428,149,-149.0
2429,142,-142.0
2430,200,-200.0
2431,150,-150.0
2432,142,-142.0
2433,144,-144.0
2434,142,-142.0
2435,142,-142.0
2436,154,-154.0
2437,141,-141.0
2438,200,-200.0
2439,150,-150.0
2440,143,-143.0
2441,151,-151.0
2442,147,-147.0
2443,146,-146.0
2444,148,-148.0
2445,149,-149.0
2446,154,-154.0
2447,153,-153.0
2448,158,-158.0
2449,200,-200.0
2450,200,-200.0
