episodes,steps,rewards
0,87,-252.79895377198548
1,108,-177.4555534312438
2,122,-71.17808479600582
3,70,-201.6900494031994
4,82,-226.62663788543156
5,78,-209.82081725730086
6,96,-374.23468144475584
7,97,-345.31205123072016
8,74,-181.54770282091937
9,69,-40.54848287610598
10,86,-248.90345736627754
11,99,-119.53027862367892
12,232,-216.7479100563096
13,1000,36.169442139941175
14,158,-23.680403977945375
15,822,-284.88902394001593
16,291,-166.2308978701722
17,312,-154.26450389552735
18,1000,-224.19537657688767
19,1000,-47.24234680409184
20,1000,-62.99419996325716
21,1000,-94.21922353242776
22,1000,-46.545126382618754
23,447,247.96447970731418
24,1000,50.698030869034845
25,1000,15.949394273768517
26,674,206.70808092693775
27,1000,44.01486463508393
28,1000,48.607024278206076
29,1000,57.963072382128765
30,777,204.337085283929
31,404,176.6485433266172
32,817,161.81155909968166
33,123,-68.46129419737072
34,126,-280.17780681782057
35,228,-284.9654111535001
36,645,147.3192515978303
37,527,233.052439007033
38,100,1.9575967927058855
39,1000,-13.67526297590062
40,88,-113.44207273506113
41,79,-55.42693845645425
42,78,-27.215380290972746
43,1000,-41.43676233540985
44,1000,-59.10525228044321
45,1000,37.639775501580296
46,130,-228.65705148015454
47,1000,0.9114963149132027
48,804,-227.93806257626738
49,337,186.69260448207535
50,128,-28.83833313673152
51,511,215.5019370596113
52,644,171.19205837371788
53,481,197.38533219726673
54,204,-120.35756957171455
55,498,223.15489384378134
56,741,184.06120150272926
57,453,-232.2633758613843
58,363,227.6846885311174
59,449,186.0575154960469
60,652,180.90454928755904
61,424,237.37819840309712
62,344,265.29694575713063
63,479,203.32660059216335
64,354,280.2694904705801
65,342,230.9989015176454
66,299,256.35159314295464
67,214,293.7169559223796
68,408,256.3196160571689
69,380,186.4896236519231
70,355,280.41027746546825
71,772,145.50434854228536
72,386,270.65623897980527
73,594,183.3307320376585
74,639,145.9069084973286
75,664,239.27814109737815
76,370,260.54502049489247
77,391,243.43978876623058
78,482,252.3202603888888
79,370,284.68296230144017
80,316,248.93081888963175
81,560,194.84567362592475
82,218,263.9462593294119
83,305,265.6879039562839
84,281,261.09306900838936
85,493,254.94674724789823
86,737,237.3724358287877
87,517,227.93688673085592
88,284,244.97086595023785
89,467,170.2212155514689
90,701,181.13577392963145
91,426,208.97648002793653
92,322,244.61704324629915
93,315,243.76396280634427
94,238,261.01581189002263
95,303,264.4155744922466
96,848,136.55475968678454
97,395,209.35801664892202
98,851,218.36845380353742
99,521,243.90224595960893
100,460,242.13574185657885
101,348,227.90018902032864
102,211,283.8266112595485
103,343,247.7634239787371
104,219,268.836010059156
105,269,250.06448602569577
106,413,221.8446712381893
107,486,210.4413948567542
108,290,274.7937513769033
109,624,261.11833730090007
110,415,237.37776210015318
111,352,215.01918977330976
112,259,268.42870730512834
113,305,231.2547893195972
114,408,255.50432710852766
115,483,219.62558721452783
116,277,223.32741735905603
117,281,265.58975984395056
118,241,259.19208127555004
119,491,253.60352648257864
120,280,265.84517022262986
121,541,200.3406678135059
122,581,243.98653991949791
123,317,7.527928575956068
124,241,236.44779493312868
125,298,230.09684557559106
126,255,223.50394444869164
127,361,214.77513530194557
128,291,230.03475328420186
129,298,279.8856959377149
130,246,255.29913804907784
131,359,233.13247622445346
132,221,271.63542404036707
133,257,258.12919561965145
134,448,190.33172355617276
135,475,181.32566567937124
136,439,273.8907999454668
137,327,254.13185602199664
138,285,241.06252528810734
139,343,235.55714360806465
140,269,265.0089506784617
141,278,250.1670681104954
142,422,203.3058776369798
143,258,240.0164316296381
