episodes,steps,rewards
0,94,-134.99061716654643
1,97,-151.70339814731062
2,107,-193.45118107219272
3,84,-163.026152200674
4,127,-300.3191154216506
5,149,19.57872512832155
6,151,-69.63253058649269
7,171,-333.66812211376407
8,78,-468.070097857029
9,630,-438.6225081688797
10,1000,-109.10434469252833
11,1000,-93.31791990452416
12,796,-295.5813934961668
13,1000,-105.76166407715446
14,1000,-93.28085029973238
15,1000,-73.69550485712304
16,1000,-58.61303844615631
17,1000,-47.6142487200368
18,518,189.6957546986293
19,408,-169.30085584114858
20,292,-152.30073570301334
21,329,28.808009162522637
22,749,-71.90214127967185
23,70,-160.78742073194044
24,1000,6.240445200841129
25,495,-138.78004045905888
26,1000,-5.1197006560097025
27,1000,-2.82594810796606
28,1000,-68.97140049218918
29,329,-511.0171482511373
30,1000,-16.050861952219527
31,1000,-40.43886164179263
32,1000,-74.8915091646127
33,987,-255.87034615702675
34,128,-43.22627237365205
35,594,-174.40671410632174
36,738,-132.40373525662272
37,1000,11.338668214922405
38,1000,32.0047886348585
39,144,-219.15703413216664
40,743,121.0560532907198
41,152,-226.89498753880463
42,195,-190.60578941872387
43,1000,24.478951409735682
44,1000,11.764274976655622
45,1000,-88.94489486191233
46,966,141.56028007950565
47,1000,-55.85796480704477
48,1000,-25.874747711821026
49,1000,18.433934035574687
50,1000,-13.28600053252774
51,1000,63.59063623510564
52,1000,-28.84664420931076
53,372,214.67917533304566
54,519,155.47629670939358
55,349,222.117714083403
56,414,-23.202165746215158
57,1000,13.126408545953197
58,1000,-28.25769371171998
59,884,187.21909355926974
60,697,215.18585370644715
61,1000,89.04973623813939
62,911,191.3564675638714
63,278,244.57478730484866
64,735,212.1451735089727
65,309,-92.28394152914171
66,1000,49.2967681428087
67,671,240.74679392190356
68,897,238.12149649336962
69,926,195.4051706448886
70,1000,42.664428405720486
71,1000,-3.3696063320545226
72,118,-132.69952002257642
73,308,228.58379869983298
74,1000,69.32917723288791
75,312,212.3038554989816
76,244,236.09048349422068
77,1000,114.27893997811098
78,235,303.8384259176709
79,415,261.87967899310473
80,191,-14.113394572599987
81,95,-97.07979824894049
82,572,208.8803939772598
83,343,274.630052070284
84,150,23.46655146449524
85,234,-104.1545428487619
86,343,232.52493423168562
87,480,278.95647330951147
88,248,252.4706470482456
89,330,281.04484791861364
90,482,211.7169332422072
91,303,214.49974043196045
92,750,220.24441769794743
93,884,190.66665756887414
94,160,32.967160562425875
95,317,222.86069579869832
96,213,244.55140162322843
97,397,256.9605219555803
98,215,251.06788335332507
99,351,275.190931652918
100,283,263.7798625879883
