episodes,steps,rewards
0,95,-156.85267170581494
1,94,-362.9659186546462
2,94,-125.3644974413211
3,113,-254.30593521752672
4,144,-46.70226565263661
5,119,-94.34808586915487
6,114,-108.78410995692332
7,104,-216.90494530514025
8,121,-155.10190877631126
9,128,-323.33860610536817
10,87,-405.9088458233302
11,78,-353.3939851343807
12,79,-279.0881914035996
13,113,-386.4199591366459
14,87,-355.3555681884906
15,338,-105.1490670779509
16,162,-187.18353990892712
17,78,-498.9650544163454
18,325,-76.33461688956857
19,156,-89.57235862038817
20,1000,-118.84896151568464
21,1000,-42.31968274708805
22,1000,-31.710047778582307
23,1000,-70.78131123340455
24,1000,-163.53225808618288
25,1000,-51.7454384896166
26,1000,-34.05804384150186
27,1000,-86.65737606386334
28,1000,-84.67583885783142
29,1000,-164.87489499456234
30,470,-236.15672227053486
31,1000,-63.469136752263104
32,617,-148.92721407433766
33,1000,-58.56271594394696
34,407,-189.16242573136196
35,212,-54.1332172189955
36,537,171.18956980590914
37,287,-41.80995779831372
38,1000,-117.8702857253933
39,1000,-118.1144494143941
40,1000,-106.63479047738413
41,1000,-41.23075705788334
42,1000,-138.55228584862607
43,834,-260.73219847624796
44,199,-190.205496488668
45,1000,-95.70429203620003
46,1000,-124.61432110302994
47,968,-273.2171809065319
48,217,-131.3766051929352
49,391,-90.57296730962366
50,62,-138.83975250925255
51,1000,-88.84990154129244
52,367,-93.2356963907332
53,148,-157.14342835628588
54,127,-142.89248525841123
55,1000,-84.81356790241
56,1000,-99.38862694969404
57,725,-217.32690376700143
58,1000,-63.375324919804854
59,1000,-66.0488591995732
60,1000,-38.6403873022459
61,509,231.59332226818884
62,1000,-64.25339467315764
63,1000,-62.1909688577742
64,1000,-68.99175893698377
65,1000,-105.0399737374477
66,1000,-86.3447332660582
67,300,-229.4887778030724
68,1000,-16.015621666221662
69,1000,-24.834551755467135
70,1000,-73.47895085295033
71,267,-350.93870241141695
72,1000,-92.55391599839082
73,1000,-93.16916340430522
74,1000,-135.83270638057382
75,1000,-157.29909825946834
76,1000,-47.34934888741029
77,1000,-184.37371297109135
78,222,-123.76745542202764
79,319,187.394737512759
80,1000,-119.12933554529822
81,1000,-81.98820664057448
82,1000,-24.721635596444973
83,1000,-87.08486261931586
84,1000,-49.87107831125424
85,957,-106.19697158360736
86,392,196.47891415268205
87,1000,-23.54629338173232
88,263,-218.86319207436907
89,1000,-19.421910139683803
90,1000,-24.80058222459532
91,1000,-122.2723285083751
92,1000,-28.045677121420493
93,753,122.14148945848541
94,1000,-69.34737765856852
95,187,-270.4188710607149
96,464,-249.09032114305072
97,236,-129.90614792076127
98,1000,-52.40143713591106
99,66,-49.92088221482975
100,1000,-67.21876510078314
101,156,-300.91939693331085
102,161,-311.69626447420967
103,1000,-55.23382656988063
104,1000,-11.75237653561663
105,408,-184.4524437073967
106,238,-37.84309185905872
107,780,-147.50198816123745
108,386,-157.62548111906898
109,412,-296.17298007346005
110,95,-172.78206075258697
111,246,276.05752734755595
112,361,-234.85620864455888
113,1000,-94.4580088377564
114,1000,-31.408258711149138
115,1000,-79.91403868296693
116,629,-302.7127499275284
117,533,197.72858377269065
118,152,-84.0368610929865
119,248,163.17341112222286
120,1000,-45.588434553433004
121,1000,-54.576998776203354
122,1000,-26.510695343710704
123,221,-322.677656095089
124,168,-210.86901124596812
125,1000,-33.55371558673741
126,1000,-68.17841546889962
127,191,-82.99062023586919
128,1000,-76.75115463038084
129,113,-124.73394513893079
130,1000,-36.36978012731653
131,1000,-90.71409137249509
132,1000,-15.323925101549355
133,1000,-53.27530978908707
134,1000,-58.49429983705847
135,1000,-62.035104757898864
136,1000,-42.15878334234749
137,1000,-44.78788344926364
138,1000,-55.06636048880977
139,1000,-26.62965387457653
140,1000,-47.981102799564994
141,1000,0.611553576341404
142,377,-51.36672222069416
143,1000,-69.24081184611002
144,1000,-31.08162738817973
145,193,-176.35708757780293
146,1000,-15.169156632223398
147,1000,-36.7877339959923
148,1000,-33.14269197426257
149,1000,-44.37207145616462
150,1000,-60.08379810364942
151,1000,-13.705066494551197
152,1000,-68.54982624943116
153,392,-154.12520214247738
154,1000,-15.177382899293875
155,1000,-57.50044596669288
156,1000,-31.355234053866855
157,1000,-34.24618346530537
158,1000,-7.812206219540309
159,365,265.31977322769114
160,171,243.79550944412026
161,1000,-60.40895155920235
162,190,-224.28650832329944
163,495,-39.01130957571896
164,189,-216.66806066100241
165,79,-116.84311381319543
166,1000,-128.50892153988238
167,1000,-80.81152316816672
168,926,-312.64655031609976
169,1000,-96.47621863773844
170,1000,-84.66820153713846
171,1000,-40.49469373333564
172,220,-293.42789011373054
173,1000,-115.07319459338306
174,1000,-101.16560918712233
175,1000,-53.44567910343801
176,1000,-16.787461752227202
177,1000,-41.988109498710635
178,1000,-54.24245325038495
179,1000,-48.335818380554244
180,1000,-56.81343422812833
181,847,217.48567062416964
182,1000,-23.208768468157277
183,1000,-35.47708792852366
184,1000,-9.236069006337853
185,1000,-85.2997719494252
186,98,-174.17832807664934
187,1000,-70.24914660467591
188,83,8.350846907830913
189,71,-39.686165591320716
190,87,-191.579630657961
191,70,-134.98146073233582
192,64,-126.35477304099481
193,454,-152.12609783707958
194,1000,-127.42491959256537
195,1000,-97.22516649712989
196,1000,-91.7259183309564
197,1000,-78.53507810808671
198,1000,-44.98616226353246
199,1000,-62.54861621086296
200,807,134.61837858436866
201,858,-550.3782900540397
202,436,-343.582486851206
203,1000,6.730469218036509
204,644,180.33211797897707
205,1000,-11.828807291611042
206,1000,-61.97789589847026
207,530,134.51974707512505
208,360,-21.432530081890604
209,1000,-95.81274927897007
210,511,-213.9474619340021
211,516,-32.60474411165046
212,456,-166.69995243803692
213,1000,2.0886693879636358
214,1000,-64.67924234192469
215,1000,-9.318640722458479
216,1000,-71.28343985245039
217,652,196.88879702672406
218,744,214.51117458828753
219,245,-221.7262542393654
220,1000,-74.18827604730022
221,1000,-105.31076182232162
222,1000,-9.365367535489883
223,348,264.530961806218
224,543,109.87621838375158
225,893,159.73664655282522
226,369,-66.57517901030496
227,1000,-33.9494368284065
228,1000,-129.49618928490136
229,1000,-50.91944190571207
230,850,195.01991131183263
231,1000,-83.3215548012022
232,637,-258.27435254769
233,1000,-59.69584848703434
234,1000,-87.50786876933567
235,1000,-114.26138123332262
236,518,189.10068362693045
237,1000,2.934137018735778
238,1000,43.29467590978108
239,394,243.34152023588672
240,914,109.40778205476404
241,1000,24.93631030738092
242,551,187.04978118047737
243,1000,-28.727258257334935
244,1000,-27.05438872847801
245,1000,-20.62103612774144
246,1000,-69.1865910940486
247,1000,-12.11536746403667
248,1000,-45.26992148550781
249,141,-96.53996349877077
250,515,212.09779734900036
251,180,-76.65909567881455
252,1000,-20.997785715824136
253,1000,-42.00512845133561
254,1000,-134.6477974743677
255,381,250.9503475106651
256,621,218.5759789756745
257,345,196.03887083443075
258,171,-94.5563196350123
259,776,166.2288807087341
260,1000,41.76287373129919
261,337,273.40794900773403
262,481,180.27347236588685
263,547,187.23100050642228
264,1000,40.54979106606258
265,520,237.41677002929356
266,528,233.04406825613165
267,386,10.421897108700904
268,565,161.9894275240327
269,296,218.22607947040552
270,343,213.1893724621272
271,1000,35.356810895652146
272,1000,-1.3995246216495147
273,1000,-56.70149168948801
274,1000,-65.61793642574457
275,341,-258.56010587548184
276,693,178.6443778008898
277,1000,-118.56906930392597
278,146,-117.87975923764097
279,725,-364.5611780349575
280,299,234.9100053499884
281,344,227.14269775132703
282,473,164.52219188233272
283,1000,84.44884174470685
284,844,182.07816018449543
285,356,196.78329767512986
286,486,-294.4497336357964
287,410,228.73528926638215
288,1000,-30.59250152860899
289,1000,-49.46042230622908
290,473,230.88599097135028
291,416,224.57399390987763
292,387,-137.42668681002482
293,607,139.1740200064996
294,1000,3.6911161406788437
295,973,85.8430033969757
296,1000,-21.972719578421767
297,670,227.18131290447974
298,1000,-132.20927662362155
299,446,217.3810441406249
300,350,170.15994806868565
301,351,223.26371471900768
302,601,194.82798382012686
303,551,196.95453322245734
304,946,164.34358495604977
305,701,143.13700515301466
306,454,257.5201612407674
307,375,213.37925371312667
308,924,232.6549728354766
309,1000,-38.568510447765604
310,431,256.29654627417534
311,280,235.58208057920356
312,641,168.852835070651
313,654,183.95711664889348
314,351,256.87406888614
315,1000,-68.77501293892298
316,407,203.9088359829353
317,649,193.12561657210728
318,405,246.7420795593863
319,301,-44.05527287566933
320,257,252.51495151873155
321,362,238.759726951183
322,346,173.75046543904497
323,679,142.3191285398372
324,122,7.002099950917739
325,757,-2.2245040799248414
326,360,-255.67731718562715
327,282,-208.55676334351148
328,662,198.53117708009182
329,612,244.0123442283554
330,317,181.7461643570984
331,391,248.22918604907193
332,407,252.46648306316635
333,571,120.90831770118743
334,807,36.17545875981621
335,365,174.40556353437938
336,269,-56.951085584393596
337,495,267.09592547185355
338,427,244.07839208767825
339,446,218.0167613440988
340,367,278.8301224713107
341,346,242.64100951276882
342,1000,25.68071311538768
343,402,244.7951973828362
344,759,152.25772728680454
345,433,245.19535878243454
346,360,226.49181188426178
347,258,16.44745934082991
348,346,186.10285717137268
349,515,222.2277666213432
350,835,219.53539145441937
