episodes,steps,rewards
0,200,-200.0
1,200,-200.0
2,200,-200.0
3,200,-200.0
4,200,-200.0
5,200,-200.0
6,200,-200.0
7,200,-200.0
8,200,-200.0
9,200,-200.0
10,200,-200.0
11,200,-200.0
12,200,-200.0
13,200,-200.0
14,200,-200.0
15,200,-200.0
16,200,-200.0
17,200,-200.0
18,200,-200.0
19,200,-200.0
20,200,-200.0
21,200,-200.0
22,200,-200.0
23,200,-200.0
24,200,-200.0
25,200,-200.0
26,200,-200.0
27,200,-200.0
28,200,-200.0
29,200,-200.0
30,200,-200.0
31,200,-200.0
32,200,-200.0
33,200,-200.0
34,200,-200.0
35,200,-200.0
36,200,-200.0
37,200,-200.0
38,200,-200.0
39,200,-200.0
40,200,-200.0
41,200,-200.0
42,200,-200.0
43,200,-200.0
44,200,-200.0
45,200,-200.0
46,200,-200.0
47,200,-200.0
48,200,-200.0
49,200,-200.0
50,200,-200.0
51,200,-200.0
52,200,-200.0
53,200,-200.0
54,200,-200.0
55,200,-200.0
56,200,-200.0
57,200,-200.0
58,200,-200.0
59,200,-200.0
60,200,-200.0
61,180,-180.0
62,200,-200.0
63,200,-200.0
64,200,-200.0
65,200,-200.0
66,200,-200.0
67,200,-200.0
68,200,-200.0
69,200,-200.0
70,200,-200.0
71,177,-177.0
72,200,-200.0
73,200,-200.0
74,200,-200.0
75,200,-200.0
76,200,-200.0
77,200,-200.0
78,200,-200.0
79,200,-200.0
80,200,-200.0
81,200,-200.0
82,200,-200.0
83,200,-200.0
84,200,-200.0
85,200,-200.0
86,200,-200.0
87,200,-200.0
88,200,-200.0
89,200,-200.0
90,200,-200.0
91,200,-200.0
92,200,-200.0
93,200,-200.0
94,200,-200.0
95,200,-200.0
96,200,-200.0
97,200,-200.0
98,188,-188.0
99,200,-200.0
100,200,-200.0
101,200,-200.0
102,199,-199.0
103,141,-141.0
104,200,-200.0
105,192,-192.0
106,187,-187.0
107,157,-157.0
108,200,-200.0
109,200,-200.0
110,118,-118.0
111,150,-150.0
112,121,-121.0
113,200,-200.0
114,200,-200.0
115,87,-87.0
116,127,-127.0
117,179,-179.0
118,185,-185.0
119,154,-154.0
120,200,-200.0
121,200,-200.0
122,131,-131.0
123,200,-200.0
124,161,-161.0
125,200,-200.0
126,200,-200.0
127,200,-200.0
128,200,-200.0
129,200,-200.0
130,168,-168.0
131,176,-176.0
132,200,-200.0
133,172,-172.0
134,128,-128.0
135,155,-155.0
136,157,-157.0
137,170,-170.0
138,145,-145.0
139,200,-200.0
140,168,-168.0
141,200,-200.0
142,196,-196.0
143,160,-160.0
144,138,-138.0
145,175,-175.0
146,86,-86.0
147,145,-145.0
148,149,-149.0
149,162,-162.0
150,187,-187.0
151,200,-200.0
152,200,-200.0
153,195,-195.0
154,172,-172.0
155,170,-170.0
156,173,-173.0
157,146,-146.0
158,114,-114.0
159,139,-139.0
160,147,-147.0
161,141,-141.0
162,161,-161.0
163,150,-150.0
164,148,-148.0
165,180,-180.0
166,137,-137.0
167,113,-113.0
168,185,-185.0
169,200,-200.0
170,137,-137.0
171,142,-142.0
172,154,-154.0
173,175,-175.0
174,92,-92.0
175,147,-147.0
176,110,-110.0
177,137,-137.0
178,116,-116.0
179,152,-152.0
180,148,-148.0
181,144,-144.0
182,144,-144.0
183,148,-148.0
184,147,-147.0
185,177,-177.0
186,151,-151.0
187,176,-176.0
188,143,-143.0
189,151,-151.0
190,163,-163.0
191,171,-171.0
192,145,-145.0
193,141,-141.0
194,140,-140.0
195,151,-151.0
196,90,-90.0
197,200,-200.0
198,140,-140.0
199,165,-165.0
200,192,-192.0
