{
    "model_info": "common8x16",
    "episodes": [
        13,
        29,
        18,
        14,
        13,
        8,
        9,
        8,
        10,
        11,
        9,
        8,
        10,
        9,
        11,
        9,
        9,
        10,
        9,
        9,
        8,
        8,
        9,
        9,
        10,
        9,
        10,
        8,
        9,
        9,
        9,
        10,
        9,
        9,
        10,
        10,
        8,
        9,
        10,
        9,
        10,
        9,
        8,
        10,
        10,
        9,
        8,
        9,
        9,
        9,
        9,
        10,
        8,
        10,
        10,
        10,
        10,
        9,
        9,
        10,
        8,
        9,
        9,
        10,
        9,
        8,
        8,
        9,
        12,
        10,
        10,
        9,
        11,
        9,
        9,
        9,
        9,
        10,
        8,
        9,
        10,
        10,
        10,
        10,
        11,
        9,
        10,
        9,
        9,
        9,
        10,
        9,
        9,
        10,
        9,
        9,
        10,
        10,
        10,
        10,
        9,
        9,
        10,
        11,
        10,
        10,
        10,
        10,
        10,
        10,
        10,
        10,
        8,
        10,
        9,
        9,
        10,
        10,
        10,
        12,
        9,
        10,
        10,
        9,
        10,
        9,
        10,
        9,
        9,
        9,
        9,
        9,
        10,
        9,
        9,
        9,
        9,
        10,
        9,
        8,
        9,
        9,
        10,
        9,
        9,
        11,
        10,
        8,
        9,
        9,
        10,
        9,
        10,
        8,
        9,
        10,
        11,
        10,
        10,
        10,
        9,
        9,
        11,
        9,
        11,
        10,
        10,
        9,
        9,
        9,
        10,
        10,
        8,
        10,
        12,
        10,
        10,
        10,
        10,
        10,
        11,
        8,
        9,
        10,
        9,
        9,
        9,
        10,
        12,
        9,
        9,
        9,
        10,
        9,
        10,
        12,
        9,
        10,
        10,
        10,
        10,
        10,
        10,
        10,
        10,
        10,
        9,
        8,
        10,
        12,
        10,
        9,
        10,
        9,
        10,
        10,
        10,
        8,
        9,
        10,
        11,
        9,
        10,
        9,
        11,
        9,
        10,
        9,
        11,
        10,
        10,
        11,
        10,
        10,
        13,
        14,
        9,
        12,
        11,
        11,
        19,
        18,
        21,
        31,
        34,
        43,
        59,
        20,
        10,
        11,
        42,
        25,
        20,
        19,
        19,
        27,
        28,
        25,
        15,
        10,
        18,
        20,
        16,
        22,
        31,
        26,
        22,
        12,
        22,
        57,
        72,
        48,
        40,
        29,
        36,
        34,
        39,
        39,
        36,
        30,
        51,
        53,
        117,
        72,
        112,
        89,
        54,
        79,
        39,
        66,
        45,
        38,
        28,
        38,
        37,
        16,
        11,
        23,
        23,
        13,
        12,
        9,
        15,
        10,
        14,
        15,
        13,
        10,
        12,
        14,
        14,
        16,
        13,
        12,
        11,
        11,
        10,
        13,
        10,
        10,
        13,
        22,
        14,
        11,
        11,
        8,
        11,
        8,
        11,
        10,
        8,
        12,
        9,
        11,
        10,
        12,
        10,
        11,
        12,
        11,
        9,
        9,
        9,
        9,
        16,
        11,
        10,
        11,
        9,
        12,
        13,
        10,
        10,
        17,
        11,
        12,
        12,
        11,
        10,
        10,
        11,
        11,
        12,
        10,
        10,
        10,
        10,
        10,
        10,
        8,
        10,
        10,
        10,
        8,
        10,
        10,
        16,
        14,
        9,
        9,
        13,
        9,
        9,
        13,
        9,
        11,
        11,
        16,
        10,
        11,
        10,
        9,
        10,
        10,
        10,
        9,
        10,
        11,
        11,
        9,
        10,
        9,
        9,
        10,
        9,
        12,
        10,
        11,
        9,
        8,
        10,
        13,
        10,
        10,
        11,
        10,
        9,
        10,
        10,
        9,
        9,
        9,
        11,
        10,
        10,
        12,
        11,
        10,
        10,
        10,
        9,
        10,
        10,
        10,
        10,
        9,
        11,
        10,
        9,
        9,
        10,
        10,
        10,
        12,
        9,
        12,
        8,
        9,
        11,
        11,
        9,
        13,
        8,
        10,
        9,
        10,
        9,
        10,
        9,
        9,
        12,
        9,
        10,
        9,
        10,
        11,
        10,
        13,
        10,
        10,
        11,
        10,
        10,
        13,
        14,
        13,
        9,
        11,
        9,
        8,
        9,
        12,
        12,
        9,
        12,
        16,
        10,
        16,
        14,
        11,
        11,
        15,
        13,
        15,
        11,
        14,
        10,
        11,
        18,
        14,
        12,
        13,
        9,
        9,
        11,
        13,
        19,
        10,
        12,
        14,
        14,
        11,
        14,
        11,
        22,
        23,
        17,
        30,
        19,
        65,
        48,
        38,
        24,
        37,
        39,
        48,
        15,
        18,
        29,
        46,
        15,
        32,
        11,
        28,
        27,
        39,
        29,
        73,
        23,
        14,
        25,
        13,
        14,
        18,
        39,
        36,
        49,
        27,
        10,
        32,
        16,
        13,
        25,
        17,
        14,
        18,
        16,
        19,
        25,
        11,
        13,
        11,
        13,
        27,
        21,
        38,
        21,
        23,
        15,
        12,
        24,
        27,
        13,
        15,
        21,
        29,
        31,
        20,
        49,
        40,
        23,
        109,
        47,
        30,
        21,
        28,
        50,
        31,
        53,
        49,
        47,
        33,
        19,
        23,
        128,
        15,
        23,
        12,
        27,
        16,
        21,
        21,
        16,
        16,
        16,
        17,
        23,
        20,
        55,
        18,
        36,
        28,
        19,
        30,
        33,
        26,
        65,
        72,
        147,
        112,
        35,
        157,
        73,
        62,
        71,
        32,
        168,
        37,
        93,
        58,
        69,
        76,
        136,
        103,
        165,
        174,
        120,
        166,
        67,
        116,
        13,
        143,
        141,
        120,
        166,
        48,
        179,
        211,
        155,
        136,
        13,
        31,
        113,
        126,
        91,
        105,
        103,
        150,
        36,
        391,
        241,
        171,
        462,
        381,
        458,
        424,
        500,
        500,
        307,
        311,
        421,
        393,
        333,
        411,
        234,
        329,
        247,
        281,
        221,
        302,
        388,
        58,
        316,
        427,
        451,
        500,
        500,
        500,
        500,
        500,
        500,
        500,
        500,
        477,
        500,
        500,
        500,
        500,
        500,
        500,
        500,
        500,
        500,
        500,
        500,
        500,
        332,
        292,
        328,
        216,
        197,
        205,
        154,
        115,
        147,
        31,
        145,
        111,
        108,
        109,
        119,
        102,
        30,
        102,
        93,
        105,
        108,
        25,
        111,
        25,
        119,
        95,
        23,
        114,
        128,
        115,
        124,
        116,
        114,
        107,
        110,
        103,
        107,
        112,
        112,
        101,
        97,
        99,
        99,
        105,
        117,
        108,
        102,
        110,
        108,
        107,
        119,
        126,
        118,
        115,
        121,
        121,
        119,
        136,
        118,
        129,
        124,
        132,
        132,
        151,
        153,
        147,
        148,
        148,
        165,
        155,
        164,
        160,
        177,
        161,
        162,
        156,
        158,
        156,
        150,
        170,
        173,
        165,
        157,
        152,
        167,
        157,
        178,
        175,
        169,
        185,
        194,
        192,
        178,
        167,
        178,
        176,
        179,
        188,
        187,
        202,
        190,
        188,
        188,
        210,
        194,
        224,
        220,
        210,
        231,
        227,
        244,
        299,
        257,
        293,
        351,
        281,
        253,
        254,
        294,
        239,
        234,
        232,
        209,
        205,
        210,
        205,
        202,
        193,
        227,
        203,
        209,
        215,
        213,
        207,
        250,
        208,
        219,
        206,
        223,
        219,
        230,
        257,
        202,
        204,
        204,
        203,
        199,
        237,
        205,
        196,
        207,
        205,
        205,
        214,
        198,
        197,
        230,
        191,
        185,
        197,
        199,
        203,
        181,
        194,
        181,
        188,
        176,
        180,
        184,
        193,
        187,
        181,
        177,
        190,
        188,
        169,
        174,
        182,
        170,
        169,
        173,
        172,
        169,
        169,
        173,
        173,
        184,
        187,
        186,
        177,
        191,
        176,
        178,
        171,
        166,
        168,
        162,
        155,
        167,
        170,
        164,
        162,
        160,
        154,
        156,
        153,
        147,
        179,
        177,
        157,
        177,
        179,
        185,
        194,
        183,
        194,
        218,
        225,
        215,
        202,
        217,
        229,
        196,
        216,
        211,
        225,
        215,
        210,
        203,
        210,
        195,
        197,
        189,
        187,
        186,
        178,
        184,
        190,
        188,
        180,
        196,
        186,
        196,
        184,
        187,
        178,
        187,
        198,
        190,
        176,
        183,
        183,
        165,
        159,
        168,
        185,
        174,
        163,
        151,
        162,
        161,
        168,
        167,
        159,
        162,
        164,
        158,
        164,
        161,
        164,
        167,
        150,
        158,
        161,
        171,
        154,
        162,
        157,
        143,
        165,
        159,
        150,
        13,
        156,
        143,
        145,
        145,
        12,
        149,
        152,
        147,
        12,
        141,
        144,
        148,
        151,
        137,
        146,
        128,
        143,
        152,
        142,
        151,
        148,
        140,
        145,
        163,
        139,
        133,
        133,
        144,
        141,
        134,
        147,
        134,
        133,
        139,
        142,
        134,
        137,
        142,
        129,
        127,
        137,
        138,
        142,
        145,
        130,
        138,
        131,
        137,
        150,
        134,
        136,
        137,
        126,
        134,
        138,
        136,
        122,
        133,
        130,
        18,
        135,
        135,
        19,
        132,
        136,
        141,
        134,
        139,
        131,
        160,
        136,
        125,
        131,
        120,
        119,
        128,
        125,
        131,
        133,
        122,
        134,
        131,
        136,
        133,
        124,
        132,
        147,
        136,
        116,
        118,
        123,
        114,
        116,
        122,
        117,
        114,
        117,
        122,
        112,
        114,
        104,
        116,
        107,
        115,
        108,
        115,
        113,
        114,
        118,
        109,
        106,
        109,
        112,
        121,
        100,
        108,
        109,
        119,
        121,
        113,
        145,
        124,
        108,
        126,
        121,
        121,
        109,
        111,
        119,
        113,
        114,
        131,
        118,
        121,
        114,
        113,
        119,
        109,
        110,
        110,
        122,
        113,
        126,
        111,
        105,
        119,
        111,
        104,
        119,
        97,
        123,
        110,
        109,
        104,
        105,
        105,
        101,
        116,
        103,
        113,
        97,
        98,
        116,
        115,
        121,
        98,
        111,
        120,
        108,
        104,
        99,
        120,
        110,
        110,
        125,
        106,
        115,
        117,
        127,
        126,
        121,
        138,
        127,
        114,
        112,
        110,
        132,
        123,
        140,
        116,
        134,
        125,
        145,
        146,
        134,
        151,
        138,
        136,
        137,
        135,
        139,
        140,
        130,
        134,
        149,
        151,
        146,
        138,
        146,
        165,
        130,
        154,
        161,
        161,
        136,
        155,
        164,
        152,
        181,
        203,
        192,
        218,
        151,
        190,
        156,
        163,
        169,
        192,
        187,
        186,
        183,
        215,
        202,
        175,
        194,
        180,
        213,
        215,
        219,
        224,
        187,
        212,
        227,
        225,
        200,
        226,
        246,
        226,
        262,
        248,
        258,
        200,
        236,
        232,
        250,
        321,
        268,
        500,
        391,
        247,
        291,
        378,
        333,
        288,
        313,
        396,
        497,
        335,
        500,
        376,
        297,
        408,
        337,
        391,
        307,
        280,
        391,
        321,
        379,
        287,
        428,
        500,
        332,
        486,
        263,
        257,
        229,
        338,
        247,
        263,
        416,
        265,
        372,
        305,
        251,
        241,
        255,
        314,
        315,
        308,
        226,
        271,
        255,
        270,
        265,
        335,
        349,
        367,
        358,
        373,
        307,
        465,
        393,
        332,
        458,
        289,
        273,
        500,
        500,
        280,
        500,
        313,
        500,
        500,
        378,
        310,
        302,
        285,
        284,
        252,
        302,
        260,
        228,
        238,
        235,
        226,
        258,
        214,
        248,
        235,
        215,
        228,
        245,
        221,
        225,
        211,
        216,
        202,
        206,
        212,
        191,
        204,
        182,
        184,
        185,
        198,
        165,
        176,
        173,
        166,
        157,
        178,
        166,
        181,
        167,
        172,
        157,
        163,
        160,
        160,
        154,
        156,
        150,
        140,
        142,
        137,
        128,
        142,
        137,
        132,
        141,
        124,
        119,
        100,
        121,
        113,
        121,
        109,
        125,
        122,
        115,
        107,
        104,
        109,
        105,
        115,
        106,
        111,
        94,
        99,
        115,
        98,
        96,
        96,
        109,
        97,
        101,
        94,
        96,
        15,
        100,
        96,
        96,
        91,
        104,
        101,
        113,
        95,
        98,
        94,
        97,
        107,
        100,
        103,
        104,
        113,
        104,
        85,
        97,
        96,
        99,
        92,
        103,
        83,
        89,
        89,
        80,
        86,
        16,
        100,
        83,
        92,
        98,
        83,
        97,
        80,
        94,
        94,
        93,
        88,
        96,
        92,
        85,
        103,
        90,
        85,
        93,
        87,
        92,
        82,
        81,
        79,
        83,
        99,
        83,
        82,
        89,
        91,
        86,
        89,
        88,
        80,
        100,
        82,
        94,
        89,
        104,
        92,
        90,
        105,
        109,
        96,
        100,
        103,
        101,
        100,
        104,
        97,
        98,
        97,
        105,
        105,
        107,
        100,
        96,
        97,
        107,
        104,
        99,
        97,
        95,
        111,
        100,
        99,
        105,
        115,
        98,
        96,
        96,
        111,
        103,
        117,
        105,
        111,
        96,
        104,
        116,
        99,
        124,
        113,
        103,
        102,
        101,
        109,
        96,
        111,
        90,
        110,
        101,
        102,
        105,
        111,
        97,
        107,
        99,
        92,
        106,
        100,
        103,
        103,
        115,
        118,
        117,
        129,
        127,
        123,
        117,
        115,
        117,
        118,
        125,
        120,
        124,
        132,
        115,
        122,
        135,
        125,
        120,
        141,
        123,
        122,
        129,
        131,
        131,
        135,
        144,
        155,
        150,
        132,
        136,
        133,
        142,
        151,
        161,
        129,
        131,
        143,
        138,
        140,
        121,
        142,
        165,
        139,
        151,
        169,
        156,
        152,
        131,
        155,
        148,
        149,
        157,
        145,
        122,
        139,
        159,
        153,
        168,
        144,
        132,
        152,
        129,
        142,
        142,
        155,
        145,
        150,
        155,
        145,
        155,
        135,
        140,
        146,
        140,
        148,
        150,
        130,
        140,
        144,
        132,
        144,
        157,
        158,
        144,
        156,
        168,
        160,
        124,
        141,
        142,
        138,
        141,
        155,
        148,
        154,
        150,
        153,
        140,
        142,
        127,
        150,
        162,
        172,
        160,
        165,
        170,
        160,
        160,
        152,
        174,
        142,
        204,
        151,
        176,
        185,
        180,
        173,
        167,
        161,
        168,
        153,
        181,
        170,
        154,
        173,
        172,
        153,
        144,
        151,
        185,
        180,
        144,
        180,
        193,
        170,
        176,
        174,
        169,
        209,
        187,
        180,
        178,
        165,
        171,
        152,
        166,
        176,
        170,
        174,
        153,
        184,
        164,
        204,
        183,
        184,
        218,
        207,
        190,
        204,
        187,
        178,
        194,
        225,
        185,
        214,
        177,
        203,
        205,
        179,
        210,
        227,
        192,
        218,
        171,
        215,
        200,
        190,
        230,
        189,
        226,
        182,
        202,
        219,
        215,
        213,
        213,
        198,
        174,
        184,
        172,
        193,
        180,
        187,
        171,
        182,
        173,
        176,
        168,
        174,
        193,
        164,
        174,
        171,
        161,
        169,
        196,
        164,
        167,
        179,
        170,
        188,
        176,
        158,
        165,
        178,
        170,
        176,
        183,
        179,
        188,
        163,
        193,
        170,
        180,
        188,
        175,
        185,
        172,
        169,
        198,
        178,
        169,
        168,
        160,
        171,
        162,
        149,
        172,
        165,
        175,
        147,
        158,
        167,
        152,
        148,
        156,
        178,
        156,
        155,
        172,
        183,
        151,
        144,
        163,
        155,
        155,
        161,
        160,
        152,
        151,
        144,
        160,
        169,
        159,
        143,
        139,
        134,
        136,
        145,
        150,
        148,
        155,
        147,
        133,
        151,
        163,
        166,
        158,
        140,
        150,
        149,
        144,
        138,
        158,
        161,
        152,
        157,
        161,
        148,
        161,
        158,
        156,
        163,
        171,
        167,
        187,
        185,
        201,
        189,
        188,
        177,
        198,
        195,
        233,
        217,
        231,
        223,
        222,
        253,
        202,
        212,
        217,
        214,
        219,
        200,
        196,
        216,
        195,
        188,
        190,
        188,
        215,
        222,
        213,
        223,
        203,
        205,
        215,
        200,
        194,
        199,
        178,
        210,
        185,
        167,
        181,
        198,
        187,
        213,
        201,
        221,
        215,
        219,
        236,
        220,
        261,
        269,
        247,
        265,
        257,
        253,
        268,
        276,
        249,
        260,
        246,
        271,
        290,
        260,
        247,
        253,
        233,
        205,
        244,
        265,
        210,
        227,
        240,
        256,
        217,
        234,
        234,
        231,
        240,
        225,
        209,
        207,
        235,
        216,
        221,
        223,
        222,
        211,
        221,
        195,
        218,
        246,
        231,
        209,
        197,
        208,
        169,
        174,
        179,
        178,
        182,
        182,
        183,
        178,
        165,
        177,
        192,
        187,
        194,
        153,
        175,
        161,
        164,
        175,
        163,
        176,
        165,
        174,
        167,
        170,
        166,
        165,
        169,
        156,
        166,
        172,
        152,
        153,
        162,
        168,
        154,
        160,
        155,
        151,
        162,
        152,
        164,
        163,
        173,
        173,
        171,
        162,
        162,
        165,
        164,
        173,
        176,
        185,
        175,
        151,
        166,
        169,
        171,
        173,
        169,
        167,
        187,
        154,
        173,
        176,
        181,
        165,
        163,
        163,
        168,
        161,
        184,
        181,
        174,
        175,
        172,
        164,
        177,
        189,
        187,
        166,
        178,
        167,
        192,
        170,
        171,
        187,
        183,
        175,
        187,
        177,
        171,
        169,
        183,
        169,
        187,
        163,
        162,
        170,
        166,
        147,
        156,
        174,
        154,
        164,
        157,
        170,
        135,
        164,
        161,
        159,
        143,
        138,
        162,
        137,
        147,
        148,
        152,
        161,
        147,
        144,
        163,
        146,
        147,
        164,
        136,
        138,
        157,
        143,
        138,
        135,
        137,
        139,
        135,
        136,
        143,
        140,
        141,
        142,
        154,
        142,
        151,
        142,
        153,
        150,
        155,
        155,
        145,
        137,
        164,
        158,
        152,
        173,
        151,
        156,
        150,
        162,
        165,
        149,
        152,
        154,
        141,
        174,
        152,
        174,
        162,
        169,
        156,
        178,
        167,
        179,
        181,
        175,
        168,
        181,
        208,
        214,
        217,
        189,
        198,
        189,
        207,
        208,
        208,
        204,
        229,
        203,
        208,
        230,
        207,
        245,
        223,
        214,
        232,
        241,
        225,
        251,
        259,
        273,
        252,
        246,
        272,
        291,
        298,
        302,
        307,
        312,
        277,
        375,
        361,
        301,
        392,
        355,
        437,
        415,
        500,
        497,
        500,
        500,
        500,
        500,
        500,
        500,
        500,
        500,
        500,
        500,
        493,
        481,
        500,
        397,
        428,
        385,
        338,
        363,
        352,
        297,
        323,
        328,
        348,
        334,
        335,
        345,
        398,
        345,
        339,
        355,
        421,
        424,
        435,
        500,
        500,
        500,
        500,
        500,
        500,
        500,
        500,
        500,
        500,
        500,
        500,
        500,
        500,
        500,
        500,
        500,
        500,
        500,
        500,
        500,
        500,
        500,
        500,
        500,
        500,
        500,
        500,
        500,
        84,
        500,
        500,
        500,
        500,
        500,
        500,
        500,
        500,
        500,
        500,
        500,
        500,
        500,
        500,
        500,
        500,
        500,
        500,
        500,
        168,
        500,
        500,
        500,
        414,
        189,
        190,
        231,
        281,
        194,
        190,
        203,
        168,
        178,
        191,
        166,
        170,
        177,
        162,
        197,
        198,
        176,
        179,
        222,
        222,
        274,
        276,
        244,
        257,
        263,
        273,
        247,
        263,
        237,
        267,
        271,
        229,
        220,
        236,
        200,
        229,
        199,
        216,
        222,
        205,
        203,
        212,
        224,
        227,
        242,
        243,
        193,
        212,
        258,
        242,
        262,
        238,
        249,
        257,
        237,
        267,
        261,
        272,
        301,
        319,
        291,
        288,
        301,
        309,
        287,
        259,
        301,
        282,
        297,
        323,
        290,
        345,
        326,
        312,
        301,
        333,
        332,
        274,
        277,
        272,
        302,
        298,
        296,
        283,
        291,
        335,
        319,
        319,
        317,
        359,
        388,
        346,
        347,
        369,
        370,
        395,
        376,
        396,
        423,
        385,
        423,
        474,
        466,
        500,
        500,
        500,
        500,
        445,
        428,
        454,
        500,
        424,
        470,
        411,
        436,
        420,
        500,
        443,
        444,
        500,
        422,
        500,
        303,
        475,
        462,
        447,
        457,
        397,
        474,
        455,
        500,
        500,
        418,
        377,
        326,
        366,
        430,
        385,
        403,
        388,
        500,
        500,
        440,
        500,
        377,
        345,
        288,
        259,
        380,
        307,
        365,
        380,
        409,
        500,
        500,
        500,
        500,
        500,
        500,
        500,
        500,
        500,
        500,
        500,
        500,
        500,
        500,
        500,
        500,
        500,
        500,
        500,
        236,
        500,
        500,
        500,
        500,
        500,
        500,
        500,
        500,
        500,
        500,
        500,
        500,
        500,
        500,
        500,
        500,
        500,
        500,
        500,
        500,
        500,
        500,
        500,
        500,
        500,
        500,
        500,
        500,
        500,
        500,
        500,
        500,
        500,
        500,
        500,
        500,
        500,
        500,
        500,
        500,
        500,
        500,
        500,
        500,
        500,
        500,
        500,
        500,
        500,
        500,
        500,
        500,
        500,
        500,
        500,
        500,
        500,
        500,
        500,
        500,
        500
    ],
    "durations": [
        1.602022,
        0.009,
        0.005999,
        0.004003,
        0.003998,
        0.003,
        0.003,
        0.003,
        0.004,
        0.004001,
        0.002999,
        0.002,
        0.002999,
        0.002,
        0.004003,
        0.002998,
        0.003994,
        0.003999,
        0.003001,
        0.002998,
        0.001999,
        0.003001,
        0.003,
        0.002999,
        0.003,
        0.003,
        0.003,
        0.001999,
        0.001999,
        0.002,
        0.003001,
        0.003001,
        0.002,
        0.001999,
        0.004002,
        0.002999,
        0.003,
        0.003,
        0.003,
        0.003,
        0.003002,
        0.001999,
        0.002,
        0.003002,
        0.003999,
        0.003,
        0.002,
        0.001999,
        0.002,
        0.002001,
        0.003,
        0.003,
        0.003,
        0.003002,
        0.002998,
        0.003,
        0.003,
        0.003001,
        0.003002,
        0.002999,
        0.002,
        0.003,
        0.003003,
        0.003001,
        0.003,
        0.001999,
        0.002001,
        0.003,
        0.003002,
        0.003001,
        0.003,
        0.003,
        0.004,
        0.003,
        0.003002,
        0.002997,
        0.003001,
        0.003,
        0.003,
        0.003001,
        0.002999,
        0.003001,
        0.003002,
        0.002998,
        0.003,
        0.001999,
        0.003002,
        0.002998,
        0.002999,
        0.003001,
        0.003003,
        0.002999,
        0.002999,
        0.003,
        0.003,
        0.003,
        0.003003,
        0.003,
        0.002999,
        0.004003,
        0.002996,
        0.003,
        0.003005,
        0.002995,
        0.002996,
        0.003,
        0.003,
        0.003001,
        0.002997,
        0.002998,
        0.003001,
        0.002999,
        0.003001,
        0.002999,
        0.003004,
        0.002997,
        0.004,
        0.002999,
        0.003005,
        0.003996,
        0.003,
        0.025003,
        0.005997,
        0.005002,
        0.005,
        0.008998,
        0.008001,
        0.023999,
        0.004999,
        0.003999,
        0.004002,
        0.006,
        0.002998,
        0.003002,
        0.005005,
        0.004997,
        0.003001,
        0.003,
        0.003002,
        0.002997,
        0.003,
        0.003,
        0.003002,
        0.004,
        0.003001,
        0.004,
        0.002997,
        0.001995,
        0.001999,
        0.001997,
        0.002999,
        0.002999,
        0.002999,
        0.003,
        0.003,
        0.003003,
        0.003998,
        0.002999,
        0.003003,
        0.002998,
        0.001999,
        0.002996,
        0.004005,
        0.002996,
        0.002999,
        0.002998,
        0.003001,
        0.003001,
        0.001998,
        0.002001,
        0.002998,
        0.003,
        0.003,
        0.003,
        0.004005,
        0.002998,
        0.002998,
        0.003004,
        0.002996,
        0.003005,
        0.003995,
        0.002004,
        0.002999,
        0.003006,
        0.002992,
        0.003002,
        0.003,
        0.003001,
        0.003998,
        0.003,
        0.002998,
        0.003,
        0.004002,
        0.002999,
        0.002999,
        0.004003,
        0.002998,
        0.003003,
        0.002996,
        0.002999,
        0.004004,
        0.004998,
        0.004001,
        0.003999,
        0.002999,
        0.003,
        0.003001,
        0.003999,
        0.004002,
        0.005,
        0.003999,
        0.003,
        0.002999,
        0.003004,
        0.004,
        0.003998,
        0.003995,
        0.002999,
        0.004004,
        0.004999,
        0.005,
        0.005999,
        0.004,
        0.003999,
        0.005001,
        0.006002,
        0.005,
        0.003998,
        0.006,
        0.005001,
        0.006001,
        0.003998,
        0.004001,
        0.004001,
        0.004998,
        0.006004,
        0.003998,
        0.004999,
        0.005001,
        0.005999,
        0.009002,
        0.009998,
        0.010999,
        0.012,
        0.014007,
        0.017992,
        0.019998,
        0.006999,
        0.004999,
        0.004005,
        0.015001,
        0.009999,
        0.005999,
        0.007,
        0.006001,
        0.009001,
        0.008001,
        0.009001,
        0.004999,
        0.003002,
        0.004998,
        0.006,
        0.005001,
        0.006,
        0.008998,
        0.008,
        0.007999,
        0.002999,
        0.007,
        0.016001,
        0.019999,
        0.013,
        0.011002,
        0.007998,
        0.011,
        0.010001,
        0.049001,
        0.022001,
        0.017004,
        0.051996,
        0.021999,
        0.021,
        0.039001,
        0.023,
        0.030001,
        0.025002,
        0.015,
        0.022002,
        0.013,
        0.019003,
        0.013996,
        0.012999,
        0.008002,
        0.011999,
        0.01,
        0.005003,
        0.003,
        0.007,
        0.006001,
        0.003001,
        0.003998,
        0.003002,
        0.005,
        0.003998,
        0.004001,
        0.004999,
        0.004,
        0.003002,
        0.003999,
        0.004002,
        0.003998,
        0.004001,
        0.003999,
        0.004,
        0.004,
        0.004,
        0.004,
        0.005999,
        0.004004,
        0.004009,
        0.004987,
        0.007999,
        0.004984,
        0.004001,
        0.004999,
        0.003,
        0.005001,
        0.002999,
        0.003,
        0.002999,
        0.003001,
        0.004001,
        0.002999,
        0.003999,
        0.004001,
        0.004,
        0.003,
        0.003,
        0.004001,
        0.004004,
        0.003,
        0.004001,
        0.003,
        0.003999,
        0.004999,
        0.004001,
        0.003,
        0.005,
        0.003,
        0.004001,
        0.005998,
        0.005001,
        0.002999,
        0.005,
        0.004001,
        0.003999,
        0.003,
        0.004001,
        0.003999,
        0.003001,
        0.002999,
        0.004,
        0.004001,
        0.003999,
        0.003,
        0.003001,
        0.003999,
        0.003001,
        0.003,
        0.002,
        0.004002,
        0.005,
        0.005001,
        0.003998,
        0.003999,
        0.005001,
        0.006998,
        0.005002,
        0.003998,
        0.004,
        0.007001,
        0.004999,
        0.004,
        0.006,
        0.002998,
        0.004,
        0.003,
        0.004,
        0.003001,
        0.004,
        0.004001,
        0.002999,
        0.004002,
        0.003999,
        0.004,
        0.002999,
        0.002999,
        0.003002,
        0.003999,
        0.004001,
        0.004001,
        0.003987,
        0.003,
        0.004001,
        0.003999,
        0.005,
        0.003001,
        0.002988,
        0.004001,
        0.004,
        0.003984,
        0.005001,
        0.004,
        0.002999,
        0.004001,
        0.002999,
        0.002,
        0.003,
        0.003001,
        0.004,
        0.003001,
        0.003,
        0.003,
        0.004001,
        0.004,
        0.005,
        0.004008,
        0.004002,
        0.004999,
        0.004002,
        0.004,
        0.004004,
        0.007998,
        0.007001,
        0.005998,
        0.003,
        0.004001,
        0.003001,
        0.003002,
        0.003999,
        0.004001,
        0.003999,
        0.004,
        0.004,
        0.002998,
        0.004,
        0.002,
        0.002,
        0.005004,
        0.005002,
        0.004998,
        0.006004,
        0.002999,
        0.002998,
        0.003001,
        0.003998,
        0.004004,
        0.003996,
        0.003999,
        0.004,
        0.005,
        0.004,
        0.004999,
        0.004998,
        0.003999,
        0.005002,
        0.003999,
        0.004999,
        0.004002,
        0.003,
        0.005,
        0.003,
        0.002998,
        0.002999,
        0.005002,
        0.003998,
        0.003004,
        0.002996,
        0.003,
        0.003002,
        0.002998,
        0.004001,
        0.003,
        0.002,
        0.004,
        0.004998,
        0.003002,
        0.004999,
        0.004001,
        0.003,
        0.002999,
        0.004001,
        0.003,
        0.005001,
        0.003999,
        0.004,
        0.002999,
        0.004,
        0.006,
        0.004001,
        0.004,
        0.003,
        0.003,
        0.002,
        0.004,
        0.005003,
        0.005999,
        0.002999,
        0.003999,
        0.004,
        0.004,
        0.004002,
        0.003998,
        0.003,
        0.006,
        0.006001,
        0.004,
        0.008,
        0.006002,
        0.017998,
        0.046002,
        0.025001,
        0.010999,
        0.043,
        0.016,
        0.018999,
        0.006,
        0.007,
        0.011001,
        0.017,
        0.006,
        0.012,
        0.005001,
        0.010003,
        0.012994,
        0.015,
        0.011002,
        0.025999,
        0.010999,
        0.004998,
        0.008,
        0.005,
        0.006003,
        0.006997,
        0.014001,
        0.011999,
        0.020002,
        0.009998,
        0.003,
        0.010002,
        0.005002,
        0.004999,
        0.008001,
        0.006999,
        0.004,
        0.005999,
        0.006001,
        0.006,
        0.008,
        0.003999,
        0.004001,
        0.004001,
        0.003999,
        0.008,
        0.005999,
        0.009999,
        0.005999,
        0.006001,
        0.004999,
        0.003,
        0.005999,
        0.006999,
        0.004002,
        0.004999,
        0.006,
        0.008999,
        0.009,
        0.006002,
        0.013999,
        0.011999,
        0.006,
        0.029,
        0.014001,
        0.010999,
        0.009001,
        0.01,
        0.013998,
        0.009998,
        0.018014,
        0.021991,
        0.017001,
        0.012999,
        0.007001,
        0.006999,
        0.037999,
        0.005,
        0.007001,
        0.003999,
        0.007003,
        0.005002,
        0.007998,
        0.006999,
        0.004999,
        0.005001,
        0.005,
        0.005001,
        0.007,
        0.005999,
        0.019002,
        0.008007,
        0.014986,
        0.011004,
        0.007994,
        0.013003,
        0.017001,
        0.011001,
        0.021999,
        0.028,
        0.051002,
        0.037,
        0.009999,
        0.044,
        0.023002,
        0.029,
        0.052001,
        0.014999,
        0.092999,
        0.014001,
        0.026002,
        0.015998,
        0.02,
        0.019998,
        0.046003,
        0.033999,
        0.058,
        0.052998,
        0.032001,
        0.043,
        0.017997,
        0.03,
        0.004,
        0.036002,
        0.036,
        0.033999,
        0.043001,
        0.013,
        0.046,
        0.053999,
        0.040001,
        0.034999,
        0.003999,
        0.008001,
        0.027997,
        0.032,
        0.024003,
        0.027996,
        0.027001,
        0.038007,
        0.009992,
        0.105003,
        0.061999,
        0.045001,
        0.127002,
        0.102997,
        0.128,
        0.116999,
        0.140002,
        0.146999,
        0.083002,
        0.083,
        0.115999,
        0.104001,
        0.09,
        0.109999,
        0.068999,
        0.092001,
        0.071,
        0.075999,
        0.063,
        0.081001,
        0.108998,
        0.016,
        0.082002,
        0.115997,
        0.119,
        0.134,
        0.134001,
        0.137999,
        0.137001,
        0.134,
        0.142,
        0.145,
        0.139,
        0.131,
        0.141,
        0.138002,
        0.138,
        0.136003,
        0.141998,
        0.149002,
        0.147,
        0.139989,
        0.138001,
        0.134985,
        0.138999,
        0.143998,
        0.091002,
        0.077,
        0.097999,
        0.065001,
        0.061001,
        0.060999,
        0.045998,
        0.037,
        0.039,
        0.009,
        0.037002,
        0.028998,
        0.028,
        0.028005,
        0.033,
        0.026001,
        0.007999,
        0.026999,
        0.024001,
        0.027,
        0.027004,
        0.007,
        0.030999,
        0.007,
        0.030999,
        0.025,
        0.006999,
        0.029001,
        0.032999,
        0.030001,
        0.035999,
        0.033,
        0.030002,
        0.029013,
        0.027984,
        0.027002,
        0.030998,
        0.028999,
        0.030001,
        0.026003,
        0.025984,
        0.026001,
        0.029003,
        0.028998,
        0.030004,
        0.028,
        0.027002,
        0.027,
        0.029,
        0.027999,
        0.031001,
        0.033,
        0.031999,
        0.029,
        0.030999,
        0.034,
        0.030989,
        0.035,
        0.030999,
        0.034002,
        0.033001,
        0.037001,
        0.035999,
        0.038998,
        0.040999,
        0.038002,
        0.037998,
        0.038999,
        0.047002,
        0.041,
        0.044,
        0.040999,
        0.045002,
        0.040999,
        0.041983,
        0.041017,
        0.040983,
        0.040999,
        0.039983,
        0.044001,
        0.044003,
        0.042997,
        0.039998,
        0.039003,
        0.042997,
        0.039999,
        0.047004,
        0.048998,
        0.044002,
        0.050998,
        0.073005,
        0.052,
        0.048,
        0.043001,
        0.045999,
        0.047982,
        0.045998,
        0.05,
        0.049,
        0.053003,
        0.052999,
        0.052001,
        0.051996,
        0.057,
        0.051,
        0.058002,
        0.056976,
        0.055002,
        0.064002,
        0.059002,
        0.064001,
        0.080001,
        0.068002,
        0.076999,
        0.095003,
        0.072999,
        0.065002,
        0.065,
        0.076998,
        0.063002,
        0.061999,
        0.062001,
        0.053998,
        0.056002,
        0.054003,
        0.051999,
        0.051998,
        0.048999,
        0.057995,
        0.052,
        0.058003,
        0.056001,
        0.056002,
        0.065,
        0.069999,
        0.054001,
        0.056,
        0.052001,
        0.057999,
        0.057097,
        0.060906,
        0.065999,
        0.051999,
        0.053003,
        0.051996,
        0.051999,
        0.051001,
        0.063001,
        0.055003,
        0.054002,
        0.055002,
        0.053001,
        0.054002,
        0.054996,
        0.052002,
        0.052999,
        0.061001,
        0.052001,
        0.048002,
        0.053,
        0.051999,
        0.052,
        0.047003,
        0.050996,
        0.048998,
        0.049002,
        0.045,
        0.047002,
        0.059,
        0.053,
        0.04898,
        0.049001,
        0.052023,
        0.053,
        0.086,
        0.074999,
        0.055001,
        0.048999,
        0.045002,
        0.047995,
        0.048989,
        0.068998,
        0.046999,
        0.052,
        0.048,
        0.047,
        0.048,
        0.048,
        0.048002,
        0.047005,
        0.05198,
        0.047,
        0.046002,
        0.043997,
        0.041999,
        0.041998,
        0.045,
        0.039,
        0.041979,
        0.043983,
        0.042057,
        0.040999,
        0.04096,
        0.039997,
        0.042002,
        0.038999,
        0.038001,
        0.045999,
        0.046,
        0.040003,
        0.045,
        0.044808,
        0.045998,
        0.049999,
        0.051999,
        0.049996,
        0.056003,
        0.056999,
        0.054999,
        0.051036,
        0.058982,
        0.060015,
        0.050985,
        0.06,
        0.056166,
        0.059001,
        0.057998,
        0.057,
        0.054001,
        0.056,
        0.052004,
        0.051995,
        0.050005,
        0.047999,
        0.052013,
        0.049,
        0.047999,
        0.050001,
        0.052,
        0.047998,
        0.051855,
        0.049,
        0.051998,
        0.049,
        0.050002,
        0.047999,
        0.048881,
        0.052003,
        0.048001,
        0.048998,
        0.047996,
        0.049001,
        0.044995,
        0.041004,
        0.043999,
        0.049001,
        0.046059,
        0.043002,
        0.04218,
        0.044001,
        0.046995,
        0.047998,
        0.052004,
        0.051996,
        0.049008,
        0.048,
        0.044997,
        0.048002,
        0.044002,
        0.049999,
        0.051,
        0.041997,
        0.045999,
        0.047831,
        0.05,
        0.049999,
        0.047,
        0.043,
        0.037996,
        0.046,
        0.042983,
        0.041009,
        0.005995,
        0.040152,
        0.039001,
        0.041976,
        0.038003,
        0.003998,
        0.039004,
        0.042983,
        0.039997,
        0.003999,
        0.038001,
        0.039002,
        0.041019,
        0.041001,
        0.038,
        0.037999,
        0.043004,
        0.042,
        0.047998,
        0.042,
        0.043998,
        0.040998,
        0.037001,
        0.038002,
        0.045996,
        0.035001,
        0.034999,
        0.038001,
        0.036998,
        0.038984,
        0.034984,
        0.038,
        0.035002,
        0.033984,
        0.037001,
        0.038,
        0.035,
        0.038001,
        0.039005,
        0.032998,
        0.031998,
        0.036001,
        0.035002,
        0.042016,
        0.038984,
        0.036001,
        0.035997,
        0.037002,
        0.035998,
        0.040002,
        0.036001,
        0.034988,
        0.035996,
        0.031998,
        0.037001,
        0.038809,
        0.034998,
        0.031985,
        0.035002,
        0.033998,
        0.004998,
        0.036999,
        0.037002,
        0.005999,
        0.034999,
        0.037003,
        0.037984,
        0.035999,
        0.036987,
        0.034,
        0.041,
        0.034999,
        0.035,
        0.034999,
        0.032998,
        0.031987,
        0.033001,
        0.033001,
        0.034,
        0.035997,
        0.032987,
        0.034997,
        0.035001,
        0.037002,
        0.035,
        0.033997,
        0.039002,
        0.038999,
        0.1,
        0.033,
        0.030001,
        0.031002,
        0.029001,
        0.030998,
        0.033003,
        0.032001,
        0.029996,
        0.029999,
        0.036988,
        0.033984,
        0.035984,
        0.03,
        0.040001,
        0.032,
        0.030002,
        0.029,
        0.033996,
        0.031005,
        0.032,
        0.031001,
        0.030001,
        0.027998,
        0.031,
        0.028999,
        0.033999,
        0.025999,
        0.029987,
        0.031997,
        0.036001,
        0.043003,
        0.035,
        0.040001,
        0.041,
        0.029996,
        0.034998,
        0.067998,
        0.041001,
        0.033004,
        0.030997,
        0.033,
        0.029998,
        0.030001,
        0.034999,
        0.038998,
        0.043996,
        0.038001,
        0.028997,
        0.031001,
        0.028003,
        0.031001,
        0.029996,
        0.032001,
        0.029,
        0.038,
        0.033999,
        0.033997,
        0.035003,
        0.031997,
        0.030002,
        0.032002,
        0.026,
        0.035002,
        0.038982,
        0.039,
        0.033999,
        0.030001,
        0.027999,
        0.030001,
        0.030998,
        0.027999,
        0.031,
        0.025999,
        0.026987,
        0.031999,
        0.031001,
        0.032998,
        0.025002,
        0.030997,
        0.033999,
        0.035009,
        0.029987,
        0.027994,
        0.034014,
        0.031975,
        0.029985,
        0.035996,
        0.035011,
        0.033994,
        0.033994,
        0.041003,
        0.037997,
        0.034001,
        0.039,
        0.038012,
        0.030997,
        0.031,
        0.034,
        0.036001,
        0.035998,
        0.039003,
        0.030999,
        0.039005,
        0.033994,
        0.058003,
        0.054,
        0.039,
        0.041999,
        0.038997,
        0.035999,
        0.038001,
        0.040002,
        0.037999,
        0.037998,
        0.034,
        0.048001,
        0.042,
        0.04,
        0.040997,
        0.036997,
        0.042999,
        0.048001,
        0.041008,
        0.042001,
        0.045984,
        0.042002,
        0.035999,
        0.041999,
        0.074001,
        0.041999,
        0.048,
        0.052,
        0.049001,
        0.057,
        0.039002,
        0.048984,
        0.040001,
        0.042,
        0.043998,
        0.048984,
        0.047999,
        0.049003,
        0.047,
        0.055997,
        0.050999,
        0.046002,
        0.049999,
        0.045766,
        0.055478,
        0.054982,
        0.056007,
        0.056997,
        0.051,
        0.057001,
        0.057998,
        0.05698,
        0.053999,
        0.060995,
        0.063999,
        0.058379,
        0.070002,
        0.064,
        0.066998,
        0.051985,
        0.072001,
        0.061997,
        0.067002,
        0.084001,
        0.107001,
        0.174995,
        0.106002,
        0.069001,
        0.086993,
        0.105985,
        0.086996,
        0.074003,
        0.080987,
        0.108,
        0.136997,
        0.089997,
        0.149001,
        0.100001,
        0.078,
        0.113001,
        0.094997,
        0.118001,
        0.092,
        0.079,
        0.103001,
        0.082998,
        0.099998,
        0.074,
        0.113987,
        0.137996,
        0.089987,
        0.135,
        0.074987,
        0.071001,
        0.060983,
        0.088986,
        0.068999,
        0.070995,
        0.114005,
        0.148988,
        0.104995,
        0.080002,
        0.068999,
        0.063002,
        0.119998,
        0.085998,
        0.090985,
        0.083,
        0.061998,
        0.075002,
        0.072001,
        0.089001,
        0.074997,
        0.096998,
        0.109999,
        0.117997,
        0.109002,
        0.120998,
        0.082003,
        0.131998,
        0.108001,
        0.091996,
        0.133,
        0.079001,
        0.071986,
        0.141997,
        0.135997,
        0.074007,
        0.143998,
        0.083999,
        0.137003,
        0.137985,
        0.100001,
        0.082001,
        0.078999,
        0.073986,
        0.073999,
        0.068,
        0.081002,
        0.066998,
        0.059002,
        0.060988,
        0.072997,
        0.062002,
        0.072002,
        0.054002,
        0.066998,
        0.062999,
        0.053997,
        0.060005,
        0.064985,
        0.057,
        0.059999,
        0.072995,
        0.071998,
        0.079,
        0.056003,
        0.056001,
        0.048984,
        0.057003,
        0.051997,
        0.059999,
        0.052002,
        0.051999,
        0.042002,
        0.044999,
        0.045,
        0.046015,
        0.040985,
        0.047002,
        0.042003,
        0.047995,
        0.043982,
        0.045004,
        0.040986,
        0.041997,
        0.041001,
        0.043002,
        0.040998,
        0.041,
        0.039001,
        0.035998,
        0.035999,
        0.034985,
        0.034002,
        0.038999,
        0.034999,
        0.034998,
        0.037001,
        0.031003,
        0.031001,
        0.025998,
        0.031002,
        0.028997,
        0.032003,
        0.027996,
        0.030986,
        0.030999,
        0.033003,
        0.028995,
        0.028002,
        0.029001,
        0.028999,
        0.029998,
        0.027001,
        0.029,
        0.024997,
        0.026001,
        0.030003,
        0.025996,
        0.024983,
        0.024996,
        0.029,
        0.028001,
        0.026999,
        0.025004,
        0.025999,
        0.004997,
        0.026004,
        0.025001,
        0.029001,
        0.023984,
        0.026999,
        0.025002,
        0.029002,
        0.023997,
        0.027006,
        0.025983,
        0.025002,
        0.028002,
        0.026283,
        0.026998,
        0.027002,
        0.031061,
        0.026999,
        0.022002,
        0.025002,
        0.024999,
        0.026,
        0.023997,
        0.027986,
        0.022002,
        0.022997,
        0.023,
        0.020999,
        0.022002,
        0.005,
        0.025002,
        0.021003,
        0.022998,
        0.025002,
        0.021997,
        0.025,
        0.021003,
        0.024,
        0.024001,
        0.023998,
        0.024995,
        0.024986,
        0.024,
        0.022,
        0.026001,
        0.025999,
        0.022001,
        0.024001,
        0.023001,
        0.024003,
        0.021996,
        0.02202,
        0.021982,
        0.020998,
        0.025002,
        0.020985,
        0.022002,
        0.022999,
        0.024,
        0.021986,
        0.023,
        0.023999,
        0.022003,
        0.026998,
        0.021,
        0.026,
        0.023001,
        0.028014,
        0.023985,
        0.024,
        0.027999,
        0.027001,
        0.024001,
        0.024998,
        0.025999,
        0.026001,
        0.027998,
        0.029987,
        0.025995,
        0.026003,
        0.026997,
        0.028002,
        0.026997,
        0.027002,
        0.027999,
        0.024998,
        0.025,
        0.026985,
        0.025998,
        0.025001,
        0.026997,
        0.025016,
        0.027983,
        0.024997,
        0.024997,
        0.025985,
        0.029001,
        0.026002,
        0.024997,
        0.026,
        0.029001,
        0.026997,
        0.032003,
        0.028998,
        0.029,
        0.025003,
        0.029001,
        0.029956,
        0.026008,
        0.032001,
        0.028999,
        0.025983,
        0.026,
        0.025999,
        0.026998,
        0.026988,
        0.029998,
        0.023001,
        0.027999,
        0.026,
        0.025984,
        0.029001,
        0.029,
        0.024998,
        0.028002,
        0.026,
        0.022998,
        0.026999,
        0.025,
        0.025999,
        0.029,
        0.030002,
        0.029998,
        0.029999,
        0.032002,
        0.031999,
        0.033002,
        0.031107,
        0.030001,
        0.028999,
        0.029995,
        0.032986,
        0.033001,
        0.031996,
        0.032985,
        0.029001,
        0.032,
        0.035001,
        0.031999,
        0.032999,
        0.038001,
        0.032,
        0.033998,
        0.033,
        0.034001,
        0.032999,
        0.033998,
        0.036002,
        0.039,
        0.038003,
        0.036,
        0.035,
        0.034001,
        0.036003,
        0.038002,
        0.041,
        0.037,
        0.035003,
        0.037987,
        0.035997,
        0.036001,
        0.030002,
        0.036003,
        0.041995,
        0.034985,
        0.038003,
        0.042987,
        0.043001,
        0.043999,
        0.034002,
        0.039998,
        0.038998,
        0.037999,
        0.042997,
        0.039,
        0.031998,
        0.037004,
        0.039997,
        0.039002,
        0.042999,
        0.038004,
        0.033995,
        0.04,
        0.038987,
        0.038001,
        0.040002,
        0.041999,
        0.038,
        0.041997,
        0.042001,
        0.039002,
        0.04,
        0.039001,
        0.038998,
        0.038001,
        0.039,
        0.039999,
        0.043001,
        0.035998,
        0.036,
        0.039,
        0.035,
        0.037003,
        0.040995,
        0.042983,
        0.040001,
        0.041002,
        0.046997,
        0.041999,
        0.033002,
        0.036999,
        0.037,
        0.036,
        0.038001,
        0.040001,
        0.038998,
        0.043001,
        0.038998,
        0.042,
        0.037999,
        0.037015,
        0.035986,
        0.039999,
        0.043,
        0.070999,
        0.046,
        0.044002,
        0.044998,
        0.043,
        0.042,
        0.039,
        0.055,
        0.043008,
        0.058999,
        0.048001,
        0.046,
        0.048,
        0.048998,
        0.104,
        0.079997,
        0.048003,
        0.051998,
        0.053999,
        0.067998,
        0.065003,
        0.052998,
        0.064002,
        0.047998,
        0.041001,
        0.040999,
        0.042,
        0.047003,
        0.046001,
        0.043001,
        0.045984,
        0.049,
        0.052001,
        0.052016,
        0.047984,
        0.045,
        0.056999,
        0.049998,
        0.047,
        0.088985,
        0.068999,
        0.046,
        0.04,
        0.043001,
        0.047001,
        0.047998,
        0.052005,
        0.047997,
        0.056997,
        0.053002,
        0.053998,
        0.051,
        0.049999,
        0.057001,
        0.054,
        0.051,
        0.052999,
        0.05,
        0.048001,
        0.048999,
        0.060002,
        0.048,
        0.055002,
        0.044985,
        0.061003,
        0.068006,
        0.049992,
        0.053999,
        0.061002,
        0.05,
        0.072,
        0.043999,
        0.056001,
        0.055001,
        0.049,
        0.057998,
        0.108999,
        0.058001,
        0.047,
        0.054002,
        0.057,
        0.059998,
        0.068999,
        0.063001,
        0.057998,
        0.046001,
        0.047,
        0.045001,
        0.049002,
        0.045996,
        0.049001,
        0.044,
        0.063999,
        0.044,
        0.046001,
        0.045001,
        0.043998,
        0.049001,
        0.046998,
        0.045002,
        0.044998,
        0.042,
        0.052002,
        0.05,
        0.069002,
        0.079997,
        0.046003,
        0.044984,
        0.049,
        0.046,
        0.041004,
        0.045997,
        0.053,
        0.050999,
        0.055988,
        0.048995,
        0.046004,
        0.05,
        0.049003,
        0.061996,
        0.053002,
        0.055002,
        0.05,
        0.052001,
        0.048,
        0.045,
        0.044,
        0.056,
        0.046,
        0.043999,
        0.042998,
        0.046002,
        0.053,
        0.043987,
        0.041001,
        0.045015,
        0.042985,
        0.045998,
        0.038982,
        0.042002,
        0.042999,
        0.040001,
        0.047014,
        0.046987,
        0.045998,
        0.043,
        0.042,
        0.049001,
        0.047999,
        0.101,
        0.044998,
        0.043999,
        0.040001,
        0.043,
        0.040999,
        0.040999,
        0.042,
        0.040003,
        0.039,
        0.040998,
        0.043999,
        0.046001,
        0.039002,
        0.039998,
        0.034,
        0.037001,
        0.040997,
        0.037983,
        0.062999,
        0.051273,
        0.058998,
        0.037001,
        0.040001,
        0.042999,
        0.048002,
        0.052998,
        0.040001,
        0.040998,
        0.038002,
        0.038012,
        0.034997,
        0.040002,
        0.042,
        0.039,
        0.040002,
        0.043,
        0.038,
        0.039999,
        0.042596,
        0.04,
        0.042003,
        0.045998,
        0.042999,
        0.047001,
        0.047003,
        0.055,
        0.048997,
        0.048001,
        0.044999,
        0.054999,
        0.056998,
        0.063,
        0.056004,
        0.060997,
        0.057001,
        0.067999,
        0.066003,
        0.056,
        0.054,
        0.059001,
        0.065,
        0.065003,
        0.058996,
        0.059998,
        0.06899,
        0.059999,
        0.051998,
        0.053001,
        0.062,
        0.068002,
        0.066998,
        0.071999,
        0.065,
        0.058997,
        0.056995,
        0.057,
        0.052998,
        0.052,
        0.053004,
        0.044996,
        0.054983,
        0.048004,
        0.042,
        0.050001,
        0.062997,
        0.053999,
        0.057001,
        0.056002,
        0.056999,
        0.056,
        0.055999,
        0.067,
        0.058998,
        0.072998,
        0.074001,
        0.065,
        0.072013,
        0.069983,
        0.065983,
        0.077996,
        0.072,
        0.064996,
        0.067997,
        0.102,
        0.071001,
        0.076001,
        0.083002,
        0.068987,
        0.070999,
        0.060997,
        0.053001,
        0.063002,
        0.067997,
        0.071999,
        0.061999,
        0.060996,
        0.069987,
        0.054998,
        0.089003,
        0.093999,
        0.059001,
        0.061002,
        0.06,
        0.053,
        0.065002,
        0.064996,
        0.066998,
        0.062999,
        0.064997,
        0.059999,
        0.056003,
        0.057004,
        0.053994,
        0.056003,
        0.119999,
        0.062,
        0.052999,
        0.054002,
        0.055001,
        0.042997,
        0.052003,
        0.052998,
        0.054002,
        0.050001,
        0.045998,
        0.050001,
        0.047001,
        0.043996,
        0.049002,
        0.049002,
        0.047997,
        0.049,
        0.039,
        0.046,
        0.041998,
        0.045,
        0.045002,
        0.040996,
        0.046003,
        0.045998,
        0.046001,
        0.042999,
        0.043002,
        0.042999,
        0.042998,
        0.042999,
        0.038998,
        0.047002,
        0.044001,
        0.04,
        0.038987,
        0.040997,
        0.043002,
        0.039001,
        0.039999,
        0.039,
        0.038067,
        0.040988,
        0.041999,
        0.043998,
        0.044003,
        0.051997,
        0.051998,
        0.052,
        0.046001,
        0.043,
        0.043002,
        0.042,
        0.043987,
        0.044997,
        0.050995,
        0.047005,
        0.044999,
        0.045997,
        0.043984,
        0.046002,
        0.045999,
        0.044001,
        0.046998,
        0.055,
        0.042,
        0.042986,
        0.047,
        0.047,
        0.044002,
        0.043989,
        0.060998,
        0.065998,
        0.057001,
        0.058998,
        0.058001,
        0.054001,
        0.057,
        0.058001,
        0.056998,
        0.061999,
        0.050009,
        0.04999,
        0.044,
        0.052985,
        0.047999,
        0.050001,
        0.044002,
        0.043998,
        0.048001,
        0.046999,
        0.049,
        0.047999,
        0.046,
        0.044002,
        0.046,
        0.047999,
        0.045,
        0.048005,
        0.043001,
        0.044997,
        0.047001,
        0.046,
        0.04,
        0.041,
        0.043999,
        0.042003,
        0.042998,
        0.043001,
        0.049998,
        0.039001,
        0.043999,
        0.043999,
        0.043,
        0.046,
        0.038003,
        0.045998,
        0.041,
        0.042,
        0.042,
        0.040999,
        0.044999,
        0.044008,
        0.036993,
        0.054002,
        0.047999,
        0.041,
        0.044002,
        0.036999,
        0.035983,
        0.045001,
        0.037996,
        0.036999,
        0.035002,
        0.039006,
        0.038993,
        0.036,
        0.039003,
        0.041998,
        0.036002,
        0.037003,
        0.03798,
        0.042,
        0.038,
        0.042002,
        0.038,
        0.042984,
        0.041001,
        0.043,
        0.039981,
        0.041,
        0.036999,
        0.044,
        0.041001,
        0.042006,
        0.052996,
        0.047998,
        0.044985,
        0.049998,
        0.042999,
        0.048999,
        0.042,
        0.043002,
        0.044001,
        0.038001,
        0.049002,
        0.043999,
        0.049002,
        0.044003,
        0.045981,
        0.041002,
        0.05,
        0.044001,
        0.046999,
        0.049003,
        0.045982,
        0.048001,
        0.050998,
        0.056999,
        0.059999,
        0.057998,
        0.054999,
        0.060001,
        0.049001,
        0.062001,
        0.059985,
        0.056,
        0.061998,
        0.067999,
        0.057003,
        0.060997,
        0.060998,
        0.060008,
        0.067995,
        0.059998,
        0.057,
        0.069001,
        0.063999,
        0.061001,
        0.066004,
        0.074983,
        0.075,
        0.065999,
        0.070003,
        0.076998,
        0.079,
        0.1,
        0.08,
        0.104004,
        0.08899,
        0.077,
        0.115002,
        0.102,
        0.100002,
        0.13,
        0.126,
        0.123998,
        0.117002,
        0.141999,
        0.152999,
        0.191001,
        0.205,
        0.181,
        0.156999,
        0.144,
        0.144999,
        0.138003,
        0.142998,
        0.137004,
        0.144982,
        0.138,
        0.138999,
        0.141,
        0.106,
        0.12401,
        0.104983,
        0.090001,
        0.100001,
        0.097999,
        0.084001,
        0.087999,
        0.085998,
        0.098001,
        0.088002,
        0.089,
        0.090999,
        0.105002,
        0.095001,
        0.097998,
        0.095,
        0.119001,
        0.114002,
        0.115002,
        0.137001,
        0.145998,
        0.135001,
        0.135,
        0.147,
        0.136,
        0.133001,
        0.141999,
        0.135001,
        0.136998,
        0.134999,
        0.134999,
        0.140999,
        0.159985,
        0.188999,
        0.171001,
        0.162994,
        0.160001,
        0.145003,
        0.150002,
        0.143988,
        0.172003,
        0.182,
        0.170001,
        0.151997,
        0.141001,
        0.137,
        0.135999,
        0.134,
        0.022002,
        0.136001,
        0.145997,
        0.145,
        0.143002,
        0.140998,
        0.141002,
        0.145002,
        0.144001,
        0.152987,
        0.156996,
        0.143002,
        0.138003,
        0.142998,
        0.223002,
        0.145,
        0.143999,
        0.170003,
        0.165997,
        0.135004,
        0.043997,
        0.155999,
        0.138,
        0.133998,
        0.110002,
        0.047996,
        0.049003,
        0.059001,
        0.073998,
        0.049,
        0.049002,
        0.052,
        0.042998,
        0.045001,
        0.048997,
        0.043004,
        0.043998,
        0.045,
        0.041999,
        0.050002,
        0.049984,
        0.045003,
        0.045998,
        0.055999,
        0.056983,
        0.070002,
        0.070998,
        0.062003,
        0.066985,
        0.069002,
        0.071998,
        0.063,
        0.067001,
        0.060997,
        0.069,
        0.070999,
        0.057999,
        0.056987,
        0.059996,
        0.05,
        0.058002,
        0.049984,
        0.055003,
        0.056996,
        0.052,
        0.053001,
        0.054986,
        0.056999,
        0.057002,
        0.061996,
        0.061985,
        0.049002,
        0.053996,
        0.066002,
        0.062998,
        0.067002,
        0.060984,
        0.063986,
        0.066,
        0.059998,
        0.067986,
        0.069999,
        0.071001,
        0.076,
        0.082003,
        0.073986,
        0.072985,
        0.08,
        0.078999,
        0.074,
        0.067002,
        0.077998,
        0.073001,
        0.078001,
        0.084003,
        0.077998,
        0.090998,
        0.083999,
        0.085,
        0.083001,
        0.085998,
        0.086003,
        0.070997,
        0.072,
        0.069,
        0.079,
        0.078,
        0.082,
        0.075998,
        0.081,
        0.094999,
        0.086,
        0.085,
        0.082999,
        0.114001,
        0.137998,
        0.091,
        0.090998,
        0.105001,
        0.113,
        0.104,
        0.099001,
        0.105,
        0.113999,
        0.102,
        0.114003,
        0.133,
        0.125,
        0.202999,
        0.138003,
        0.145003,
        0.136996,
        0.122999,
        0.115002,
        0.121002,
        0.143999,
        0.120001,
        0.129,
        0.110001,
        0.174,
        0.110997,
        0.135002,
        0.143,
        0.125999,
        0.138001,
        0.117,
        0.142,
        0.081002,
        0.126,
        0.190999,
        0.119001,
        0.127,
        0.119,
        0.134,
        0.122,
        0.135999,
        0.136002,
        0.114,
        0.114998,
        0.093,
        0.105,
        0.115999,
        0.100998,
        0.105985,
        0.115999,
        0.137001,
        0.136002,
        0.115998,
        0.136001,
        0.102,
        0.091002,
        0.074996,
        0.069002,
        0.103998,
        0.079001,
        0.099005,
        0.103996,
        0.108999,
        0.14,
        0.141999,
        0.136999,
        0.138001,
        0.137001,
        0.154999,
        0.137998,
        0.137,
        0.137002,
        0.135997,
        0.132985,
        0.134999,
        0.134,
        0.146999,
        0.135001,
        0.134999,
        0.136003,
        0.134999,
        0.133002,
        0.060001,
        0.143999,
        0.147999,
        0.139,
        0.14,
        0.151,
        0.138014,
        0.163986,
        0.158995,
        0.153001,
        0.147001,
        0.145988,
        0.155001,
        0.174998,
        0.151999,
        0.158001,
        0.158,
        0.153,
        0.151998,
        0.156001,
        0.148999,
        0.159999,
        0.164996,
        0.162999,
        0.162001,
        0.148999,
        0.144004,
        0.136997,
        0.136,
        0.146996,
        0.134997,
        0.136002,
        0.140998,
        0.137003,
        0.156014,
        0.151988,
        0.136999,
        0.133999,
        0.134999,
        0.134,
        0.139999,
        0.135,
        0.135003,
        0.138004,
        0.135998,
        0.132997,
        0.134999,
        0.132998,
        0.134997,
        0.141,
        0.134999,
        0.134,
        0.133997,
        0.134003,
        0.133986,
        0.132996,
        0.136998,
        0.135,
        0.133997,
        0.134002,
        0.135998,
        0.135001
    ]
}