episodes,steps,rewards
0,200,-200.0
1,200,-200.0
2,200,-200.0
3,200,-200.0
4,200,-200.0
5,200,-200.0
6,200,-200.0
7,200,-200.0
8,200,-200.0
9,200,-200.0
10,200,-200.0
11,200,-200.0
12,200,-200.0
13,200,-200.0
14,200,-200.0
15,200,-200.0
16,200,-200.0
17,200,-200.0
18,200,-200.0
19,200,-200.0
20,200,-200.0
21,200,-200.0
22,200,-200.0
23,200,-200.0
24,200,-200.0
25,200,-200.0
26,200,-200.0
27,200,-200.0
28,200,-200.0
29,200,-200.0
30,200,-200.0
31,200,-200.0
32,200,-200.0
33,200,-200.0
34,200,-200.0
35,200,-200.0
36,200,-200.0
37,200,-200.0
38,200,-200.0
39,200,-200.0
40,200,-200.0
41,200,-200.0
42,200,-200.0
43,200,-200.0
44,200,-200.0
45,200,-200.0
46,200,-200.0
47,200,-200.0
48,200,-200.0
49,200,-200.0
50,200,-200.0
51,200,-200.0
52,200,-200.0
53,200,-200.0
54,200,-200.0
55,200,-200.0
56,200,-200.0
57,200,-200.0
58,200,-200.0
59,200,-200.0
60,200,-200.0
61,200,-200.0
62,200,-200.0
63,200,-200.0
64,200,-200.0
65,200,-200.0
66,200,-200.0
67,200,-200.0
68,200,-200.0
69,200,-200.0
70,200,-200.0
71,200,-200.0
72,200,-200.0
73,200,-200.0
74,200,-200.0
75,200,-200.0
76,200,-200.0
77,200,-200.0
78,200,-200.0
79,200,-200.0
80,200,-200.0
81,200,-200.0
82,200,-200.0
83,200,-200.0
84,200,-200.0
85,200,-200.0
86,200,-200.0
87,200,-200.0
88,200,-200.0
89,200,-200.0
90,200,-200.0
91,200,-200.0
92,200,-200.0
93,200,-200.0
94,200,-200.0
95,200,-200.0
96,200,-200.0
97,200,-200.0
98,200,-200.0
99,200,-200.0
100,200,-200.0
101,200,-200.0
102,200,-200.0
103,200,-200.0
104,200,-200.0
105,200,-200.0
106,200,-200.0
107,200,-200.0
108,200,-200.0
109,200,-200.0
110,200,-200.0
111,200,-200.0
112,200,-200.0
113,200,-200.0
114,200,-200.0
115,200,-200.0
116,200,-200.0
117,200,-200.0
118,200,-200.0
119,200,-200.0
120,200,-200.0
121,200,-200.0
122,200,-200.0
123,200,-200.0
124,200,-200.0
125,200,-200.0
126,200,-200.0
127,200,-200.0
128,200,-200.0
129,200,-200.0
130,200,-200.0
131,200,-200.0
132,200,-200.0
133,200,-200.0
134,200,-200.0
135,200,-200.0
136,200,-200.0
137,200,-200.0
138,200,-200.0
139,200,-200.0
140,200,-200.0
141,200,-200.0
142,200,-200.0
143,200,-200.0
144,200,-200.0
145,200,-200.0
146,200,-200.0
147,200,-200.0
148,200,-200.0
149,200,-200.0
150,200,-200.0
151,200,-200.0
152,200,-200.0
153,200,-200.0
154,200,-200.0
155,200,-200.0
156,200,-200.0
157,200,-200.0
158,200,-200.0
159,200,-200.0
160,200,-200.0
161,200,-200.0
162,200,-200.0
163,200,-200.0
164,200,-200.0
165,200,-200.0
166,200,-200.0
167,200,-200.0
168,200,-200.0
169,200,-200.0
170,200,-200.0
171,200,-200.0
172,200,-200.0
173,200,-200.0
174,200,-200.0
175,200,-200.0
176,200,-200.0
177,200,-200.0
178,200,-200.0
179,200,-200.0
180,182,-182.0
181,200,-200.0
182,200,-200.0
183,200,-200.0
184,200,-200.0
185,200,-200.0
186,200,-200.0
187,200,-200.0
188,200,-200.0
189,200,-200.0
190,200,-200.0
191,200,-200.0
192,200,-200.0
193,200,-200.0
194,200,-200.0
195,200,-200.0
196,200,-200.0
197,200,-200.0
198,200,-200.0
199,200,-200.0
200,200,-200.0
201,200,-200.0
202,200,-200.0
203,200,-200.0
204,200,-200.0
205,200,-200.0
206,200,-200.0
207,200,-200.0
208,200,-200.0
209,200,-200.0
210,200,-200.0
211,120,-120.0
212,200,-200.0
213,200,-200.0
214,200,-200.0
215,200,-200.0
216,200,-200.0
217,200,-200.0
218,200,-200.0
219,200,-200.0
220,200,-200.0
221,200,-200.0
222,200,-200.0
223,172,-172.0
224,200,-200.0
225,200,-200.0
226,200,-200.0
227,173,-173.0
228,200,-200.0
229,131,-131.0
230,200,-200.0
231,200,-200.0
232,200,-200.0
233,174,-174.0
234,200,-200.0
235,199,-199.0
236,200,-200.0
237,200,-200.0
238,188,-188.0
239,200,-200.0
240,200,-200.0
241,185,-185.0
242,194,-194.0
243,163,-163.0
244,200,-200.0
245,133,-133.0
246,200,-200.0
247,200,-200.0
248,200,-200.0
249,200,-200.0
250,200,-200.0
251,200,-200.0
252,200,-200.0
253,200,-200.0
254,200,-200.0
255,200,-200.0
256,200,-200.0
257,200,-200.0
258,176,-176.0
259,200,-200.0
260,200,-200.0
261,200,-200.0
262,200,-200.0
263,200,-200.0
264,200,-200.0
265,200,-200.0
266,200,-200.0
267,200,-200.0
268,200,-200.0
269,194,-194.0
270,176,-176.0
271,200,-200.0
272,200,-200.0
273,200,-200.0
274,200,-200.0
275,200,-200.0
276,200,-200.0
277,190,-190.0
278,200,-200.0
279,168,-168.0
280,200,-200.0
281,105,-105.0
282,200,-200.0
283,200,-200.0
284,200,-200.0
285,200,-200.0
286,200,-200.0
287,200,-200.0
288,200,-200.0
289,170,-170.0
290,200,-200.0
291,200,-200.0
292,200,-200.0
293,184,-184.0
294,200,-200.0
295,200,-200.0
296,200,-200.0
297,174,-174.0
298,200,-200.0
299,200,-200.0
300,200,-200.0
301,184,-184.0
302,171,-171.0
303,200,-200.0
304,174,-174.0
305,171,-171.0
306,95,-95.0
307,104,-104.0
308,200,-200.0
309,200,-200.0
310,160,-160.0
311,106,-106.0
312,200,-200.0
313,200,-200.0
314,200,-200.0
315,200,-200.0
316,200,-200.0
317,92,-92.0
318,200,-200.0
319,200,-200.0
320,100,-100.0
321,200,-200.0
322,200,-200.0
323,95,-95.0
324,190,-190.0
325,91,-91.0
326,200,-200.0
327,200,-200.0
328,200,-200.0
329,200,-200.0
330,200,-200.0
331,200,-200.0
332,200,-200.0
333,200,-200.0
334,200,-200.0
335,200,-200.0
336,200,-200.0
337,200,-200.0
338,200,-200.0
339,200,-200.0
340,200,-200.0
341,139,-139.0
342,200,-200.0
343,200,-200.0
344,200,-200.0
345,200,-200.0
346,200,-200.0
347,200,-200.0
348,200,-200.0
349,200,-200.0
350,200,-200.0
351,200,-200.0
352,200,-200.0
353,200,-200.0
354,168,-168.0
355,134,-134.0
356,170,-170.0
357,136,-136.0
358,200,-200.0
359,200,-200.0
360,200,-200.0
361,200,-200.0
362,200,-200.0
363,200,-200.0
364,168,-168.0
365,137,-137.0
366,155,-155.0
367,199,-199.0
368,148,-148.0
369,200,-200.0
370,145,-145.0
371,164,-164.0
372,169,-169.0
373,200,-200.0
374,200,-200.0
375,200,-200.0
376,200,-200.0
377,200,-200.0
378,200,-200.0
379,144,-144.0
380,173,-173.0
381,148,-148.0
382,89,-89.0
383,200,-200.0
384,200,-200.0
385,144,-144.0
386,155,-155.0
387,151,-151.0
388,200,-200.0
389,108,-108.0
390,157,-157.0
391,90,-90.0
392,189,-189.0
393,191,-191.0
394,166,-166.0
395,200,-200.0
396,200,-200.0
397,158,-158.0
398,200,-200.0
399,197,-197.0
400,200,-200.0
401,200,-200.0
402,200,-200.0
403,170,-170.0
404,172,-172.0
405,200,-200.0
406,177,-177.0
407,161,-161.0
408,99,-99.0
409,169,-169.0
410,200,-200.0
411,200,-200.0
412,200,-200.0
413,182,-182.0
414,111,-111.0
415,200,-200.0
416,154,-154.0
417,147,-147.0
418,200,-200.0
419,200,-200.0
420,167,-167.0
421,164,-164.0
422,160,-160.0
423,200,-200.0
424,200,-200.0
425,200,-200.0
426,179,-179.0
427,200,-200.0
428,200,-200.0
429,156,-156.0
430,200,-200.0
431,168,-168.0
432,153,-153.0
433,200,-200.0
434,145,-145.0
435,142,-142.0
436,148,-148.0
437,148,-148.0
438,147,-147.0
439,146,-146.0
440,145,-145.0
441,153,-153.0
442,155,-155.0
443,144,-144.0
444,150,-150.0
445,141,-141.0
446,143,-143.0
447,142,-142.0
448,138,-138.0
449,140,-140.0
450,138,-138.0
451,139,-139.0
452,149,-149.0
453,142,-142.0
454,136,-136.0
455,158,-158.0
456,153,-153.0
457,154,-154.0
458,151,-151.0
459,200,-200.0
460,165,-165.0
461,171,-171.0
462,200,-200.0
463,200,-200.0
464,152,-152.0
465,173,-173.0
466,200,-200.0
467,137,-137.0
468,164,-164.0
469,152,-152.0
470,150,-150.0
471,200,-200.0
472,200,-200.0
473,200,-200.0
474,147,-147.0
475,200,-200.0
476,164,-164.0
477,200,-200.0
478,180,-180.0
479,109,-109.0
480,94,-94.0
481,90,-90.0
482,200,-200.0
483,200,-200.0
484,200,-200.0
485,162,-162.0
486,100,-100.0
487,95,-95.0
488,200,-200.0
489,200,-200.0
490,152,-152.0
491,163,-163.0
492,200,-200.0
493,160,-160.0
494,200,-200.0
495,163,-163.0
496,200,-200.0
497,200,-200.0
498,167,-167.0
499,149,-149.0
500,159,-159.0
501,200,-200.0
502,93,-93.0
503,200,-200.0
504,200,-200.0
505,200,-200.0
506,171,-171.0
507,135,-135.0
508,171,-171.0
509,132,-132.0
510,200,-200.0
511,200,-200.0
512,169,-169.0
513,200,-200.0
514,193,-193.0
515,102,-102.0
516,105,-105.0
517,189,-189.0
518,180,-180.0
519,200,-200.0
520,140,-140.0
521,200,-200.0
522,96,-96.0
523,171,-171.0
524,157,-157.0
525,179,-179.0
526,164,-164.0
527,168,-168.0
528,200,-200.0
529,200,-200.0
530,162,-162.0
531,96,-96.0
532,92,-92.0
533,107,-107.0
534,164,-164.0
535,91,-91.0
536,200,-200.0
537,189,-189.0
538,176,-176.0
539,92,-92.0
540,94,-94.0
541,100,-100.0
542,164,-164.0
543,98,-98.0
544,92,-92.0
545,102,-102.0
546,115,-115.0
547,165,-165.0
548,169,-169.0
549,167,-167.0
550,165,-165.0
551,166,-166.0
552,194,-194.0
553,147,-147.0
554,190,-190.0
555,149,-149.0
556,150,-150.0
557,158,-158.0
558,155,-155.0
559,146,-146.0
560,143,-143.0
561,161,-161.0
562,160,-160.0
563,143,-143.0
564,148,-148.0
565,154,-154.0
566,103,-103.0
567,150,-150.0
568,101,-101.0
569,157,-157.0
570,154,-154.0
571,198,-198.0
572,175,-175.0
573,103,-103.0
574,91,-91.0
575,157,-157.0
576,147,-147.0
577,120,-120.0
578,95,-95.0
579,143,-143.0
580,106,-106.0
581,159,-159.0
582,94,-94.0
583,143,-143.0
584,148,-148.0
585,142,-142.0
586,191,-191.0
587,148,-148.0
588,84,-84.0
589,155,-155.0
590,88,-88.0
591,106,-106.0
592,178,-178.0
593,86,-86.0
594,159,-159.0
595,107,-107.0
596,200,-200.0
597,84,-84.0
598,149,-149.0
599,153,-153.0
600,152,-152.0
601,154,-154.0
602,85,-85.0
603,162,-162.0
604,155,-155.0
605,92,-92.0
606,146,-146.0
607,140,-140.0
608,142,-142.0
609,92,-92.0
610,84,-84.0
611,85,-85.0
612,156,-156.0
613,143,-143.0
614,126,-126.0
615,90,-90.0
616,84,-84.0
617,154,-154.0
618,103,-103.0
619,84,-84.0
620,156,-156.0
621,160,-160.0
622,98,-98.0
623,91,-91.0
624,175,-175.0
625,200,-200.0
626,200,-200.0
627,134,-134.0
628,97,-97.0
629,183,-183.0
630,94,-94.0
631,186,-186.0
632,170,-170.0
633,161,-161.0
634,99,-99.0
635,86,-86.0
636,140,-140.0
637,177,-177.0
638,146,-146.0
639,186,-186.0
640,188,-188.0
641,85,-85.0
642,183,-183.0
643,88,-88.0
644,149,-149.0
645,85,-85.0
646,200,-200.0
647,89,-89.0
648,89,-89.0
649,92,-92.0
650,89,-89.0
651,145,-145.0
652,145,-145.0
653,194,-194.0
654,91,-91.0
655,168,-168.0
656,154,-154.0
657,93,-93.0
658,90,-90.0
659,178,-178.0
660,199,-199.0
661,103,-103.0
662,200,-200.0
663,165,-165.0
664,190,-190.0
665,168,-168.0
666,150,-150.0
667,103,-103.0
668,110,-110.0
669,92,-92.0
670,103,-103.0
671,98,-98.0
672,144,-144.0
673,90,-90.0
674,142,-142.0
675,200,-200.0
676,103,-103.0
677,155,-155.0
678,103,-103.0
679,91,-91.0
680,168,-168.0
681,93,-93.0
682,185,-185.0
683,200,-200.0
684,161,-161.0
685,89,-89.0
686,147,-147.0
687,94,-94.0
688,156,-156.0
689,120,-120.0
690,90,-90.0
691,178,-178.0
692,91,-91.0
693,105,-105.0
694,86,-86.0
695,151,-151.0
696,151,-151.0
697,153,-153.0
698,155,-155.0
699,98,-98.0
700,159,-159.0
701,105,-105.0
702,157,-157.0
703,88,-88.0
704,150,-150.0
705,98,-98.0
706,178,-178.0
707,90,-90.0
708,160,-160.0
709,175,-175.0
710,151,-151.0
711,97,-97.0
712,88,-88.0
713,159,-159.0
714,154,-154.0
715,87,-87.0
716,144,-144.0
717,86,-86.0
718,153,-153.0
719,162,-162.0
720,150,-150.0
721,175,-175.0
722,153,-153.0
723,148,-148.0
724,143,-143.0
725,146,-146.0
726,142,-142.0
727,98,-98.0
728,90,-90.0
729,155,-155.0
730,159,-159.0
731,149,-149.0
732,145,-145.0
733,140,-140.0
734,140,-140.0
735,91,-91.0
736,110,-110.0
737,139,-139.0
738,141,-141.0
739,140,-140.0
740,140,-140.0
741,136,-136.0
742,179,-179.0
743,143,-143.0
744,145,-145.0
745,85,-85.0
746,193,-193.0
747,148,-148.0
748,164,-164.0
749,177,-177.0
750,181,-181.0
751,88,-88.0
752,179,-179.0
753,169,-169.0
754,146,-146.0
755,88,-88.0
756,103,-103.0
757,146,-146.0
758,150,-150.0
759,113,-113.0
760,120,-120.0
761,137,-137.0
762,93,-93.0
763,163,-163.0
764,123,-123.0
765,102,-102.0
766,93,-93.0
767,163,-163.0
768,100,-100.0
769,121,-121.0
770,89,-89.0
771,116,-116.0
772,168,-168.0
773,118,-118.0
774,114,-114.0
775,144,-144.0
776,88,-88.0
777,159,-159.0
778,156,-156.0
779,87,-87.0
780,163,-163.0
781,154,-154.0
782,146,-146.0
783,151,-151.0
784,146,-146.0
785,140,-140.0
786,143,-143.0
787,141,-141.0
788,114,-114.0
789,147,-147.0
790,145,-145.0
791,143,-143.0
792,156,-156.0
793,147,-147.0
794,141,-141.0
795,115,-115.0
796,145,-145.0
797,151,-151.0
798,147,-147.0
799,142,-142.0
800,146,-146.0
801,147,-147.0
802,146,-146.0
803,142,-142.0
804,88,-88.0
805,149,-149.0
806,148,-148.0
807,148,-148.0
808,85,-85.0
809,150,-150.0
810,168,-168.0
811,149,-149.0
812,158,-158.0
813,149,-149.0
814,151,-151.0
815,153,-153.0
816,157,-157.0
817,158,-158.0
818,119,-119.0
819,154,-154.0
820,151,-151.0
821,152,-152.0
822,144,-144.0
823,88,-88.0
824,148,-148.0
825,149,-149.0
826,148,-148.0
827,153,-153.0
828,151,-151.0
829,147,-147.0
830,146,-146.0
831,146,-146.0
832,85,-85.0
833,152,-152.0
834,90,-90.0
835,168,-168.0
836,100,-100.0
837,113,-113.0
838,193,-193.0
839,86,-86.0
840,96,-96.0
841,85,-85.0
842,93,-93.0
843,88,-88.0
844,163,-163.0
845,200,-200.0
846,106,-106.0
847,90,-90.0
848,95,-95.0
849,161,-161.0
850,86,-86.0
851,200,-200.0
852,100,-100.0
853,182,-182.0
854,92,-92.0
855,89,-89.0
856,143,-143.0
857,88,-88.0
858,137,-137.0
859,93,-93.0
860,138,-138.0
861,135,-135.0
862,109,-109.0
863,99,-99.0
864,136,-136.0
865,142,-142.0
866,136,-136.0
867,143,-143.0
868,146,-146.0
869,142,-142.0
870,200,-200.0
871,154,-154.0
872,163,-163.0
873,200,-200.0
874,167,-167.0
875,86,-86.0
876,143,-143.0
877,96,-96.0
878,153,-153.0
879,195,-195.0
880,112,-112.0
881,95,-95.0
882,87,-87.0
883,84,-84.0
884,142,-142.0
885,143,-143.0
886,152,-152.0
887,173,-173.0
888,85,-85.0
889,200,-200.0
890,200,-200.0
891,143,-143.0
892,162,-162.0
893,160,-160.0
894,151,-151.0
895,148,-148.0
896,146,-146.0
897,144,-144.0
898,157,-157.0
899,91,-91.0
900,91,-91.0
901,95,-95.0
902,160,-160.0
903,144,-144.0
904,151,-151.0
905,161,-161.0
906,145,-145.0
907,147,-147.0
908,147,-147.0
909,154,-154.0
910,163,-163.0
911,200,-200.0
912,157,-157.0
913,143,-143.0
914,147,-147.0
915,151,-151.0
916,159,-159.0
917,155,-155.0
918,144,-144.0
919,154,-154.0
920,149,-149.0
921,148,-148.0
922,200,-200.0
923,146,-146.0
924,143,-143.0
925,143,-143.0
926,152,-152.0
927,167,-167.0
928,158,-158.0
929,154,-154.0
930,87,-87.0
931,94,-94.0
932,152,-152.0
933,147,-147.0
934,156,-156.0
935,88,-88.0
936,148,-148.0
937,156,-156.0
938,159,-159.0
939,108,-108.0
940,200,-200.0
941,150,-150.0
942,146,-146.0
943,88,-88.0
944,179,-179.0
945,144,-144.0
946,88,-88.0
947,147,-147.0
948,95,-95.0
949,150,-150.0
950,143,-143.0
