episodes,steps,rewards
0,72,-110.77259845383847
1,105,-361.865831151398
2,88,-106.22818946457785
3,86,-206.51324742389681
4,118,-108.74451045842756
5,82,-172.7553048696434
6,96,-349.08976650899103
7,106,-120.51590543026448
8,78,-107.49608258887112
9,79,-94.96788626022817
10,127,-237.5197093730627
11,169,-519.7251645674394
12,188,-343.3415755978492
13,278,-282.5420863440926
14,1000,-112.64400986109253
15,304,-100.91271301666814
16,560,-88.19565559353377
17,1000,-92.66470621238084
18,1000,-93.88257590462197
19,1000,-77.14553009604674
20,1000,-155.74937895282048
21,1000,-83.81200243810467
22,1000,-103.42585554977725
23,1000,-180.1982527345422
24,929,-269.92805766774893
25,721,-349.2977855811537
26,524,-270.7516117470881
27,304,-211.6700054056903
28,249,-165.93791694315053
29,259,-217.28542432971176
30,596,-245.23666798867907
31,1000,-124.2930272321624
32,1000,-153.36668086238785
33,681,-306.23131074180105
34,1000,-74.11222714907937
35,1000,-45.04735492288063
36,1000,-128.2167080436885
37,698,-179.0699799461887
38,867,-143.8992276392608
39,759,-159.329338431211
40,554,-124.52531766949485
41,776,-134.46535150306488
42,1000,-122.16272961142933
43,1000,-118.9874945263034
44,1000,-120.09256094228898
45,1000,-166.4008440440987
46,1000,-103.87127274702202
47,1000,-102.67980146122903
48,1000,-71.48340809050796
49,1000,-151.3232791931792
50,1000,-150.11829514274157
51,1000,-135.36578294563967
52,1000,-58.24989560910427
53,1000,-81.46724964980275
54,1000,-226.57153232088305
55,1000,-100.35113053803866
56,1000,-110.058311442685
57,1000,-46.09117704559645
58,1000,-25.135772396507754
59,1000,-40.27773562777051
60,1000,-42.63329062704887
61,1000,-48.06840204120141
62,1000,-56.77661825489565
63,1000,-89.5535710305127
64,1000,-45.76974636916765
65,1000,-44.69868497868404
66,216,-34.96396709392147
67,1000,-97.26691856609081
68,1000,-50.038598450154076
69,1000,-38.28257745936642
70,1000,-56.92399451693237
71,280,8.10500513064784
72,287,-101.8350337267936
73,1000,-71.26420501679435
74,1000,-43.52563066166939
75,1000,-67.77496657540594
76,1000,-53.700038042591146
77,1000,-76.90335065167984
78,1000,-63.85586568668561
79,298,-83.92297574581121
80,1000,-80.4945831560699
81,1000,-103.57562359576045
82,1000,-53.034129152112754
83,131,-44.277866468920585
84,108,-38.20413895929146
85,1000,-54.19532125789513
86,1000,-86.48311687518076
87,1000,-138.5242609933828
88,523,-229.87403264135634
89,1000,-48.015055232869294
90,1000,-35.97251107698651
91,98,-94.09139287056512
92,1000,-59.82097271522489
93,1000,-73.54938087040094
94,1000,-57.4735616639072
95,1000,-38.15829858133362
96,1000,-63.469190306955795
97,459,-263.8806264075971
98,1000,-69.16234315198045
99,1000,-52.72628455754622
100,623,-120.06848459116824
101,1000,-111.73238539283082
102,1000,-69.57541373952482
103,1000,-66.18575657345937
104,1000,-72.45280549316605
105,1000,-74.0322599716062
106,1000,-109.08746728189071
107,1000,-47.61456247928668
108,1000,-12.268268206846258
109,1000,-9.89575836279659
110,1000,-109.57969778967627
111,1000,-62.38039159942944
112,1000,-32.78821550401529
113,1000,-58.69162410353027
114,1000,9.823332861859173
115,1000,-42.68505363343875
116,1000,-52.07892485301988
117,541,-193.0162337250014
118,1000,-36.77951927546647
119,1000,-71.45450704319138
120,1000,-24.948328320209843
121,1000,-44.363545851114836
122,1000,-36.46238410223594
123,1000,-18.260004114882978
124,1000,-22.065499715195713
125,1000,-23.814104484532937
126,1000,-49.40866759270099
127,1000,-58.0345635623756
128,1000,-41.60434408450079
129,1000,-39.85574470238285
130,1000,-23.84711627339781
131,1000,-75.66909287952159
132,1000,-69.85181587837403
133,1000,-22.908509611482046
134,1000,-40.26167259748305
135,1000,-10.009459833823428
136,1000,-46.25336169791145
137,391,306.1889535104943
138,77,-190.99679727119062
139,89,-223.75045079353777
140,110,-225.57784023816197
141,1000,-36.765449717783646
142,1000,-40.03934572882758
143,1000,-12.50606961587938
144,260,11.657707441626883
145,1000,-1.7622850781891524
146,1000,-47.626892884178964
147,1000,-42.813968077513636
148,1000,-41.43975897920143
149,1000,-56.525239005464094
150,1000,-9.85694934034424
151,1000,-32.06883386436515
152,1000,-28.885949213048473
153,1000,-43.211861667738184
154,1000,-12.917679230965527
155,1000,-32.23948718428612
156,1000,-56.4374443781433
157,1000,-62.50058207374444
158,1000,-62.87384310801264
159,1000,-29.020339461100214
160,1000,6.26596727761592
161,1000,-4.928038542365846
162,1000,-52.49588642192554
163,1000,-32.65145520559917
164,1000,-22.224326920473032
165,1000,-67.39595691069664
166,1000,-46.79437149935722
167,1000,-7.222131950480662
168,914,-272.7261154753779
169,463,-263.51911489202496
170,1000,-181.87855257534156
171,1000,-28.214620220388763
172,1000,-61.57493117826671
173,899,152.53327853355563
174,1000,-131.56580140020822
175,1000,-27.650983481495757
176,1000,-101.01073662001332
177,1000,-138.5111597760008
178,1000,-47.434717662973675
179,1000,-214.14970213827002
180,815,-125.49830612373107
181,1000,-111.91508522692895
182,1000,-44.798845932344946
183,1000,-39.86238332449546
184,899,-99.84190370682089
185,719,173.64803700567296
186,468,206.87390473897585
187,584,204.61566472115268
188,998,161.8777089765805
189,1000,-52.01966180406073
190,1000,-41.679943327036256
191,1000,-0.07748354533852098
192,1000,-80.33933319707577
193,1000,-54.17451138254531
194,1000,-0.6755640624758661
195,1000,-64.6784758411426
196,323,-72.43628667984358
197,1000,-82.46255392038698
198,1000,-41.874068983040765
199,1000,7.887200171513995
200,1000,-11.839000588131025
201,1000,-7.474470429397696
202,1000,-24.800336794605645
203,617,151.47466610663386
204,525,215.88241661995121
205,1000,-41.18247926087008
206,1000,-7.725465993946932
207,692,154.9098670719297
208,640,184.813647923796
209,1000,-53.76840380428057
210,1000,15.675301708307138
211,994,137.9840295737667
212,316,1.3561357574506587
213,826,181.03772257983155
214,165,28.14359967337134
215,186,8.247837373967599
216,153,-22.615027123418983
217,350,-278.58814385365145
218,716,181.0505234480255
219,115,-155.00754897220057
220,155,18.73190158068124
221,186,-110.54881589891079
222,159,-64.76144292495356
223,1000,-35.4332693428842
224,826,121.76696946041243
225,145,-153.8551479139423
226,150,-30.91424062688216
227,1000,-50.41949930619517
228,1000,-56.874104383680454
229,1000,-22.644362679197513
230,819,-62.31827686826667
231,900,137.54561284681694
232,1000,-51.87031029697876
233,931,145.94609228412787
234,1000,-37.49967672578454
235,430,-24.087272272534676
236,1000,-28.208625173077138
237,800,156.82891758887956
238,867,114.95859313175168
239,519,204.34692546200174
240,450,262.3184598220846
241,699,168.7201965621933
242,875,109.65176932833579
243,1000,-17.226553507012305
244,496,198.3535239374743
245,635,222.04101729476474
246,386,-160.1391467958054
247,258,-72.57773714195542
248,193,-61.59061172329705
249,1000,47.14096710199947
250,448,231.94813537856126
