{
    "model_info": "split10_10",
    "episodes": [
        14,
        18,
        13,
        29,
        50,
        20,
        105,
        17,
        93,
        42,
        57,
        52,
        45,
        31,
        111,
        36,
        70,
        61,
        18,
        17,
        15,
        42,
        21,
        34,
        52,
        65,
        80,
        154,
        116,
        129,
        159,
        111,
        83,
        132,
        216,
        147,
        152,
        234,
        146,
        175,
        130,
        239,
        124,
        115,
        130,
        70,
        126,
        112,
        98,
        134,
        133,
        138,
        171,
        141,
        177,
        134,
        171,
        208,
        160,
        149,
        209,
        297,
        500,
        361,
        183,
        309,
        206,
        157,
        166,
        203,
        133,
        167,
        149,
        111,
        158,
        181,
        141,
        173,
        191,
        178,
        216,
        135,
        500,
        248,
        500,
        500,
        350,
        500,
        500,
        500,
        500,
        500,
        500,
        500,
        500,
        455,
        240,
        313,
        169,
        155,
        145,
        179,
        151,
        153,
        116,
        134,
        129,
        141,
        117,
        141,
        123,
        127,
        156,
        111,
        109,
        118,
        148,
        130,
        127,
        82,
        116,
        115,
        123,
        121,
        112,
        140,
        127,
        127,
        119,
        131,
        139,
        151,
        152,
        144,
        135,
        130,
        127,
        151,
        145,
        134,
        152,
        152,
        132,
        136,
        115,
        148,
        121,
        117,
        173,
        129,
        176,
        134,
        170,
        144,
        137,
        171,
        148,
        138,
        157,
        138,
        143,
        131,
        153,
        132,
        178,
        142,
        181,
        137,
        162,
        163,
        153,
        150,
        176,
        199,
        179,
        138,
        234,
        183,
        188,
        169,
        209,
        215,
        220,
        273,
        202,
        305,
        389,
        301,
        311,
        457,
        441,
        462,
        500,
        500,
        500,
        500,
        500,
        500,
        500,
        500,
        500,
        500,
        500,
        500,
        500,
        500,
        500,
        500,
        500,
        500,
        500,
        500,
        500,
        500,
        500,
        500,
        500,
        500,
        500,
        500,
        500,
        500,
        500,
        500,
        500,
        500,
        500,
        500,
        500,
        500,
        500,
        500,
        500,
        500,
        500,
        500,
        500,
        500,
        500,
        500,
        500,
        500,
        492,
        500,
        500,
        393,
        500,
        500,
        500,
        500,
        473,
        500,
        500,
        500,
        500,
        500,
        500,
        500,
        500,
        500,
        500,
        500,
        469,
        500,
        500,
        500,
        373,
        500,
        500,
        500,
        386,
        500,
        500,
        500,
        500,
        500,
        500,
        500,
        500,
        500,
        500
    ],
    "durations": [
        1.848016,
        0.007,
        0.007033,
        0.009999,
        0.02,
        0.008,
        0.039,
        0.007999,
        0.034,
        0.016,
        0.018999,
        0.020011,
        0.01499,
        0.010998,
        0.035999,
        0.012001,
        0.020999,
        0.018,
        0.007003,
        0.005997,
        0.004001,
        0.012999,
        0.007002,
        0.014004,
        0.016992,
        0.022,
        0.023999,
        0.048001,
        0.034999,
        0.040006,
        0.049998,
        0.033998,
        0.025,
        0.04,
        0.066008,
        0.045998,
        0.048,
        0.072013,
        0.043987,
        0.054,
        0.039998,
        0.071997,
        0.039003,
        0.034999,
        0.039,
        0.025004,
        0.038002,
        0.033998,
        0.031,
        0.041001,
        0.042999,
        0.040001,
        0.052001,
        0.041995,
        0.053,
        0.040001,
        0.052,
        0.064,
        0.053,
        0.050004,
        0.066,
        0.093002,
        0.158998,
        0.110001,
        0.059001,
        0.101998,
        0.062998,
        0.048001,
        0.055001,
        0.060998,
        0.041002,
        0.050999,
        0.043999,
        0.033,
        0.047999,
        0.057001,
        0.042998,
        0.058002,
        0.060003,
        0.054,
        0.064001,
        0.039999,
        0.152999,
        0.078,
        0.152002,
        0.159998,
        0.127,
        0.173003,
        0.158997,
        0.179,
        0.162001,
        0.150001,
        0.154999,
        0.151001,
        0.150999,
        0.138,
        0.083,
        0.119004,
        0.062997,
        0.051,
        0.047001,
        0.054008,
        0.044991,
        0.052003,
        0.036,
        0.039998,
        0.04,
        0.043001,
        0.033999,
        0.040999,
        0.038,
        0.041001,
        0.048,
        0.032001,
        0.031999,
        0.035,
        0.045001,
        0.05,
        0.039,
        0.027,
        0.035,
        0.035,
        0.037,
        0.035999,
        0.034001,
        0.040999,
        0.036999,
        0.038001,
        0.036002,
        0.037998,
        0.041001,
        0.047,
        0.05,
        0.043999,
        0.041,
        0.039001,
        0.036999,
        0.046003,
        0.043998,
        0.04,
        0.050004,
        0.048998,
        0.041009,
        0.046983,
        0.04,
        0.046999,
        0.038002,
        0.037997,
        0.066,
        0.048,
        0.059999,
        0.042,
        0.053,
        0.045002,
        0.042999,
        0.052001,
        0.044,
        0.044999,
        0.047001,
        0.048001,
        0.049,
        0.044999,
        0.049002,
        0.046007,
        0.054995,
        0.043,
        0.056002,
        0.041999,
        0.052,
        0.049001,
        0.045,
        0.049002,
        0.055998,
        0.061005,
        0.057995,
        0.042001,
        0.068999,
        0.055001,
        0.057001,
        0.051,
        0.063001,
        0.066008,
        0.070999,
        0.081998,
        0.062002,
        0.092998,
        0.129999,
        0.108,
        0.110002,
        0.161001,
        0.140996,
        0.139003,
        0.147997,
        0.147999,
        0.154007,
        0.152994,
        0.147004,
        0.149,
        0.151001,
        0.152998,
        0.152006,
        0.153984,
        0.151999,
        0.146,
        0.183,
        0.168,
        0.158001,
        0.158999,
        0.161,
        0.157001,
        0.165,
        0.162,
        0.148999,
        0.150999,
        0.159003,
        0.169997,
        0.158999,
        0.156001,
        0.159,
        0.173002,
        0.165,
        0.156998,
        0.156,
        0.160002,
        0.176001,
        0.159997,
        0.159001,
        0.158001,
        0.159001,
        0.153,
        0.158003,
        0.171001,
        0.169999,
        0.159,
        0.155,
        0.16,
        0.166002,
        0.157997,
        0.161999,
        0.173998,
        0.179998,
        0.169001,
        0.167004,
        0.159997,
        0.162001,
        0.128999,
        0.164002,
        0.142998,
        0.143,
        0.147,
        0.140001,
        0.143999,
        0.143001,
        0.146,
        0.142,
        0.142999,
        0.144,
        0.147001,
        0.141007,
        0.141982,
        0.139999,
        0.144,
        0.133,
        0.156001,
        0.146999,
        0.150001,
        0.107999,
        0.150999,
        0.150999,
        0.161,
        0.119001,
        0.155998,
        0.145997,
        0.15,
        0.148,
        0.158006,
        0.14699,
        0.158,
        0.159001,
        0.146001,
        0.154001
    ]
}