episodes,steps,rewards
0,85,-106.49707526598272
1,84,-54.1997398274287
2,82,-415.508568694348
3,107,-222.8589902321517
4,122,-120.61452450794434
5,100,-335.1412423001188
6,72,-141.5579484666614
7,85,-362.6555013126524
8,96,-309.1193596435321
9,97,-220.5528166472441
10,103,-79.5283043330686
11,71,-74.9184898981064
12,114,-196.62090144560347
13,104,-76.4958759475376
14,155,-111.22587768643074
15,203,-71.23954344396307
16,134,-43.18438191788796
17,117,-108.8178325964887
18,223,-283.0227753038363
19,93,-489.2181634450741
20,225,-354.9228789738414
21,168,-303.351205557546
22,119,-39.20649970935851
23,1000,-137.91045593077246
24,631,-159.25765098251327
25,137,-112.71272867796766
26,287,-152.99080716197642
27,198,-182.12440054198427
28,587,-83.1948895419256
29,187,-138.49313506671126
30,124,-110.34218095693802
31,181,-153.46207092014293
32,280,-248.94780507337694
33,333,-181.79595842917462
34,286,-158.63555866381273
35,136,-111.22458716714391
36,228,-114.12854203049402
37,301,-59.76209402861841
38,138,-305.0686148465147
39,320,-111.73599534341497
40,440,-145.6077878593006
41,132,-80.94479298518439
42,463,-68.1579099223635
43,140,-15.77379233437776
44,1000,-98.46215413788936
45,1000,-73.21181805644795
46,1000,-84.91074961162875
47,880,-270.27551667558134
48,1000,-136.03344879342308
49,1000,-104.61568575794061
50,1000,-71.41531374818494
51,1000,-89.2297894869258
52,1000,-104.32041208239792
53,1000,-44.6772170512524
54,1000,-42.731004161860724
55,1000,-78.16178005232588
56,1000,-81.30026586600981
57,1000,-34.45476263702613
58,1000,-71.74848249447234
59,1000,-74.85043492650004
60,1000,-72.62478425369942
61,1000,-47.20946026499842
62,1000,-50.58760452061857
63,1000,-54.48918140368416
64,1000,-93.97764314067841
65,1000,-92.8977264026205
66,1000,-58.93733723923842
67,1000,-21.184682042250063
68,1000,-64.33016025364218
69,1000,-31.77239838131369
70,1000,-59.403426411078435
71,1000,-55.74308058757484
72,1000,-72.26689614481924
73,1000,-78.96544368480302
74,1000,-33.01204891760598
75,1000,-8.777888278002619
76,1000,-66.96189357519785
77,1000,-49.758777942149955
78,1000,-105.94886591277198
79,1000,-53.737046718367935
80,1000,-30.204078011975263
81,1000,-41.807600691879436
82,1000,-37.17759060902071
83,1000,-54.467528525944104
84,1000,-74.80940146228629
85,1000,-55.174915036289214
86,1000,-55.966442338895995
87,1000,-18.273433830055495
88,1000,-99.28100139653033
89,1000,-15.084715342527863
90,1000,-52.66039562809126
91,1000,-59.41209830127111
92,1000,-51.80056429000433
93,1000,-54.560197165556616
94,1000,-59.31345704885341
95,1000,-23.42791292843371
96,1000,-53.357352905897436
97,1000,-51.68540645427881
98,1000,-43.11696039707175
99,1000,-67.70186111917866
100,1000,-48.83881672144742
101,1000,-61.2690112013352
102,1000,-34.13445034658029
103,1000,-121.51263019633325
104,1000,-160.1766794717791
105,1000,-49.41527425931831
106,1000,-27.803063263798766
107,1000,-64.68318733974148
108,1000,-20.13832854942522
109,1000,-83.24684679663295
110,1000,-7.9945807099705775
111,1000,-63.149560636841784
112,1000,-55.5436190515946
113,1000,-73.6946470204403
114,1000,-46.57364543144146
115,1000,-11.923198653284755
116,1000,-115.26034830556299
117,1000,-53.331945580296875
118,1000,-44.599776554248834
119,1000,-66.62213175710299
120,1000,-62.60989183521917
121,974,-335.37990026684145
122,1000,-76.34867950345254
123,1000,-61.80172443120914
124,1000,-30.802864458472417
125,1000,-54.4558097560964
126,1000,-19.240486778869997
127,1000,-25.929226069414227
128,329,-207.08197268826933
129,1000,-13.29684702873182
130,1000,-102.09971379680192
131,1000,-81.76705105628916
132,1000,23.563314516615833
133,1000,-55.2807811617396
134,513,-100.63210598035214
135,1000,-81.73102922799114
136,1000,4.321231133601758
137,1000,-44.48438969106772
138,1000,-22.55002724664416
139,1000,-33.193445245452004
140,1000,-52.99022193394601
141,1000,-30.29887880760226
142,1000,-162.8190485734785
143,1000,-12.184961563246453
144,1000,-116.59056107894693
145,1000,22.610297930781908
146,1000,-74.95369294421629
147,1000,-56.13915321566482
148,1000,-13.648694238206652
149,1000,-71.88923663849961
150,1000,-61.039498511267574
151,1000,-96.73113897405729
152,1000,-81.90514397277826
153,794,-135.32210384901117
154,1000,-23.242050854307013
155,1000,-48.92440544302222
156,1000,-102.2971574322371
157,1000,-13.127185323581378
158,252,-177.65633336585276
159,1000,-98.57536621442408
160,1000,-122.69511970210579
161,1000,-17.997213458365874
162,1000,-70.36565731808517
163,1000,-48.441858122414125
164,1000,-41.82667686920628
165,1000,-40.78599523178454
166,1000,-37.55987240634287
167,1000,-26.726139276958794
168,1000,-22.603389613682033
169,1000,-26.99671731787152
170,1000,-72.70180768156972
171,1000,0.5453652362219594
172,1000,-21.919836072195427
173,1000,-62.74399396341164
174,634,-170.63043639127704
175,1000,-43.8749464196944
176,1000,-1.3661466321277045
177,979,-250.80389250971055
178,1000,-38.45660889045694
179,1000,-59.39001989809705
180,679,-88.20745035025479
181,1000,-54.708972808950286
182,1000,-10.220441689195232
183,1000,-65.61207764086119
184,779,-192.527077131226
185,1000,-17.63503523386726
186,1000,-55.439684714458586
187,1000,-85.38668136058968
188,1000,-97.5920897518679
189,495,166.92939286048636
190,1000,-61.97600113565882
191,1000,-50.12207741301786
192,1000,-42.187952150480285
193,1000,-61.82269694555286
194,1000,4.334564216801196
195,502,237.0167868136645
196,1000,-124.45047284639884
197,358,199.45030250399293
198,1000,-61.99786108547848
199,1000,-5.95978376745651
200,1000,-62.75518378248059
201,1000,-55.71947896965306
202,1000,95.5711521929422
203,632,-23.22042315155251
204,1000,-43.27662493419057
205,1000,-17.073338179897252
206,1000,0.9194101075020553
207,1000,-86.40510371155298
208,1000,42.007024553026916
209,1000,-104.66974275265629
210,1000,-75.73884942121563
211,1000,18.072563101897448
212,1000,27.339947535317393
213,1000,-103.67497273554653
214,1000,-54.49669226046884
215,1000,-1.0809138531046556
216,770,186.49132980561245
217,1000,-18.38291107273778
218,1000,-32.62268283964693
219,787,-183.239355497106
220,1000,-51.63493766868023
221,415,-86.40468275499063
222,1000,-98.20444338089753
223,710,-190.0045772412546
224,799,-158.0084244926285
225,1000,-13.775409620083234
226,907,164.0348247230338
227,677,225.6419548327183
228,367,-92.44508121242302
229,1000,-87.3295203723284
230,1000,-34.18875147281662
231,510,-213.03726078845125
232,223,-236.99840685402984
233,557,-463.0689000079705
234,63,-416.4334176183847
235,76,-235.44311199234207
236,59,-248.07739364347228
237,57,-241.5777766326594
238,65,-277.80420260429275
239,70,-65.2203550341782
240,541,-194.9462888407508
241,119,-57.78346661626932
242,359,-131.81245493979472
243,298,-146.06276721711276
244,1000,-58.249231451833225
245,673,-173.52811216887085
246,422,-107.31828332043648
247,914,111.05543294843702
248,1000,109.75476941816729
249,459,154.04257608900676
250,489,-154.98887954342774
