episodes,steps,rewards
0,200,-200.0
1,200,-200.0
2,200,-200.0
3,200,-200.0
4,200,-200.0
5,200,-200.0
6,200,-200.0
7,200,-200.0
8,200,-200.0
9,200,-200.0
10,200,-200.0
11,200,-200.0
12,200,-200.0
13,200,-200.0
14,200,-200.0
15,200,-200.0
16,200,-200.0
17,200,-200.0
18,200,-200.0
19,200,-200.0
20,200,-200.0
21,200,-200.0
22,200,-200.0
23,200,-200.0
24,200,-200.0
25,200,-200.0
26,200,-200.0
27,200,-200.0
28,200,-200.0
29,200,-200.0
30,200,-200.0
31,200,-200.0
32,200,-200.0
33,200,-200.0
34,200,-200.0
35,200,-200.0
36,200,-200.0
37,200,-200.0
38,200,-200.0
39,200,-200.0
40,200,-200.0
41,200,-200.0
42,200,-200.0
43,200,-200.0
44,200,-200.0
45,153,-153.0
46,200,-200.0
47,200,-200.0
48,200,-200.0
49,200,-200.0
50,142,-142.0
51,167,-167.0
52,200,-200.0
53,200,-200.0
54,200,-200.0
55,173,-173.0
56,200,-200.0
57,132,-132.0
58,127,-127.0
59,141,-141.0
60,132,-132.0
61,145,-145.0
62,156,-156.0
63,153,-153.0
64,160,-160.0
65,157,-157.0
66,184,-184.0
67,139,-139.0
68,155,-155.0
69,182,-182.0
70,200,-200.0
71,181,-181.0
72,141,-141.0
73,148,-148.0
74,145,-145.0
75,172,-172.0
76,158,-158.0
77,148,-148.0
78,156,-156.0
79,200,-200.0
80,200,-200.0
81,160,-160.0
82,156,-156.0
83,200,-200.0
84,172,-172.0
85,200,-200.0
86,200,-200.0
87,172,-172.0
88,200,-200.0
89,195,-195.0
90,171,-171.0
91,166,-166.0
92,200,-200.0
93,145,-145.0
94,182,-182.0
95,145,-145.0
96,147,-147.0
97,183,-183.0
98,138,-138.0
99,195,-195.0
100,159,-159.0
101,173,-173.0
102,200,-200.0
103,180,-180.0
104,158,-158.0
105,142,-142.0
106,149,-149.0
107,150,-150.0
108,180,-180.0
109,200,-200.0
110,94,-94.0
111,142,-142.0
112,193,-193.0
113,141,-141.0
114,151,-151.0
115,154,-154.0
116,129,-129.0
117,160,-160.0
118,177,-177.0
119,145,-145.0
120,153,-153.0
121,146,-146.0
122,151,-151.0
123,200,-200.0
124,117,-117.0
125,171,-171.0
126,148,-148.0
127,197,-197.0
128,181,-181.0
129,122,-122.0
130,140,-140.0
131,200,-200.0
132,142,-142.0
133,111,-111.0
134,124,-124.0
135,120,-120.0
136,166,-166.0
137,200,-200.0
138,139,-139.0
139,200,-200.0
140,200,-200.0
141,200,-200.0
142,120,-120.0
143,181,-181.0
144,153,-153.0
145,126,-126.0
146,89,-89.0
147,143,-143.0
148,150,-150.0
149,154,-154.0
150,155,-155.0
151,94,-94.0
152,157,-157.0
153,138,-138.0
154,158,-158.0
155,152,-152.0
156,162,-162.0
157,176,-176.0
158,146,-146.0
159,150,-150.0
160,151,-151.0
161,134,-134.0
162,129,-129.0
163,143,-143.0
164,156,-156.0
165,200,-200.0
166,138,-138.0
167,200,-200.0
168,163,-163.0
169,179,-179.0
170,152,-152.0
171,131,-131.0
172,151,-151.0
173,200,-200.0
174,173,-173.0
175,149,-149.0
176,187,-187.0
177,143,-143.0
178,144,-144.0
179,140,-140.0
180,153,-153.0
181,158,-158.0
182,119,-119.0
183,150,-150.0
184,143,-143.0
185,170,-170.0
186,149,-149.0
187,96,-96.0
188,89,-89.0
189,200,-200.0
190,159,-159.0
191,154,-154.0
192,147,-147.0
193,161,-161.0
194,158,-158.0
195,148,-148.0
196,113,-113.0
197,85,-85.0
198,131,-131.0
199,154,-154.0
200,191,-191.0
201,141,-141.0
202,87,-87.0
203,146,-146.0
204,146,-146.0
205,135,-135.0
206,90,-90.0
207,144,-144.0
208,152,-152.0
209,165,-165.0
210,167,-167.0
211,151,-151.0
212,110,-110.0
213,145,-145.0
214,109,-109.0
215,144,-144.0
216,129,-129.0
217,91,-91.0
218,150,-150.0
219,89,-89.0
220,158,-158.0
221,126,-126.0
222,140,-140.0
223,152,-152.0
224,120,-120.0
225,191,-191.0
226,144,-144.0
227,144,-144.0
228,87,-87.0
229,162,-162.0
230,146,-146.0
231,117,-117.0
232,200,-200.0
233,120,-120.0
234,200,-200.0
235,157,-157.0
236,186,-186.0
237,116,-116.0
238,97,-97.0
239,121,-121.0
240,142,-142.0
241,146,-146.0
242,150,-150.0
243,129,-129.0
244,124,-124.0
245,116,-116.0
246,140,-140.0
247,143,-143.0
248,144,-144.0
249,146,-146.0
250,139,-139.0
251,146,-146.0
252,142,-142.0
253,101,-101.0
254,107,-107.0
255,143,-143.0
256,144,-144.0
257,138,-138.0
258,86,-86.0
259,85,-85.0
260,110,-110.0
261,122,-122.0
262,143,-143.0
263,106,-106.0
264,110,-110.0
265,96,-96.0
266,84,-84.0
267,152,-152.0
268,137,-137.0
269,142,-142.0
270,92,-92.0
271,166,-166.0
272,102,-102.0
273,151,-151.0
274,147,-147.0
275,117,-117.0
276,151,-151.0
277,115,-115.0
278,119,-119.0
279,113,-113.0
280,88,-88.0
281,92,-92.0
282,144,-144.0
283,105,-105.0
284,100,-100.0
285,138,-138.0
286,144,-144.0
287,200,-200.0
288,150,-150.0
289,172,-172.0
290,107,-107.0
291,88,-88.0
292,109,-109.0
293,113,-113.0
294,109,-109.0
295,121,-121.0
296,140,-140.0
297,90,-90.0
298,106,-106.0
299,107,-107.0
300,109,-109.0
