episodes,steps,rewards
0,105,-144.84056599620436
1,85,-194.18419681097805
2,97,-274.36445326648277
3,121,-247.11857935976485
4,93,10.636505658230476
5,86,-301.51337943079864
6,87,-171.34716279724324
7,89,-499.98844869446884
8,123,-280.30506763154347
9,67,-130.39039602320082
10,72,-158.50473420348465
11,84,-57.06440276233004
12,429,-417.7200781620221
13,155,-168.09324780400823
14,109,-383.37269945086376
15,210,-379.9104557838401
16,203,-284.30891117988403
17,260,-178.12806406555183
18,1000,-104.90850903298544
19,333,-122.7686221947357
20,1000,-118.40014606321098
21,1000,-109.2291772029126
22,411,-33.3158216807074
23,1000,-73.34871857558652
24,637,-574.8287940642069
25,1000,-86.69250012885917
26,1000,-188.39688512718163
27,1000,-16.67116058494676
28,722,-164.38627756022242
29,951,-180.2039445027815
30,1000,-51.311547554244456
31,1000,-100.69188440114783
32,904,-220.13943073590013
33,288,-233.6691687589513
34,1000,-24.343299170594072
35,654,-217.5534717331516
36,1000,40.94252335384537
37,1000,-50.024761863036154
38,1000,-6.510755146498105
39,1000,-7.773964393967505
40,1000,-14.55701188190285
41,1000,-36.123543166872935
42,1000,-98.06044023699596
43,1000,27.419879795227683
44,1000,-39.29952599980156
45,1000,-49.54618106664462
46,1000,-20.742718992293963
47,1000,-46.173180768753866
48,1000,-49.29465133880414
49,119,-138.9877451947715
50,1000,-45.51195140272401
51,1000,-32.48247443938538
52,1000,-57.849969686046016
53,93,-77.2516741686483
54,1000,9.407118179269581
55,686,-218.47614426174195
56,1000,-5.168721748946546
57,1000,-13.603927266941849
58,1000,-37.74097653767892
59,1000,-2.913875328532634
60,1000,-49.707811489012656
61,1000,7.773599701940054
62,1000,-51.34726529970112
63,1000,11.775061790309199
64,691,-59.316473793202746
65,1000,-53.58146071000774
66,1000,-35.44988289157954
67,694,-33.565610537012276
68,428,-126.53073241429038
69,1000,-13.273581808157896
70,1000,-44.32156504115633
71,1000,16.162185063487684
72,179,-111.09890098140622
73,1000,-0.8792511793383844
74,1000,-18.59880378532915
75,1000,4.387242478826585
76,1000,-3.4720077479052316
77,1000,18.657351604667117
78,1000,8.443298495088717
79,1000,-60.34822597626005
80,1000,-3.329945340850152
81,1000,-53.37190028875752
82,1000,0.10386468352246903
83,1000,-21.702324886682636
84,1000,48.5698134833869
85,846,-193.54828388534722
86,422,247.28068383877593
87,1000,-21.0551827989101
88,741,179.6160348512341
89,536,169.56809605546044
90,310,278.2188458199988
91,371,246.3881806238653
92,358,251.377594524929
93,319,245.14842396777277
94,309,6.090545669600672
95,240,261.85430619241765
96,282,46.92148447648697
97,594,210.56702258507397
98,413,-3.9081698682287396
99,495,211.8600255418176
100,337,216.74874420543767
101,1000,16.147373881679737
102,380,236.60413312336152
103,335,244.72138880056457
104,563,229.29513041835995
105,313,247.38060967676122
106,652,161.3191961933594
107,245,252.58595449845149
108,487,242.71774223774213
109,153,-24.591152821609
110,287,293.1291018196813
111,420,195.8924593975643
112,578,237.27577696885785
113,295,280.28293369835046
114,272,224.27291740452563
115,309,244.86958908371585
116,95,-3.4241002671039382
117,183,253.74263156459685
118,234,270.8711864747737
119,321,218.16212702644478
120,338,14.714011294835274
121,545,229.21373739334373
122,201,295.4639075280702
123,185,285.2625243056366
124,179,261.52920516845774
125,203,266.4481413168471
126,486,248.04451183861477
127,547,239.02333946639013
128,226,237.44285678159085
129,336,267.83425777511934
130,237,293.04038298920307
131,333,278.0593929623211
132,335,253.9483888903615
133,273,273.13068271299505
134,892,115.72584114198564
135,356,274.93552771922305
136,488,208.9134973586216
137,182,274.4463858598243
138,866,240.24805492844214
139,775,219.15006045094407
140,548,-187.87509044189304
141,145,-30.936483187572932
142,258,-295.2349395135814
143,1000,125.41036124313582
144,152,-156.97407020413266
145,648,-253.08056904015817
146,244,265.1993176712724
147,704,189.56826599085508
148,532,216.20912029392414
149,571,214.37384675722083
150,339,257.6263458268711
151,100,-61.88938894664831
152,273,286.9689795027723
153,227,263.8317674494037
154,334,241.27666293192223
155,297,285.91680488052305
156,306,265.0663316523926
157,452,245.07038174389427
158,211,282.38599723913944
159,272,260.09666060379556
160,304,249.3068137368645
161,288,252.24126416061733
162,421,177.4949980275643
163,238,277.1401446050479
164,530,180.39214450684608
165,276,250.00237451144486
166,276,238.84930364330748
167,93,-276.39073591123326
168,308,266.37308917358484
169,354,241.56412580321168
170,762,121.57616018318465
171,754,176.74642742804434
172,263,244.70722557578068
173,266,257.2258565296694
174,392,270.3177990298604
175,317,207.08655672151983
176,222,237.7975709143636
177,298,258.9044649128808
178,107,-20.17778024578064
179,235,263.4392832278044
180,250,265.71255120999956
181,253,218.2636494059072
182,651,174.10691719806655
183,549,218.66172922498384
184,643,275.29224199280463
185,485,210.82014014882142
186,432,232.60823056443544
187,312,260.78487842068955
188,496,225.06320130426548
189,304,290.73268774724556
190,349,254.42441516348526
191,237,237.044553943312
192,225,285.2188772270488
193,280,253.5147935724754
194,347,207.48894239940907
195,364,245.85727875761395
196,207,217.50109295397593
197,225,272.70955697463273
198,218,259.9833844613171
199,279,247.77437398323423
200,365,297.3015310645766
