episodes,steps,rewards
0,200,-200.0
1,200,-200.0
2,200,-200.0
3,200,-200.0
4,200,-200.0
5,200,-200.0
6,200,-200.0
7,200,-200.0
8,200,-200.0
9,200,-200.0
10,200,-200.0
11,200,-200.0
12,200,-200.0
13,200,-200.0
14,200,-200.0
15,200,-200.0
16,200,-200.0
17,200,-200.0
18,200,-200.0
19,200,-200.0
20,200,-200.0
21,200,-200.0
22,200,-200.0
23,200,-200.0
24,200,-200.0
25,200,-200.0
26,200,-200.0
27,200,-200.0
28,200,-200.0
29,200,-200.0
30,200,-200.0
31,200,-200.0
32,200,-200.0
33,200,-200.0
34,200,-200.0
35,200,-200.0
36,200,-200.0
37,200,-200.0
38,200,-200.0
39,200,-200.0
40,200,-200.0
41,200,-200.0
42,200,-200.0
43,200,-200.0
44,200,-200.0
45,200,-200.0
46,200,-200.0
47,200,-200.0
48,200,-200.0
49,200,-200.0
50,200,-200.0
51,200,-200.0
52,200,-200.0
53,200,-200.0
54,200,-200.0
55,200,-200.0
56,200,-200.0
57,200,-200.0
58,200,-200.0
59,200,-200.0
60,200,-200.0
61,200,-200.0
62,200,-200.0
63,200,-200.0
64,200,-200.0
65,200,-200.0
66,200,-200.0
67,200,-200.0
68,200,-200.0
69,200,-200.0
70,200,-200.0
71,200,-200.0
72,200,-200.0
73,200,-200.0
74,200,-200.0
75,200,-200.0
76,200,-200.0
77,200,-200.0
78,200,-200.0
79,200,-200.0
80,200,-200.0
81,200,-200.0
82,200,-200.0
83,200,-200.0
84,200,-200.0
85,200,-200.0
86,200,-200.0
87,200,-200.0
88,200,-200.0
89,200,-200.0
90,200,-200.0
91,200,-200.0
92,200,-200.0
93,200,-200.0
94,200,-200.0
95,200,-200.0
96,200,-200.0
97,200,-200.0
98,200,-200.0
99,200,-200.0
100,200,-200.0
101,200,-200.0
102,200,-200.0
103,200,-200.0
104,163,-163.0
105,200,-200.0
106,200,-200.0
107,149,-149.0
108,200,-200.0
109,200,-200.0
110,200,-200.0
111,129,-129.0
112,200,-200.0
113,200,-200.0
114,200,-200.0
115,200,-200.0
116,131,-131.0
117,200,-200.0
118,200,-200.0
119,200,-200.0
120,200,-200.0
121,200,-200.0
122,200,-200.0
123,200,-200.0
124,200,-200.0
125,200,-200.0
126,200,-200.0
127,200,-200.0
128,200,-200.0
129,200,-200.0
130,128,-128.0
131,200,-200.0
132,200,-200.0
133,200,-200.0
134,200,-200.0
135,200,-200.0
136,165,-165.0
137,200,-200.0
138,200,-200.0
139,200,-200.0
140,200,-200.0
141,143,-143.0
142,200,-200.0
143,200,-200.0
144,200,-200.0
145,198,-198.0
146,200,-200.0
147,200,-200.0
148,200,-200.0
149,164,-164.0
150,200,-200.0
151,200,-200.0
152,200,-200.0
153,200,-200.0
154,200,-200.0
155,200,-200.0
156,169,-169.0
157,155,-155.0
158,200,-200.0
159,200,-200.0
160,181,-181.0
161,200,-200.0
162,200,-200.0
163,200,-200.0
164,200,-200.0
165,200,-200.0
166,153,-153.0
167,177,-177.0
168,200,-200.0
169,200,-200.0
170,143,-143.0
171,177,-177.0
172,200,-200.0
173,200,-200.0
174,200,-200.0
175,199,-199.0
176,200,-200.0
177,200,-200.0
178,141,-141.0
179,200,-200.0
180,143,-143.0
181,200,-200.0
182,200,-200.0
183,200,-200.0
184,200,-200.0
185,152,-152.0
186,200,-200.0
187,189,-189.0
188,200,-200.0
189,200,-200.0
190,200,-200.0
191,200,-200.0
192,179,-179.0
193,159,-159.0
194,149,-149.0
195,200,-200.0
196,160,-160.0
197,200,-200.0
198,143,-143.0
199,200,-200.0
200,200,-200.0
201,133,-133.0
202,200,-200.0
203,151,-151.0
204,169,-169.0
205,200,-200.0
206,200,-200.0
207,138,-138.0
208,200,-200.0
209,166,-166.0
210,200,-200.0
211,200,-200.0
212,200,-200.0
213,149,-149.0
214,87,-87.0
215,148,-148.0
216,200,-200.0
217,174,-174.0
218,200,-200.0
219,183,-183.0
220,169,-169.0
221,159,-159.0
222,146,-146.0
223,142,-142.0
224,88,-88.0
225,200,-200.0
226,155,-155.0
227,200,-200.0
228,148,-148.0
229,178,-178.0
230,117,-117.0
231,200,-200.0
232,117,-117.0
233,147,-147.0
234,111,-111.0
235,163,-163.0
236,168,-168.0
237,157,-157.0
238,110,-110.0
239,152,-152.0
240,117,-117.0
241,164,-164.0
242,132,-132.0
243,122,-122.0
244,140,-140.0
245,150,-150.0
246,149,-149.0
247,112,-112.0
248,154,-154.0
249,153,-153.0
250,134,-134.0
251,152,-152.0
252,87,-87.0
253,162,-162.0
254,149,-149.0
255,150,-150.0
256,144,-144.0
257,152,-152.0
258,166,-166.0
259,147,-147.0
260,112,-112.0
261,154,-154.0
262,133,-133.0
263,124,-124.0
264,200,-200.0
265,154,-154.0
266,153,-153.0
267,166,-166.0
268,183,-183.0
269,116,-116.0
270,119,-119.0
271,161,-161.0
272,159,-159.0
273,180,-180.0
274,200,-200.0
275,163,-163.0
276,149,-149.0
277,155,-155.0
278,139,-139.0
279,135,-135.0
280,200,-200.0
281,181,-181.0
282,172,-172.0
283,153,-153.0
284,147,-147.0
285,155,-155.0
286,154,-154.0
287,108,-108.0
288,171,-171.0
289,180,-180.0
290,164,-164.0
291,124,-124.0
292,174,-174.0
293,150,-150.0
294,161,-161.0
295,94,-94.0
296,138,-138.0
297,170,-170.0
298,141,-141.0
299,146,-146.0
300,148,-148.0
301,145,-145.0
302,142,-142.0
303,107,-107.0
304,113,-113.0
305,153,-153.0
306,84,-84.0
307,114,-114.0
308,93,-93.0
309,149,-149.0
310,137,-137.0
311,155,-155.0
312,169,-169.0
313,149,-149.0
314,158,-158.0
315,91,-91.0
316,144,-144.0
317,155,-155.0
318,148,-148.0
319,158,-158.0
320,115,-115.0
321,144,-144.0
322,171,-171.0
323,180,-180.0
324,183,-183.0
325,102,-102.0
326,189,-189.0
327,116,-116.0
328,151,-151.0
329,167,-167.0
330,147,-147.0
331,163,-163.0
332,163,-163.0
333,165,-165.0
334,143,-143.0
335,152,-152.0
336,147,-147.0
337,121,-121.0
338,116,-116.0
339,157,-157.0
340,169,-169.0
341,136,-136.0
342,168,-168.0
343,151,-151.0
344,180,-180.0
345,92,-92.0
346,125,-125.0
347,143,-143.0
348,143,-143.0
349,148,-148.0
350,148,-148.0
351,146,-146.0
352,84,-84.0
353,178,-178.0
354,150,-150.0
355,134,-134.0
356,152,-152.0
357,148,-148.0
358,151,-151.0
359,150,-150.0
360,149,-149.0
361,179,-179.0
362,87,-87.0
363,146,-146.0
364,153,-153.0
365,163,-163.0
366,150,-150.0
367,200,-200.0
368,141,-141.0
369,200,-200.0
370,144,-144.0
371,156,-156.0
372,134,-134.0
373,144,-144.0
374,163,-163.0
375,156,-156.0
376,149,-149.0
377,148,-148.0
378,133,-133.0
379,136,-136.0
380,109,-109.0
381,147,-147.0
382,152,-152.0
383,133,-133.0
384,135,-135.0
385,134,-134.0
386,131,-131.0
387,192,-192.0
388,110,-110.0
389,105,-105.0
390,141,-141.0
391,146,-146.0
392,135,-135.0
393,152,-152.0
394,133,-133.0
395,136,-136.0
396,127,-127.0
397,84,-84.0
398,142,-142.0
399,144,-144.0
400,172,-172.0
401,119,-119.0
402,162,-162.0
403,112,-112.0
404,164,-164.0
405,140,-140.0
406,143,-143.0
407,143,-143.0
408,114,-114.0
409,101,-101.0
410,113,-113.0
411,115,-115.0
412,125,-125.0
413,86,-86.0
414,108,-108.0
415,110,-110.0
416,114,-114.0
417,139,-139.0
418,189,-189.0
419,110,-110.0
420,109,-109.0
421,84,-84.0
422,114,-114.0
423,108,-108.0
424,139,-139.0
425,157,-157.0
426,131,-131.0
427,117,-117.0
428,133,-133.0
429,168,-168.0
430,164,-164.0
431,164,-164.0
432,198,-198.0
433,108,-108.0
434,141,-141.0
435,152,-152.0
436,163,-163.0
437,112,-112.0
438,154,-154.0
439,168,-168.0
440,151,-151.0
441,152,-152.0
442,90,-90.0
443,84,-84.0
444,173,-173.0
445,86,-86.0
446,169,-169.0
447,147,-147.0
448,96,-96.0
449,87,-87.0
450,103,-103.0
451,200,-200.0
452,96,-96.0
453,138,-138.0
454,96,-96.0
455,152,-152.0
456,153,-153.0
457,144,-144.0
458,143,-143.0
459,142,-142.0
460,162,-162.0
461,150,-150.0
462,176,-176.0
463,142,-142.0
464,140,-140.0
465,142,-142.0
466,150,-150.0
467,148,-148.0
468,86,-86.0
469,89,-89.0
470,156,-156.0
471,149,-149.0
472,98,-98.0
473,106,-106.0
474,88,-88.0
475,144,-144.0
476,155,-155.0
477,152,-152.0
478,86,-86.0
479,107,-107.0
480,138,-138.0
481,86,-86.0
482,167,-167.0
483,132,-132.0
484,144,-144.0
485,170,-170.0
486,135,-135.0
487,159,-159.0
488,86,-86.0
489,166,-166.0
490,134,-134.0
491,90,-90.0
492,164,-164.0
493,150,-150.0
494,142,-142.0
495,136,-136.0
496,151,-151.0
497,136,-136.0
498,88,-88.0
499,140,-140.0
500,147,-147.0
501,143,-143.0
502,140,-140.0
503,84,-84.0
504,140,-140.0
505,148,-148.0
506,142,-142.0
507,136,-136.0
508,137,-137.0
509,147,-147.0
510,130,-130.0
511,91,-91.0
512,146,-146.0
513,145,-145.0
514,145,-145.0
515,89,-89.0
516,84,-84.0
517,85,-85.0
518,89,-89.0
519,141,-141.0
520,87,-87.0
521,156,-156.0
522,142,-142.0
523,83,-83.0
524,143,-143.0
525,135,-135.0
526,200,-200.0
527,149,-149.0
528,200,-200.0
529,142,-142.0
530,166,-166.0
531,145,-145.0
532,94,-94.0
533,200,-200.0
534,89,-89.0
535,137,-137.0
536,89,-89.0
537,157,-157.0
538,95,-95.0
539,144,-144.0
540,161,-161.0
541,91,-91.0
542,200,-200.0
543,148,-148.0
544,153,-153.0
545,189,-189.0
546,94,-94.0
547,154,-154.0
548,169,-169.0
549,130,-130.0
550,181,-181.0
551,160,-160.0
552,170,-170.0
553,150,-150.0
554,110,-110.0
555,162,-162.0
556,168,-168.0
557,165,-165.0
558,113,-113.0
559,150,-150.0
560,151,-151.0
561,97,-97.0
562,135,-135.0
563,105,-105.0
564,94,-94.0
565,149,-149.0
566,153,-153.0
567,152,-152.0
568,145,-145.0
569,137,-137.0
570,106,-106.0
571,85,-85.0
572,147,-147.0
573,109,-109.0
574,142,-142.0
575,134,-134.0
576,88,-88.0
577,145,-145.0
578,86,-86.0
579,146,-146.0
580,94,-94.0
581,93,-93.0
582,139,-139.0
583,94,-94.0
584,149,-149.0
585,89,-89.0
586,159,-159.0
587,142,-142.0
588,151,-151.0
589,142,-142.0
590,140,-140.0
591,149,-149.0
592,142,-142.0
593,152,-152.0
594,141,-141.0
595,143,-143.0
596,156,-156.0
597,160,-160.0
598,118,-118.0
599,137,-137.0
600,159,-159.0
601,177,-177.0
602,95,-95.0
603,136,-136.0
604,90,-90.0
605,86,-86.0
606,110,-110.0
607,145,-145.0
608,149,-149.0
609,162,-162.0
610,146,-146.0
611,154,-154.0
612,85,-85.0
613,137,-137.0
614,87,-87.0
615,170,-170.0
616,136,-136.0
617,142,-142.0
618,92,-92.0
619,156,-156.0
620,152,-152.0
621,104,-104.0
622,143,-143.0
623,104,-104.0
624,87,-87.0
625,85,-85.0
626,87,-87.0
627,154,-154.0
628,89,-89.0
629,141,-141.0
630,86,-86.0
631,154,-154.0
632,200,-200.0
633,147,-147.0
634,146,-146.0
635,85,-85.0
636,153,-153.0
637,151,-151.0
638,86,-86.0
639,146,-146.0
640,157,-157.0
641,93,-93.0
642,91,-91.0
643,86,-86.0
644,152,-152.0
645,140,-140.0
646,118,-118.0
647,149,-149.0
648,155,-155.0
649,156,-156.0
650,151,-151.0
651,139,-139.0
652,158,-158.0
653,174,-174.0
654,152,-152.0
655,133,-133.0
656,145,-145.0
657,142,-142.0
658,165,-165.0
659,160,-160.0
660,180,-180.0
661,155,-155.0
662,157,-157.0
663,200,-200.0
664,157,-157.0
665,200,-200.0
666,124,-124.0
667,162,-162.0
668,160,-160.0
669,148,-148.0
670,86,-86.0
671,155,-155.0
672,200,-200.0
673,159,-159.0
674,200,-200.0
675,151,-151.0
676,172,-172.0
677,161,-161.0
678,102,-102.0
679,161,-161.0
680,161,-161.0
681,166,-166.0
682,150,-150.0
683,161,-161.0
684,182,-182.0
685,108,-108.0
686,200,-200.0
687,200,-200.0
688,152,-152.0
689,147,-147.0
690,96,-96.0
691,113,-113.0
692,146,-146.0
693,186,-186.0
694,92,-92.0
695,162,-162.0
696,156,-156.0
697,140,-140.0
698,200,-200.0
699,150,-150.0
700,114,-114.0
701,99,-99.0
702,148,-148.0
703,200,-200.0
704,90,-90.0
705,162,-162.0
706,115,-115.0
707,172,-172.0
708,152,-152.0
709,200,-200.0
710,151,-151.0
711,175,-175.0
712,158,-158.0
713,102,-102.0
714,98,-98.0
715,155,-155.0
716,153,-153.0
717,112,-112.0
718,159,-159.0
719,87,-87.0
720,99,-99.0
721,141,-141.0
722,177,-177.0
723,185,-185.0
724,91,-91.0
725,144,-144.0
726,118,-118.0
727,200,-200.0
728,84,-84.0
729,148,-148.0
730,157,-157.0
731,156,-156.0
732,86,-86.0
733,159,-159.0
734,89,-89.0
735,139,-139.0
736,137,-137.0
737,150,-150.0
738,172,-172.0
739,156,-156.0
740,161,-161.0
741,141,-141.0
742,85,-85.0
743,151,-151.0
744,97,-97.0
745,148,-148.0
746,166,-166.0
747,98,-98.0
748,94,-94.0
749,164,-164.0
750,145,-145.0
751,85,-85.0
752,138,-138.0
753,145,-145.0
754,160,-160.0
755,155,-155.0
756,146,-146.0
757,120,-120.0
758,92,-92.0
759,105,-105.0
760,147,-147.0
761,147,-147.0
762,163,-163.0
763,151,-151.0
764,99,-99.0
765,146,-146.0
766,145,-145.0
767,139,-139.0
768,146,-146.0
769,90,-90.0
770,150,-150.0
771,151,-151.0
772,140,-140.0
773,148,-148.0
774,155,-155.0
775,143,-143.0
776,200,-200.0
777,90,-90.0
778,192,-192.0
779,177,-177.0
780,88,-88.0
781,119,-119.0
782,200,-200.0
783,200,-200.0
784,133,-133.0
785,101,-101.0
786,142,-142.0
787,155,-155.0
788,144,-144.0
789,142,-142.0
790,158,-158.0
791,148,-148.0
792,147,-147.0
793,134,-134.0
794,148,-148.0
795,137,-137.0
796,141,-141.0
797,92,-92.0
798,159,-159.0
799,94,-94.0
800,136,-136.0
801,151,-151.0
802,200,-200.0
803,146,-146.0
804,157,-157.0
805,146,-146.0
806,145,-145.0
807,158,-158.0
808,200,-200.0
809,145,-145.0
810,165,-165.0
811,177,-177.0
812,158,-158.0
813,175,-175.0
814,200,-200.0
815,175,-175.0
816,200,-200.0
817,200,-200.0
818,174,-174.0
819,168,-168.0
820,97,-97.0
821,191,-191.0
822,161,-161.0
823,200,-200.0
824,86,-86.0
825,143,-143.0
826,172,-172.0
827,88,-88.0
828,123,-123.0
829,157,-157.0
830,85,-85.0
831,109,-109.0
832,168,-168.0
833,149,-149.0
834,98,-98.0
835,115,-115.0
836,161,-161.0
837,154,-154.0
838,200,-200.0
839,86,-86.0
840,93,-93.0
841,154,-154.0
842,146,-146.0
843,162,-162.0
844,200,-200.0
845,165,-165.0
846,155,-155.0
847,199,-199.0
848,160,-160.0
849,93,-93.0
850,158,-158.0
851,177,-177.0
852,96,-96.0
853,87,-87.0
854,184,-184.0
855,145,-145.0
856,135,-135.0
857,158,-158.0
858,136,-136.0
859,136,-136.0
860,133,-133.0
861,135,-135.0
862,154,-154.0
863,132,-132.0
864,156,-156.0
865,152,-152.0
866,139,-139.0
867,148,-148.0
868,112,-112.0
869,143,-143.0
870,107,-107.0
871,104,-104.0
872,200,-200.0
873,167,-167.0
874,125,-125.0
875,186,-186.0
876,197,-197.0
877,111,-111.0
878,185,-185.0
879,200,-200.0
880,138,-138.0
881,155,-155.0
882,162,-162.0
883,175,-175.0
884,140,-140.0
885,128,-128.0
886,89,-89.0
887,155,-155.0
888,89,-89.0
889,176,-176.0
890,166,-166.0
891,88,-88.0
892,174,-174.0
893,98,-98.0
894,109,-109.0
895,170,-170.0
896,94,-94.0
897,152,-152.0
898,168,-168.0
899,153,-153.0
900,167,-167.0
901,200,-200.0
902,200,-200.0
903,93,-93.0
904,158,-158.0
905,103,-103.0
906,94,-94.0
907,100,-100.0
908,200,-200.0
909,159,-159.0
910,93,-93.0
911,150,-150.0
912,84,-84.0
913,152,-152.0
914,156,-156.0
915,157,-157.0
916,156,-156.0
917,100,-100.0
918,98,-98.0
919,92,-92.0
920,181,-181.0
921,103,-103.0
922,84,-84.0
923,156,-156.0
924,180,-180.0
925,140,-140.0
926,149,-149.0
927,152,-152.0
928,147,-147.0
929,86,-86.0
930,150,-150.0
931,141,-141.0
932,178,-178.0
933,145,-145.0
934,154,-154.0
935,149,-149.0
936,155,-155.0
937,200,-200.0
938,175,-175.0
939,88,-88.0
940,144,-144.0
941,88,-88.0
942,87,-87.0
943,97,-97.0
944,152,-152.0
945,112,-112.0
946,146,-146.0
947,152,-152.0
948,139,-139.0
949,148,-148.0
950,98,-98.0
951,86,-86.0
952,152,-152.0
953,183,-183.0
954,146,-146.0
955,104,-104.0
956,150,-150.0
957,152,-152.0
958,146,-146.0
959,155,-155.0
960,156,-156.0
961,164,-164.0
962,143,-143.0
963,155,-155.0
964,158,-158.0
965,132,-132.0
966,135,-135.0
967,147,-147.0
968,163,-163.0
969,180,-180.0
970,200,-200.0
971,176,-176.0
972,153,-153.0
973,140,-140.0
974,91,-91.0
975,139,-139.0
976,138,-138.0
977,92,-92.0
978,186,-186.0
979,175,-175.0
980,141,-141.0
981,89,-89.0
982,143,-143.0
983,88,-88.0
984,94,-94.0
985,140,-140.0
986,131,-131.0
987,193,-193.0
988,154,-154.0
989,159,-159.0
990,151,-151.0
991,176,-176.0
992,145,-145.0
993,145,-145.0
994,140,-140.0
995,149,-149.0
996,88,-88.0
997,145,-145.0
998,111,-111.0
999,102,-102.0
1000,135,-135.0
1001,168,-168.0
1002,139,-139.0
1003,141,-141.0
1004,156,-156.0
1005,97,-97.0
1006,145,-145.0
1007,168,-168.0
1008,161,-161.0
1009,111,-111.0
1010,152,-152.0
1011,88,-88.0
1012,147,-147.0
1013,162,-162.0
1014,146,-146.0
1015,145,-145.0
1016,146,-146.0
1017,148,-148.0
1018,153,-153.0
1019,152,-152.0
1020,159,-159.0
1021,139,-139.0
1022,156,-156.0
1023,140,-140.0
1024,109,-109.0
1025,180,-180.0
1026,151,-151.0
1027,144,-144.0
1028,87,-87.0
1029,200,-200.0
1030,93,-93.0
1031,140,-140.0
1032,161,-161.0
1033,149,-149.0
1034,151,-151.0
1035,152,-152.0
1036,151,-151.0
1037,88,-88.0
1038,200,-200.0
1039,152,-152.0
1040,145,-145.0
1041,148,-148.0
1042,107,-107.0
1043,94,-94.0
1044,146,-146.0
1045,139,-139.0
1046,141,-141.0
1047,142,-142.0
1048,102,-102.0
1049,167,-167.0
1050,153,-153.0
1051,152,-152.0
1052,114,-114.0
1053,142,-142.0
1054,96,-96.0
1055,147,-147.0
1056,151,-151.0
1057,157,-157.0
1058,89,-89.0
1059,148,-148.0
1060,155,-155.0
1061,165,-165.0
1062,170,-170.0
1063,98,-98.0
1064,148,-148.0
1065,148,-148.0
1066,143,-143.0
1067,94,-94.0
1068,98,-98.0
1069,146,-146.0
1070,200,-200.0
1071,99,-99.0
1072,156,-156.0
1073,155,-155.0
1074,166,-166.0
1075,162,-162.0
1076,160,-160.0
1077,200,-200.0
1078,151,-151.0
1079,146,-146.0
1080,155,-155.0
1081,137,-137.0
1082,92,-92.0
1083,145,-145.0
1084,164,-164.0
1085,127,-127.0
1086,108,-108.0
1087,148,-148.0
1088,98,-98.0
1089,146,-146.0
1090,95,-95.0
1091,95,-95.0
1092,151,-151.0
1093,139,-139.0
1094,200,-200.0
1095,149,-149.0
1096,143,-143.0
1097,85,-85.0
1098,151,-151.0
1099,109,-109.0
1100,85,-85.0
1101,158,-158.0
1102,97,-97.0
1103,144,-144.0
1104,200,-200.0
1105,160,-160.0
1106,157,-157.0
1107,200,-200.0
1108,111,-111.0
1109,159,-159.0
1110,87,-87.0
1111,153,-153.0
1112,200,-200.0
1113,90,-90.0
1114,146,-146.0
1115,154,-154.0
1116,159,-159.0
1117,157,-157.0
1118,200,-200.0
1119,152,-152.0
1120,172,-172.0
1121,168,-168.0
1122,150,-150.0
1123,178,-178.0
1124,141,-141.0
1125,116,-116.0
1126,153,-153.0
1127,187,-187.0
1128,150,-150.0
1129,169,-169.0
1130,107,-107.0
1131,161,-161.0
1132,192,-192.0
1133,146,-146.0
1134,108,-108.0
1135,200,-200.0
1136,155,-155.0
1137,176,-176.0
1138,121,-121.0
1139,113,-113.0
1140,116,-116.0
1141,91,-91.0
1142,91,-91.0
1143,109,-109.0
1144,150,-150.0
1145,148,-148.0
1146,137,-137.0
1147,152,-152.0
1148,146,-146.0
1149,96,-96.0
1150,112,-112.0
1151,147,-147.0
1152,119,-119.0
1153,178,-178.0
1154,160,-160.0
1155,156,-156.0
1156,141,-141.0
1157,152,-152.0
1158,147,-147.0
1159,148,-148.0
1160,125,-125.0
1161,165,-165.0
1162,149,-149.0
1163,141,-141.0
1164,100,-100.0
1165,143,-143.0
1166,150,-150.0
1167,166,-166.0
1168,172,-172.0
1169,140,-140.0
1170,111,-111.0
1171,184,-184.0
1172,145,-145.0
1173,200,-200.0
1174,140,-140.0
1175,149,-149.0
1176,89,-89.0
1177,145,-145.0
1178,181,-181.0
1179,144,-144.0
1180,140,-140.0
1181,151,-151.0
1182,200,-200.0
1183,152,-152.0
1184,95,-95.0
1185,157,-157.0
1186,149,-149.0
1187,156,-156.0
1188,159,-159.0
1189,145,-145.0
1190,151,-151.0
1191,127,-127.0
1192,89,-89.0
1193,150,-150.0
1194,143,-143.0
1195,163,-163.0
1196,200,-200.0
1197,200,-200.0
1198,84,-84.0
1199,143,-143.0
1200,144,-144.0
1201,200,-200.0
1202,200,-200.0
1203,200,-200.0
1204,200,-200.0
1205,200,-200.0
1206,200,-200.0
1207,200,-200.0
1208,200,-200.0
1209,200,-200.0
1210,200,-200.0
1211,200,-200.0
1212,200,-200.0
1213,200,-200.0
1214,200,-200.0
1215,200,-200.0
1216,200,-200.0
1217,200,-200.0
1218,200,-200.0
1219,200,-200.0
1220,200,-200.0
1221,200,-200.0
1222,200,-200.0
1223,200,-200.0
1224,200,-200.0
1225,200,-200.0
1226,200,-200.0
1227,200,-200.0
1228,200,-200.0
1229,151,-151.0
1230,183,-183.0
1231,200,-200.0
1232,200,-200.0
1233,155,-155.0
1234,200,-200.0
1235,184,-184.0
1236,152,-152.0
1237,134,-134.0
1238,163,-163.0
1239,135,-135.0
1240,130,-130.0
1241,118,-118.0
1242,200,-200.0
1243,132,-132.0
1244,200,-200.0
1245,159,-159.0
1246,200,-200.0
1247,179,-179.0
1248,134,-134.0
1249,200,-200.0
1250,200,-200.0
1251,173,-173.0
1252,200,-200.0
1253,113,-113.0
1254,125,-125.0
1255,123,-123.0
1256,200,-200.0
1257,112,-112.0
1258,160,-160.0
1259,167,-167.0
1260,191,-191.0
1261,170,-170.0
1262,171,-171.0
1263,200,-200.0
1264,175,-175.0
1265,178,-178.0
1266,115,-115.0
1267,178,-178.0
1268,169,-169.0
1269,115,-115.0
1270,162,-162.0
1271,158,-158.0
1272,120,-120.0
1273,134,-134.0
1274,94,-94.0
1275,125,-125.0
1276,137,-137.0
1277,189,-189.0
1278,192,-192.0
1279,120,-120.0
1280,119,-119.0
1281,155,-155.0
1282,145,-145.0
1283,134,-134.0
1284,165,-165.0
1285,200,-200.0
1286,158,-158.0
1287,165,-165.0
1288,146,-146.0
1289,109,-109.0
1290,160,-160.0
1291,200,-200.0
1292,161,-161.0
1293,157,-157.0
1294,159,-159.0
1295,123,-123.0
1296,128,-128.0
1297,141,-141.0
1298,169,-169.0
1299,121,-121.0
1300,96,-96.0
1301,97,-97.0
1302,146,-146.0
1303,124,-124.0
1304,179,-179.0
1305,162,-162.0
1306,159,-159.0
1307,130,-130.0
1308,160,-160.0
1309,150,-150.0
1310,157,-157.0
1311,160,-160.0
1312,152,-152.0
1313,200,-200.0
1314,152,-152.0
1315,89,-89.0
1316,177,-177.0
1317,129,-129.0
1318,88,-88.0
1319,93,-93.0
1320,161,-161.0
1321,96,-96.0
1322,88,-88.0
1323,144,-144.0
1324,158,-158.0
1325,158,-158.0
1326,176,-176.0
1327,150,-150.0
1328,168,-168.0
1329,138,-138.0
1330,116,-116.0
1331,144,-144.0
1332,159,-159.0
1333,137,-137.0
1334,148,-148.0
1335,90,-90.0
1336,141,-141.0
1337,139,-139.0
1338,136,-136.0
1339,138,-138.0
1340,162,-162.0
1341,136,-136.0
1342,87,-87.0
1343,165,-165.0
1344,129,-129.0
1345,125,-125.0
1346,98,-98.0
1347,163,-163.0
1348,136,-136.0
1349,153,-153.0
1350,154,-154.0
1351,157,-157.0
1352,167,-167.0
1353,112,-112.0
1354,159,-159.0
1355,167,-167.0
1356,158,-158.0
1357,161,-161.0
1358,134,-134.0
1359,150,-150.0
1360,148,-148.0
1361,180,-180.0
1362,151,-151.0
1363,150,-150.0
1364,147,-147.0
1365,147,-147.0
1366,158,-158.0
1367,95,-95.0
1368,111,-111.0
1369,135,-135.0
1370,90,-90.0
1371,92,-92.0
1372,101,-101.0
1373,156,-156.0
1374,155,-155.0
1375,161,-161.0
1376,194,-194.0
1377,147,-147.0
1378,98,-98.0
1379,177,-177.0
1380,158,-158.0
1381,149,-149.0
1382,154,-154.0
1383,116,-116.0
1384,164,-164.0
1385,137,-137.0
1386,148,-148.0
1387,148,-148.0
1388,97,-97.0
1389,146,-146.0
1390,154,-154.0
1391,200,-200.0
1392,161,-161.0
1393,145,-145.0
1394,151,-151.0
1395,144,-144.0
1396,110,-110.0
1397,113,-113.0
1398,147,-147.0
1399,163,-163.0
1400,144,-144.0
1401,169,-169.0
1402,165,-165.0
1403,200,-200.0
1404,173,-173.0
1405,93,-93.0
1406,160,-160.0
1407,200,-200.0
1408,87,-87.0
1409,111,-111.0
1410,155,-155.0
1411,200,-200.0
1412,200,-200.0
1413,147,-147.0
1414,127,-127.0
1415,200,-200.0
1416,131,-131.0
1417,200,-200.0
1418,144,-144.0
1419,200,-200.0
1420,110,-110.0
1421,200,-200.0
1422,177,-177.0
1423,89,-89.0
1424,102,-102.0
1425,167,-167.0
1426,167,-167.0
1427,154,-154.0
1428,166,-166.0
1429,147,-147.0
1430,165,-165.0
1431,171,-171.0
1432,160,-160.0
1433,171,-171.0
1434,166,-166.0
1435,200,-200.0
1436,172,-172.0
1437,161,-161.0
1438,161,-161.0
1439,162,-162.0
1440,172,-172.0
1441,166,-166.0
1442,152,-152.0
1443,160,-160.0
1444,107,-107.0
1445,176,-176.0
1446,179,-179.0
1447,109,-109.0
1448,170,-170.0
1449,88,-88.0
1450,156,-156.0
1451,196,-196.0
1452,200,-200.0
1453,143,-143.0
1454,173,-173.0
1455,157,-157.0
1456,165,-165.0
1457,173,-173.0
1458,200,-200.0
1459,151,-151.0
1460,166,-166.0
1461,150,-150.0
1462,158,-158.0
1463,90,-90.0
1464,103,-103.0
1465,93,-93.0
1466,102,-102.0
1467,90,-90.0
1468,183,-183.0
1469,139,-139.0
1470,158,-158.0
1471,200,-200.0
1472,135,-135.0
1473,142,-142.0
1474,148,-148.0
1475,125,-125.0
1476,154,-154.0
1477,149,-149.0
1478,155,-155.0
1479,173,-173.0
1480,155,-155.0
1481,144,-144.0
1482,149,-149.0
1483,179,-179.0
1484,138,-138.0
1485,134,-134.0
1486,163,-163.0
1487,94,-94.0
1488,116,-116.0
1489,140,-140.0
1490,116,-116.0
1491,106,-106.0
1492,95,-95.0
1493,176,-176.0
1494,109,-109.0
1495,159,-159.0
1496,115,-115.0
1497,114,-114.0
1498,150,-150.0
1499,163,-163.0
1500,136,-136.0
1501,142,-142.0
1502,137,-137.0
1503,91,-91.0
1504,128,-128.0
1505,129,-129.0
1506,91,-91.0
1507,146,-146.0
1508,178,-178.0
1509,173,-173.0
1510,151,-151.0
1511,89,-89.0
1512,172,-172.0
1513,145,-145.0
1514,161,-161.0
1515,189,-189.0
1516,166,-166.0
1517,166,-166.0
1518,158,-158.0
1519,131,-131.0
1520,113,-113.0
1521,155,-155.0
1522,180,-180.0
1523,157,-157.0
1524,146,-146.0
1525,114,-114.0
1526,197,-197.0
1527,147,-147.0
1528,146,-146.0
1529,171,-171.0
1530,150,-150.0
1531,94,-94.0
1532,170,-170.0
1533,195,-195.0
1534,165,-165.0
1535,145,-145.0
1536,147,-147.0
1537,184,-184.0
1538,151,-151.0
1539,163,-163.0
1540,156,-156.0
1541,111,-111.0
1542,104,-104.0
1543,119,-119.0
1544,114,-114.0
1545,177,-177.0
1546,95,-95.0
1547,141,-141.0
1548,155,-155.0
1549,99,-99.0
1550,118,-118.0
1551,90,-90.0
1552,139,-139.0
1553,94,-94.0
1554,145,-145.0
1555,154,-154.0
1556,151,-151.0
1557,107,-107.0
1558,96,-96.0
1559,150,-150.0
1560,146,-146.0
1561,198,-198.0
1562,167,-167.0
1563,157,-157.0
1564,148,-148.0
1565,148,-148.0
1566,151,-151.0
1567,150,-150.0
1568,194,-194.0
1569,141,-141.0
1570,86,-86.0
1571,153,-153.0
1572,168,-168.0
1573,172,-172.0
1574,146,-146.0
1575,158,-158.0
1576,174,-174.0
1577,102,-102.0
1578,155,-155.0
1579,163,-163.0
1580,180,-180.0
1581,159,-159.0
1582,153,-153.0
1583,110,-110.0
1584,164,-164.0
1585,120,-120.0
1586,137,-137.0
1587,150,-150.0
1588,96,-96.0
1589,161,-161.0
1590,95,-95.0
1591,104,-104.0
1592,153,-153.0
1593,170,-170.0
1594,148,-148.0
1595,99,-99.0
1596,151,-151.0
1597,158,-158.0
1598,134,-134.0
1599,93,-93.0
1600,154,-154.0
1601,180,-180.0
1602,142,-142.0
1603,152,-152.0
1604,151,-151.0
1605,149,-149.0
1606,150,-150.0
1607,126,-126.0
1608,100,-100.0
1609,159,-159.0
1610,149,-149.0
1611,173,-173.0
1612,156,-156.0
1613,157,-157.0
1614,89,-89.0
1615,114,-114.0
1616,92,-92.0
1617,93,-93.0
1618,112,-112.0
1619,175,-175.0
1620,200,-200.0
1621,160,-160.0
1622,117,-117.0
1623,105,-105.0
1624,157,-157.0
1625,157,-157.0
1626,151,-151.0
1627,159,-159.0
1628,148,-148.0
1629,117,-117.0
1630,170,-170.0
1631,91,-91.0
1632,84,-84.0
1633,155,-155.0
1634,90,-90.0
1635,188,-188.0
1636,156,-156.0
1637,121,-121.0
1638,120,-120.0
1639,148,-148.0
1640,161,-161.0
1641,97,-97.0
1642,165,-165.0
1643,146,-146.0
1644,138,-138.0
1645,148,-148.0
1646,100,-100.0
1647,149,-149.0
1648,148,-148.0
1649,87,-87.0
1650,87,-87.0
1651,152,-152.0
1652,158,-158.0
1653,87,-87.0
1654,147,-147.0
1655,150,-150.0
1656,85,-85.0
1657,150,-150.0
1658,151,-151.0
1659,95,-95.0
1660,152,-152.0
1661,143,-143.0
1662,166,-166.0
1663,155,-155.0
1664,149,-149.0
1665,85,-85.0
1666,154,-154.0
1667,97,-97.0
1668,148,-148.0
1669,145,-145.0
1670,92,-92.0
1671,108,-108.0
1672,153,-153.0
1673,149,-149.0
1674,144,-144.0
1675,153,-153.0
1676,140,-140.0
1677,85,-85.0
1678,146,-146.0
1679,96,-96.0
1680,85,-85.0
1681,152,-152.0
1682,146,-146.0
1683,145,-145.0
1684,157,-157.0
1685,147,-147.0
1686,134,-134.0
1687,164,-164.0
1688,139,-139.0
1689,137,-137.0
1690,176,-176.0
1691,116,-116.0
1692,106,-106.0
1693,144,-144.0
1694,115,-115.0
1695,146,-146.0
1696,118,-118.0
1697,176,-176.0
1698,139,-139.0
1699,113,-113.0
1700,149,-149.0
1701,139,-139.0
1702,142,-142.0
1703,151,-151.0
1704,159,-159.0
1705,154,-154.0
1706,145,-145.0
1707,156,-156.0
1708,110,-110.0
1709,88,-88.0
1710,163,-163.0
1711,173,-173.0
1712,92,-92.0
1713,100,-100.0
1714,154,-154.0
1715,108,-108.0
1716,88,-88.0
1717,90,-90.0
1718,161,-161.0
1719,162,-162.0
1720,144,-144.0
1721,170,-170.0
1722,178,-178.0
1723,114,-114.0
1724,146,-146.0
1725,87,-87.0
1726,110,-110.0
1727,157,-157.0
1728,147,-147.0
1729,154,-154.0
1730,119,-119.0
1731,176,-176.0
1732,90,-90.0
1733,118,-118.0
1734,115,-115.0
1735,141,-141.0
1736,120,-120.0
1737,156,-156.0
1738,112,-112.0
1739,145,-145.0
1740,116,-116.0
1741,159,-159.0
1742,160,-160.0
1743,114,-114.0
1744,96,-96.0
1745,140,-140.0
1746,144,-144.0
1747,140,-140.0
1748,147,-147.0
1749,140,-140.0
1750,200,-200.0
1751,99,-99.0
1752,88,-88.0
1753,155,-155.0
1754,161,-161.0
1755,93,-93.0
1756,150,-150.0
1757,164,-164.0
1758,167,-167.0
1759,94,-94.0
1760,104,-104.0
1761,116,-116.0
1762,200,-200.0
1763,175,-175.0
1764,99,-99.0
1765,153,-153.0
1766,115,-115.0
1767,147,-147.0
1768,116,-116.0
1769,123,-123.0
1770,98,-98.0
1771,151,-151.0
1772,98,-98.0
1773,85,-85.0
1774,88,-88.0
1775,87,-87.0
1776,117,-117.0
1777,145,-145.0
1778,94,-94.0
1779,149,-149.0
1780,151,-151.0
1781,88,-88.0
1782,123,-123.0
1783,155,-155.0
1784,85,-85.0
1785,132,-132.0
1786,109,-109.0
1787,85,-85.0
1788,126,-126.0
1789,122,-122.0
1790,86,-86.0
1791,127,-127.0
1792,124,-124.0
1793,143,-143.0
1794,88,-88.0
1795,158,-158.0
1796,151,-151.0
1797,113,-113.0
1798,87,-87.0
1799,185,-185.0
1800,118,-118.0
1801,101,-101.0
1802,87,-87.0
1803,200,-200.0
1804,139,-139.0
1805,93,-93.0
1806,161,-161.0
1807,147,-147.0
1808,144,-144.0
1809,150,-150.0
1810,165,-165.0
1811,124,-124.0
1812,158,-158.0
1813,160,-160.0
1814,176,-176.0
1815,92,-92.0
1816,94,-94.0
1817,89,-89.0
1818,178,-178.0
1819,157,-157.0
1820,141,-141.0
1821,178,-178.0
1822,141,-141.0
1823,200,-200.0
1824,157,-157.0
1825,135,-135.0
1826,85,-85.0
1827,172,-172.0
1828,116,-116.0
1829,200,-200.0
1830,146,-146.0
1831,150,-150.0
1832,170,-170.0
1833,153,-153.0
1834,157,-157.0
1835,169,-169.0
1836,99,-99.0
1837,146,-146.0
1838,200,-200.0
1839,200,-200.0
1840,161,-161.0
1841,141,-141.0
1842,146,-146.0
1843,143,-143.0
1844,159,-159.0
1845,141,-141.0
1846,152,-152.0
1847,200,-200.0
1848,160,-160.0
1849,152,-152.0
1850,199,-199.0
1851,157,-157.0
1852,200,-200.0
1853,167,-167.0
1854,200,-200.0
1855,140,-140.0
1856,200,-200.0
1857,200,-200.0
1858,148,-148.0
1859,94,-94.0
1860,145,-145.0
1861,200,-200.0
1862,86,-86.0
1863,84,-84.0
1864,152,-152.0
1865,113,-113.0
1866,174,-174.0
1867,144,-144.0
1868,94,-94.0
1869,167,-167.0
1870,176,-176.0
1871,149,-149.0
1872,200,-200.0
1873,200,-200.0
1874,155,-155.0
1875,157,-157.0
1876,167,-167.0
1877,94,-94.0
1878,160,-160.0
1879,158,-158.0
1880,97,-97.0
1881,171,-171.0
1882,130,-130.0
1883,95,-95.0
1884,164,-164.0
1885,164,-164.0
1886,149,-149.0
1887,174,-174.0
1888,109,-109.0
1889,200,-200.0
1890,123,-123.0
1891,96,-96.0
1892,200,-200.0
1893,161,-161.0
1894,141,-141.0
1895,171,-171.0
1896,121,-121.0
1897,90,-90.0
1898,155,-155.0
1899,200,-200.0
1900,200,-200.0
1901,116,-116.0
1902,95,-95.0
1903,200,-200.0
1904,86,-86.0
1905,94,-94.0
1906,176,-176.0
1907,132,-132.0
1908,174,-174.0
1909,137,-137.0
1910,146,-146.0
1911,162,-162.0
1912,85,-85.0
1913,153,-153.0
1914,174,-174.0
1915,134,-134.0
1916,149,-149.0
1917,155,-155.0
1918,120,-120.0
1919,143,-143.0
1920,183,-183.0
1921,112,-112.0
1922,182,-182.0
1923,117,-117.0
1924,114,-114.0
1925,117,-117.0
1926,167,-167.0
1927,92,-92.0
1928,182,-182.0
1929,88,-88.0
1930,89,-89.0
1931,87,-87.0
1932,119,-119.0
1933,158,-158.0
1934,108,-108.0
1935,99,-99.0
1936,151,-151.0
1937,96,-96.0
1938,115,-115.0
1939,88,-88.0
1940,113,-113.0
1941,146,-146.0
1942,158,-158.0
1943,171,-171.0
1944,100,-100.0
1945,157,-157.0
1946,151,-151.0
1947,91,-91.0
1948,91,-91.0
1949,109,-109.0
1950,147,-147.0
1951,152,-152.0
1952,154,-154.0
1953,165,-165.0
1954,163,-163.0
1955,108,-108.0
1956,142,-142.0
1957,138,-138.0
1958,175,-175.0
1959,92,-92.0
1960,85,-85.0
1961,160,-160.0
1962,99,-99.0
1963,138,-138.0
1964,186,-186.0
1965,123,-123.0
1966,159,-159.0
1967,129,-129.0
1968,139,-139.0
1969,154,-154.0
1970,98,-98.0
1971,140,-140.0
1972,127,-127.0
1973,186,-186.0
1974,104,-104.0
1975,166,-166.0
1976,200,-200.0
1977,135,-135.0
1978,128,-128.0
1979,136,-136.0
1980,157,-157.0
1981,108,-108.0
1982,91,-91.0
1983,200,-200.0
1984,182,-182.0
1985,149,-149.0
1986,161,-161.0
1987,164,-164.0
1988,161,-161.0
1989,159,-159.0
1990,173,-173.0
1991,90,-90.0
1992,156,-156.0
1993,148,-148.0
1994,147,-147.0
1995,166,-166.0
1996,150,-150.0
1997,168,-168.0
1998,162,-162.0
1999,154,-154.0
2000,163,-163.0
2001,127,-127.0
2002,155,-155.0
2003,186,-186.0
2004,157,-157.0
2005,86,-86.0
2006,157,-157.0
2007,154,-154.0
2008,86,-86.0
2009,157,-157.0
2010,153,-153.0
2011,142,-142.0
2012,87,-87.0
2013,171,-171.0
2014,158,-158.0
2015,89,-89.0
2016,161,-161.0
2017,144,-144.0
2018,163,-163.0
2019,115,-115.0
2020,94,-94.0
2021,162,-162.0
2022,161,-161.0
2023,95,-95.0
2024,173,-173.0
2025,171,-171.0
2026,95,-95.0
2027,90,-90.0
2028,158,-158.0
2029,161,-161.0
2030,93,-93.0
2031,162,-162.0
2032,157,-157.0
2033,170,-170.0
2034,190,-190.0
2035,154,-154.0
2036,109,-109.0
2037,87,-87.0
2038,102,-102.0
2039,117,-117.0
2040,110,-110.0
2041,157,-157.0
2042,151,-151.0
2043,86,-86.0
2044,156,-156.0
2045,91,-91.0
2046,152,-152.0
2047,154,-154.0
2048,146,-146.0
2049,89,-89.0
2050,143,-143.0
2051,90,-90.0
2052,85,-85.0
2053,144,-144.0
2054,165,-165.0
2055,154,-154.0
2056,152,-152.0
2057,155,-155.0
2058,163,-163.0
2059,160,-160.0
2060,159,-159.0
2061,179,-179.0
2062,145,-145.0
2063,149,-149.0
2064,95,-95.0
2065,154,-154.0
2066,84,-84.0
2067,90,-90.0
2068,156,-156.0
2069,155,-155.0
2070,158,-158.0
2071,93,-93.0
2072,147,-147.0
2073,147,-147.0
2074,92,-92.0
2075,160,-160.0
2076,85,-85.0
2077,85,-85.0
2078,151,-151.0
2079,147,-147.0
2080,147,-147.0
2081,148,-148.0
2082,150,-150.0
2083,91,-91.0
2084,117,-117.0
2085,151,-151.0
2086,159,-159.0
2087,151,-151.0
2088,183,-183.0
2089,171,-171.0
2090,168,-168.0
2091,166,-166.0
2092,161,-161.0
2093,146,-146.0
2094,148,-148.0
2095,159,-159.0
2096,151,-151.0
2097,185,-185.0
2098,150,-150.0
2099,166,-166.0
2100,200,-200.0
2101,153,-153.0
2102,104,-104.0
2103,86,-86.0
2104,151,-151.0
2105,158,-158.0
2106,172,-172.0
2107,147,-147.0
2108,89,-89.0
2109,85,-85.0
2110,101,-101.0
2111,153,-153.0
2112,168,-168.0
2113,149,-149.0
2114,87,-87.0
2115,126,-126.0
2116,156,-156.0
2117,143,-143.0
2118,85,-85.0
2119,165,-165.0
2120,145,-145.0
2121,151,-151.0
2122,165,-165.0
2123,171,-171.0
2124,168,-168.0
2125,157,-157.0
2126,147,-147.0
2127,154,-154.0
2128,151,-151.0
2129,200,-200.0
2130,179,-179.0
2131,183,-183.0
2132,148,-148.0
2133,88,-88.0
2134,149,-149.0
2135,95,-95.0
2136,156,-156.0
2137,94,-94.0
2138,85,-85.0
2139,89,-89.0
2140,91,-91.0
2141,117,-117.0
2142,157,-157.0
2143,85,-85.0
2144,156,-156.0
2145,86,-86.0
2146,95,-95.0
2147,86,-86.0
2148,87,-87.0
2149,173,-173.0
2150,157,-157.0
2151,150,-150.0
2152,97,-97.0
2153,145,-145.0
2154,102,-102.0
2155,186,-186.0
2156,106,-106.0
2157,155,-155.0
2158,159,-159.0
2159,150,-150.0
2160,85,-85.0
2161,85,-85.0
2162,155,-155.0
2163,152,-152.0
2164,107,-107.0
2165,87,-87.0
2166,148,-148.0
2167,200,-200.0
2168,92,-92.0
2169,85,-85.0
2170,159,-159.0
2171,159,-159.0
2172,146,-146.0
2173,148,-148.0
2174,97,-97.0
2175,151,-151.0
2176,178,-178.0
2177,84,-84.0
2178,87,-87.0
2179,148,-148.0
2180,184,-184.0
2181,155,-155.0
2182,84,-84.0
2183,143,-143.0
2184,91,-91.0
2185,88,-88.0
2186,148,-148.0
2187,88,-88.0
2188,114,-114.0
2189,149,-149.0
2190,96,-96.0
2191,156,-156.0
2192,87,-87.0
2193,200,-200.0
2194,146,-146.0
2195,84,-84.0
2196,147,-147.0
2197,93,-93.0
2198,147,-147.0
2199,93,-93.0
2200,147,-147.0
2201,150,-150.0
2202,84,-84.0
2203,162,-162.0
2204,149,-149.0
2205,174,-174.0
2206,147,-147.0
2207,143,-143.0
2208,145,-145.0
2209,85,-85.0
2210,95,-95.0
2211,90,-90.0
2212,85,-85.0
2213,92,-92.0
2214,145,-145.0
2215,150,-150.0
2216,98,-98.0
2217,86,-86.0
2218,178,-178.0
2219,96,-96.0
2220,151,-151.0
2221,147,-147.0
2222,92,-92.0
2223,200,-200.0
2224,103,-103.0
2225,152,-152.0
2226,90,-90.0
2227,154,-154.0
2228,164,-164.0
2229,85,-85.0
2230,83,-83.0
2231,90,-90.0
2232,152,-152.0
2233,86,-86.0
2234,148,-148.0
2235,154,-154.0
2236,86,-86.0
2237,89,-89.0
2238,95,-95.0
2239,146,-146.0
2240,161,-161.0
2241,90,-90.0
2242,159,-159.0
2243,145,-145.0
2244,158,-158.0
2245,92,-92.0
2246,109,-109.0
2247,103,-103.0
2248,88,-88.0
2249,141,-141.0
2250,149,-149.0
2251,158,-158.0
2252,148,-148.0
2253,147,-147.0
2254,114,-114.0
2255,200,-200.0
2256,146,-146.0
2257,151,-151.0
2258,139,-139.0
2259,86,-86.0
2260,153,-153.0
2261,168,-168.0
2262,90,-90.0
2263,124,-124.0
2264,87,-87.0
2265,151,-151.0
2266,151,-151.0
2267,155,-155.0
2268,163,-163.0
2269,83,-83.0
2270,142,-142.0
2271,145,-145.0
2272,170,-170.0
2273,147,-147.0
2274,141,-141.0
2275,142,-142.0
2276,150,-150.0
2277,145,-145.0
2278,145,-145.0
2279,86,-86.0
2280,150,-150.0
2281,143,-143.0
2282,140,-140.0
2283,140,-140.0
2284,147,-147.0
2285,149,-149.0
2286,163,-163.0
2287,92,-92.0
2288,91,-91.0
2289,87,-87.0
2290,91,-91.0
2291,159,-159.0
2292,168,-168.0
2293,156,-156.0
2294,169,-169.0
2295,153,-153.0
2296,142,-142.0
2297,175,-175.0
2298,151,-151.0
2299,146,-146.0
2300,93,-93.0
2301,181,-181.0
2302,84,-84.0
2303,200,-200.0
2304,148,-148.0
2305,200,-200.0
2306,155,-155.0
2307,84,-84.0
2308,162,-162.0
2309,157,-157.0
2310,98,-98.0
2311,151,-151.0
2312,109,-109.0
2313,152,-152.0
2314,145,-145.0
2315,158,-158.0
2316,140,-140.0
2317,153,-153.0
2318,150,-150.0
2319,143,-143.0
2320,147,-147.0
2321,156,-156.0
2322,149,-149.0
2323,162,-162.0
2324,152,-152.0
2325,148,-148.0
2326,153,-153.0
2327,168,-168.0
2328,149,-149.0
2329,149,-149.0
2330,87,-87.0
2331,146,-146.0
2332,155,-155.0
2333,149,-149.0
2334,149,-149.0
2335,180,-180.0
2336,146,-146.0
2337,89,-89.0
2338,157,-157.0
2339,86,-86.0
2340,104,-104.0
2341,150,-150.0
2342,200,-200.0
2343,87,-87.0
2344,200,-200.0
2345,154,-154.0
2346,200,-200.0
2347,161,-161.0
2348,200,-200.0
2349,200,-200.0
2350,148,-148.0
2351,91,-91.0
2352,174,-174.0
2353,91,-91.0
2354,200,-200.0
2355,154,-154.0
2356,169,-169.0
2357,95,-95.0
2358,151,-151.0
2359,85,-85.0
2360,151,-151.0
2361,200,-200.0
2362,111,-111.0
2363,200,-200.0
2364,156,-156.0
2365,159,-159.0
2366,144,-144.0
2367,89,-89.0
2368,200,-200.0
2369,89,-89.0
2370,200,-200.0
2371,162,-162.0
2372,200,-200.0
2373,176,-176.0
2374,98,-98.0
2375,106,-106.0
2376,97,-97.0
2377,113,-113.0
2378,200,-200.0
2379,170,-170.0
2380,154,-154.0
2381,200,-200.0
2382,85,-85.0
2383,200,-200.0
2384,200,-200.0
2385,94,-94.0
2386,200,-200.0
2387,157,-157.0
2388,152,-152.0
2389,88,-88.0
2390,160,-160.0
2391,164,-164.0
2392,115,-115.0
2393,146,-146.0
2394,173,-173.0
2395,146,-146.0
2396,102,-102.0
2397,149,-149.0
2398,166,-166.0
2399,152,-152.0
2400,142,-142.0
2401,95,-95.0
2402,95,-95.0
2403,121,-121.0
2404,200,-200.0
2405,153,-153.0
2406,161,-161.0
2407,104,-104.0
2408,85,-85.0
2409,144,-144.0
2410,152,-152.0
2411,145,-145.0
2412,167,-167.0
2413,162,-162.0
2414,149,-149.0
2415,154,-154.0
2416,150,-150.0
2417,200,-200.0
2418,188,-188.0
2419,151,-151.0
2420,152,-152.0
2421,200,-200.0
2422,86,-86.0
2423,99,-99.0
2424,142,-142.0
2425,200,-200.0
2426,147,-147.0
2427,144,-144.0
2428,92,-92.0
2429,93,-93.0
2430,176,-176.0
2431,85,-85.0
2432,152,-152.0
2433,159,-159.0
2434,96,-96.0
2435,149,-149.0
2436,165,-165.0
2437,200,-200.0
2438,141,-141.0
2439,200,-200.0
2440,156,-156.0
2441,172,-172.0
2442,86,-86.0
2443,200,-200.0
2444,112,-112.0
2445,84,-84.0
2446,84,-84.0
2447,163,-163.0
2448,157,-157.0
2449,158,-158.0
2450,150,-150.0
2451,200,-200.0
2452,145,-145.0
2453,194,-194.0
2454,89,-89.0
2455,87,-87.0
2456,142,-142.0
2457,200,-200.0
2458,142,-142.0
2459,147,-147.0
2460,200,-200.0
2461,92,-92.0
2462,200,-200.0
2463,87,-87.0
2464,146,-146.0
2465,154,-154.0
2466,142,-142.0
2467,149,-149.0
2468,158,-158.0
2469,94,-94.0
2470,160,-160.0
2471,167,-167.0
2472,88,-88.0
2473,106,-106.0
2474,144,-144.0
2475,100,-100.0
2476,159,-159.0
2477,158,-158.0
2478,153,-153.0
2479,176,-176.0
2480,134,-134.0
2481,177,-177.0
2482,147,-147.0
2483,178,-178.0
2484,156,-156.0
2485,155,-155.0
2486,155,-155.0
2487,172,-172.0
2488,148,-148.0
2489,113,-113.0
2490,155,-155.0
2491,164,-164.0
2492,149,-149.0
2493,85,-85.0
2494,88,-88.0
2495,144,-144.0
2496,140,-140.0
2497,134,-134.0
2498,155,-155.0
2499,137,-137.0
2500,178,-178.0
2501,113,-113.0
2502,144,-144.0
2503,97,-97.0
2504,86,-86.0
2505,133,-133.0
2506,91,-91.0
2507,133,-133.0
2508,153,-153.0
2509,150,-150.0
2510,143,-143.0
2511,86,-86.0
2512,160,-160.0
2513,151,-151.0
2514,141,-141.0
2515,95,-95.0
2516,139,-139.0
2517,111,-111.0
2518,131,-131.0
2519,126,-126.0
2520,155,-155.0
2521,133,-133.0
2522,139,-139.0
2523,84,-84.0
2524,139,-139.0
2525,138,-138.0
2526,130,-130.0
2527,131,-131.0
2528,101,-101.0
2529,88,-88.0
2530,149,-149.0
2531,128,-128.0
2532,173,-173.0
2533,87,-87.0
2534,159,-159.0
2535,89,-89.0
2536,161,-161.0
2537,153,-153.0
2538,161,-161.0
2539,154,-154.0
2540,155,-155.0
2541,163,-163.0
2542,187,-187.0
2543,87,-87.0
2544,150,-150.0
2545,92,-92.0
2546,156,-156.0
2547,148,-148.0
2548,141,-141.0
2549,145,-145.0
2550,200,-200.0
2551,88,-88.0
2552,149,-149.0
2553,200,-200.0
2554,149,-149.0
2555,146,-146.0
2556,102,-102.0
2557,108,-108.0
2558,169,-169.0
2559,175,-175.0
2560,152,-152.0
2561,180,-180.0
2562,157,-157.0
2563,146,-146.0
2564,165,-165.0
2565,160,-160.0
2566,156,-156.0
2567,164,-164.0
2568,155,-155.0
2569,167,-167.0
2570,163,-163.0
2571,103,-103.0
2572,110,-110.0
2573,157,-157.0
2574,88,-88.0
2575,95,-95.0
2576,153,-153.0
2577,86,-86.0
2578,142,-142.0
2579,158,-158.0
2580,86,-86.0
2581,200,-200.0
2582,149,-149.0
2583,192,-192.0
2584,149,-149.0
2585,99,-99.0
2586,85,-85.0
2587,200,-200.0
2588,92,-92.0
2589,142,-142.0
2590,86,-86.0
2591,145,-145.0
2592,109,-109.0
2593,101,-101.0
2594,147,-147.0
2595,161,-161.0
2596,86,-86.0
2597,180,-180.0
2598,153,-153.0
2599,169,-169.0
2600,83,-83.0
2601,168,-168.0
2602,168,-168.0
2603,86,-86.0
2604,99,-99.0
2605,183,-183.0
2606,157,-157.0
2607,161,-161.0
2608,100,-100.0
2609,200,-200.0
2610,147,-147.0
2611,104,-104.0
2612,200,-200.0
2613,86,-86.0
2614,97,-97.0
2615,168,-168.0
2616,84,-84.0
2617,162,-162.0
2618,156,-156.0
2619,200,-200.0
2620,149,-149.0
2621,165,-165.0
2622,200,-200.0
2623,148,-148.0
2624,200,-200.0
2625,162,-162.0
2626,185,-185.0
2627,200,-200.0
2628,172,-172.0
2629,200,-200.0
2630,152,-152.0
2631,200,-200.0
2632,178,-178.0
2633,200,-200.0
2634,176,-176.0
2635,157,-157.0
2636,89,-89.0
2637,200,-200.0
2638,155,-155.0
2639,94,-94.0
2640,200,-200.0
2641,86,-86.0
2642,162,-162.0
2643,88,-88.0
2644,174,-174.0
2645,93,-93.0
2646,166,-166.0
2647,182,-182.0
2648,170,-170.0
2649,200,-200.0
2650,200,-200.0
2651,131,-131.0
2652,163,-163.0
2653,176,-176.0
2654,200,-200.0
2655,200,-200.0
2656,191,-191.0
2657,179,-179.0
2658,200,-200.0
2659,175,-175.0
2660,153,-153.0
2661,105,-105.0
2662,89,-89.0
2663,89,-89.0
2664,163,-163.0
2665,92,-92.0
2666,164,-164.0
2667,169,-169.0
2668,171,-171.0
2669,163,-163.0
2670,162,-162.0
2671,200,-200.0
2672,200,-200.0
2673,200,-200.0
2674,103,-103.0
2675,200,-200.0
2676,163,-163.0
2677,200,-200.0
2678,109,-109.0
2679,200,-200.0
2680,200,-200.0
2681,200,-200.0
2682,90,-90.0
2683,183,-183.0
2684,99,-99.0
2685,88,-88.0
2686,200,-200.0
2687,161,-161.0
2688,103,-103.0
2689,156,-156.0
2690,200,-200.0
2691,165,-165.0
2692,95,-95.0
2693,109,-109.0
2694,146,-146.0
2695,164,-164.0
2696,90,-90.0
2697,170,-170.0
2698,200,-200.0
2699,111,-111.0
2700,155,-155.0
2701,157,-157.0
2702,94,-94.0
2703,167,-167.0
2704,200,-200.0
2705,167,-167.0
2706,158,-158.0
2707,158,-158.0
2708,92,-92.0
2709,200,-200.0
2710,87,-87.0
2711,97,-97.0
2712,200,-200.0
2713,200,-200.0
2714,97,-97.0
2715,132,-132.0
2716,200,-200.0
2717,200,-200.0
2718,184,-184.0
2719,200,-200.0
2720,107,-107.0
2721,106,-106.0
2722,200,-200.0
2723,163,-163.0
2724,162,-162.0
2725,99,-99.0
2726,96,-96.0
2727,126,-126.0
2728,156,-156.0
2729,147,-147.0
2730,193,-193.0
2731,200,-200.0
2732,200,-200.0
2733,148,-148.0
2734,200,-200.0
2735,149,-149.0
2736,200,-200.0
2737,169,-169.0
2738,103,-103.0
2739,89,-89.0
2740,173,-173.0
2741,176,-176.0
2742,151,-151.0
2743,156,-156.0
2744,87,-87.0
2745,200,-200.0
2746,200,-200.0
2747,94,-94.0
2748,167,-167.0
2749,153,-153.0
2750,163,-163.0
2751,104,-104.0
2752,200,-200.0
2753,155,-155.0
2754,151,-151.0
2755,100,-100.0
2756,200,-200.0
2757,200,-200.0
2758,200,-200.0
2759,200,-200.0
2760,89,-89.0
2761,146,-146.0
2762,90,-90.0
2763,200,-200.0
2764,159,-159.0
2765,163,-163.0
2766,200,-200.0
2767,200,-200.0
2768,160,-160.0
2769,200,-200.0
2770,157,-157.0
2771,139,-139.0
2772,102,-102.0
2773,143,-143.0
2774,153,-153.0
2775,95,-95.0
2776,152,-152.0
2777,120,-120.0
2778,154,-154.0
2779,143,-143.0
2780,158,-158.0
2781,157,-157.0
2782,120,-120.0
2783,96,-96.0
2784,93,-93.0
2785,153,-153.0
2786,145,-145.0
2787,136,-136.0
2788,90,-90.0
2789,158,-158.0
2790,153,-153.0
2791,154,-154.0
2792,158,-158.0
2793,155,-155.0
2794,91,-91.0
2795,162,-162.0
2796,90,-90.0
2797,88,-88.0
2798,179,-179.0
2799,200,-200.0
2800,152,-152.0
2801,159,-159.0
2802,200,-200.0
2803,200,-200.0
2804,181,-181.0
2805,91,-91.0
2806,200,-200.0
2807,200,-200.0
2808,100,-100.0
2809,168,-168.0
2810,124,-124.0
2811,159,-159.0
2812,89,-89.0
2813,152,-152.0
2814,86,-86.0
2815,93,-93.0
2816,174,-174.0
2817,142,-142.0
2818,198,-198.0
2819,127,-127.0
2820,142,-142.0
2821,200,-200.0
2822,200,-200.0
2823,121,-121.0
2824,100,-100.0
2825,116,-116.0
2826,90,-90.0
2827,88,-88.0
2828,141,-141.0
2829,113,-113.0
2830,158,-158.0
2831,200,-200.0
2832,133,-133.0
2833,140,-140.0
2834,152,-152.0
2835,200,-200.0
2836,113,-113.0
2837,158,-158.0
2838,153,-153.0
2839,105,-105.0
2840,200,-200.0
2841,166,-166.0
2842,200,-200.0
2843,148,-148.0
2844,99,-99.0
2845,157,-157.0
2846,200,-200.0
2847,96,-96.0
2848,193,-193.0
2849,159,-159.0
2850,153,-153.0
2851,104,-104.0
2852,90,-90.0
2853,156,-156.0
2854,183,-183.0
2855,152,-152.0
2856,138,-138.0
2857,147,-147.0
2858,158,-158.0
2859,93,-93.0
2860,158,-158.0
2861,158,-158.0
2862,162,-162.0
2863,200,-200.0
2864,156,-156.0
2865,164,-164.0
2866,92,-92.0
2867,151,-151.0
2868,200,-200.0
2869,146,-146.0
2870,186,-186.0
2871,91,-91.0
2872,200,-200.0
2873,156,-156.0
2874,91,-91.0
2875,200,-200.0
2876,99,-99.0
2877,95,-95.0
2878,200,-200.0
2879,200,-200.0
2880,96,-96.0
2881,94,-94.0
2882,95,-95.0
2883,200,-200.0
2884,200,-200.0
2885,93,-93.0
2886,119,-119.0
2887,162,-162.0
2888,161,-161.0
2889,156,-156.0
2890,154,-154.0
2891,108,-108.0
2892,136,-136.0
2893,169,-169.0
2894,160,-160.0
2895,92,-92.0
2896,90,-90.0
2897,200,-200.0
2898,200,-200.0
2899,168,-168.0
2900,154,-154.0
2901,156,-156.0
2902,200,-200.0
2903,200,-200.0
2904,159,-159.0
2905,200,-200.0
2906,200,-200.0
2907,144,-144.0
2908,200,-200.0
2909,101,-101.0
2910,147,-147.0
2911,145,-145.0
2912,93,-93.0
2913,165,-165.0
2914,144,-144.0
2915,159,-159.0
2916,156,-156.0
2917,142,-142.0
2918,141,-141.0
2919,146,-146.0
2920,145,-145.0
2921,154,-154.0
2922,154,-154.0
2923,173,-173.0
2924,185,-185.0
2925,179,-179.0
2926,147,-147.0
2927,109,-109.0
2928,143,-143.0
2929,139,-139.0
2930,147,-147.0
2931,145,-145.0
2932,145,-145.0
2933,151,-151.0
2934,145,-145.0
2935,168,-168.0
2936,91,-91.0
2937,200,-200.0
2938,84,-84.0
2939,111,-111.0
2940,97,-97.0
2941,117,-117.0
2942,118,-118.0
2943,144,-144.0
2944,152,-152.0
2945,200,-200.0
2946,116,-116.0
2947,154,-154.0
2948,142,-142.0
2949,154,-154.0
2950,146,-146.0
2951,109,-109.0
2952,106,-106.0
2953,148,-148.0
2954,125,-125.0
2955,149,-149.0
2956,153,-153.0
2957,147,-147.0
2958,200,-200.0
2959,115,-115.0
2960,150,-150.0
2961,147,-147.0
2962,200,-200.0
2963,94,-94.0
2964,167,-167.0
2965,189,-189.0
2966,183,-183.0
2967,150,-150.0
2968,113,-113.0
2969,147,-147.0
2970,146,-146.0
2971,193,-193.0
2972,148,-148.0
2973,197,-197.0
2974,152,-152.0
2975,94,-94.0
2976,148,-148.0
2977,159,-159.0
2978,163,-163.0
2979,123,-123.0
2980,153,-153.0
2981,153,-153.0
2982,149,-149.0
2983,154,-154.0
2984,148,-148.0
2985,155,-155.0
2986,151,-151.0
2987,100,-100.0
2988,122,-122.0
2989,92,-92.0
2990,170,-170.0
2991,146,-146.0
2992,145,-145.0
2993,200,-200.0
2994,110,-110.0
2995,105,-105.0
2996,120,-120.0
2997,149,-149.0
2998,88,-88.0
2999,149,-149.0
3000,180,-180.0
3001,109,-109.0
3002,150,-150.0
3003,113,-113.0
3004,143,-143.0
3005,149,-149.0
3006,147,-147.0
3007,147,-147.0
3008,146,-146.0
3009,103,-103.0
3010,85,-85.0
3011,153,-153.0
3012,123,-123.0
3013,113,-113.0
3014,151,-151.0
3015,106,-106.0
3016,106,-106.0
3017,107,-107.0
3018,110,-110.0
3019,147,-147.0
3020,110,-110.0
3021,143,-143.0
3022,105,-105.0
3023,94,-94.0
3024,84,-84.0
3025,113,-113.0
3026,109,-109.0
3027,113,-113.0
3028,118,-118.0
3029,186,-186.0
3030,107,-107.0
3031,108,-108.0
3032,115,-115.0
3033,200,-200.0
3034,124,-124.0
3035,93,-93.0
3036,88,-88.0
3037,114,-114.0
3038,115,-115.0
3039,89,-89.0
3040,89,-89.0
3041,84,-84.0
3042,106,-106.0
3043,119,-119.0
3044,118,-118.0
3045,144,-144.0
3046,107,-107.0
3047,113,-113.0
3048,110,-110.0
3049,110,-110.0
3050,83,-83.0
3051,94,-94.0
3052,107,-107.0
3053,117,-117.0
3054,115,-115.0
3055,114,-114.0
3056,108,-108.0
3057,108,-108.0
3058,120,-120.0
3059,109,-109.0
3060,111,-111.0
3061,114,-114.0
3062,111,-111.0
3063,171,-171.0
3064,113,-113.0
3065,90,-90.0
3066,84,-84.0
3067,107,-107.0
3068,112,-112.0
3069,106,-106.0
3070,113,-113.0
3071,109,-109.0
3072,83,-83.0
3073,128,-128.0
3074,112,-112.0
3075,86,-86.0
3076,106,-106.0
3077,104,-104.0
3078,145,-145.0
3079,127,-127.0
3080,161,-161.0
3081,156,-156.0
3082,98,-98.0
3083,146,-146.0
3084,109,-109.0
3085,87,-87.0
3086,94,-94.0
3087,118,-118.0
3088,115,-115.0
3089,110,-110.0
3090,86,-86.0
3091,97,-97.0
3092,96,-96.0
3093,110,-110.0
3094,160,-160.0
3095,155,-155.0
3096,175,-175.0
3097,173,-173.0
3098,94,-94.0
3099,165,-165.0
3100,157,-157.0
3101,150,-150.0
3102,148,-148.0
3103,92,-92.0
3104,154,-154.0
3105,90,-90.0
3106,182,-182.0
3107,158,-158.0
3108,96,-96.0
3109,157,-157.0
3110,93,-93.0
3111,179,-179.0
3112,152,-152.0
3113,147,-147.0
3114,88,-88.0
3115,164,-164.0
3116,200,-200.0
3117,149,-149.0
3118,148,-148.0
3119,89,-89.0
3120,200,-200.0
3121,154,-154.0
3122,148,-148.0
3123,147,-147.0
3124,91,-91.0
3125,171,-171.0
3126,155,-155.0
3127,163,-163.0
3128,158,-158.0
3129,156,-156.0
3130,93,-93.0
3131,175,-175.0
3132,157,-157.0
3133,160,-160.0
3134,147,-147.0
3135,146,-146.0
3136,161,-161.0
3137,141,-141.0
3138,154,-154.0
3139,150,-150.0
3140,143,-143.0
3141,170,-170.0
3142,150,-150.0
3143,165,-165.0
3144,144,-144.0
3145,156,-156.0
3146,151,-151.0
3147,115,-115.0
3148,149,-149.0
3149,86,-86.0
3150,152,-152.0
3151,138,-138.0
3152,123,-123.0
3153,142,-142.0
3154,126,-126.0
3155,162,-162.0
3156,145,-145.0
3157,159,-159.0
3158,149,-149.0
3159,101,-101.0
3160,137,-137.0
3161,160,-160.0
3162,166,-166.0
3163,147,-147.0
3164,166,-166.0
3165,163,-163.0
3166,154,-154.0
3167,200,-200.0
3168,103,-103.0
3169,100,-100.0
3170,148,-148.0
3171,104,-104.0
3172,149,-149.0
3173,144,-144.0
3174,145,-145.0
3175,138,-138.0
3176,158,-158.0
3177,87,-87.0
3178,154,-154.0
3179,115,-115.0
3180,109,-109.0
3181,187,-187.0
3182,149,-149.0
3183,153,-153.0
3184,146,-146.0
3185,200,-200.0
3186,92,-92.0
3187,185,-185.0
3188,91,-91.0
3189,200,-200.0
3190,200,-200.0
3191,156,-156.0
3192,171,-171.0
3193,158,-158.0
3194,172,-172.0
3195,172,-172.0
3196,91,-91.0
3197,196,-196.0
3198,165,-165.0
3199,88,-88.0
3200,145,-145.0
3201,152,-152.0
3202,143,-143.0
3203,200,-200.0
3204,200,-200.0
3205,88,-88.0
3206,94,-94.0
3207,152,-152.0
3208,194,-194.0
3209,104,-104.0
3210,148,-148.0
3211,200,-200.0
3212,165,-165.0
3213,200,-200.0
3214,144,-144.0
3215,140,-140.0
3216,142,-142.0
3217,95,-95.0
3218,151,-151.0
3219,174,-174.0
3220,200,-200.0
3221,88,-88.0
3222,200,-200.0
3223,200,-200.0
3224,155,-155.0
3225,149,-149.0
3226,165,-165.0
3227,140,-140.0
3228,180,-180.0
3229,140,-140.0
3230,114,-114.0
3231,103,-103.0
3232,180,-180.0
3233,155,-155.0
3234,146,-146.0
3235,163,-163.0
3236,170,-170.0
3237,200,-200.0
3238,200,-200.0
3239,88,-88.0
3240,151,-151.0
3241,183,-183.0
3242,160,-160.0
3243,89,-89.0
3244,101,-101.0
3245,153,-153.0
3246,200,-200.0
3247,200,-200.0
3248,169,-169.0
3249,166,-166.0
3250,200,-200.0
3251,96,-96.0
3252,200,-200.0
3253,169,-169.0
3254,154,-154.0
3255,200,-200.0
3256,200,-200.0
3257,92,-92.0
3258,90,-90.0
3259,200,-200.0
3260,200,-200.0
3261,200,-200.0
3262,200,-200.0
3263,200,-200.0
3264,200,-200.0
3265,150,-150.0
3266,164,-164.0
3267,176,-176.0
3268,200,-200.0
3269,200,-200.0
3270,200,-200.0
3271,180,-180.0
3272,200,-200.0
3273,200,-200.0
3274,200,-200.0
3275,200,-200.0
3276,200,-200.0
3277,191,-191.0
3278,200,-200.0
3279,200,-200.0
3280,169,-169.0
3281,195,-195.0
3282,200,-200.0
3283,158,-158.0
3284,200,-200.0
3285,159,-159.0
3286,144,-144.0
3287,172,-172.0
3288,200,-200.0
3289,200,-200.0
3290,200,-200.0
3291,139,-139.0
3292,125,-125.0
3293,146,-146.0
3294,143,-143.0
3295,145,-145.0
3296,153,-153.0
3297,166,-166.0
3298,152,-152.0
3299,157,-157.0
3300,160,-160.0
3301,200,-200.0
3302,150,-150.0
3303,200,-200.0
3304,160,-160.0
3305,115,-115.0
3306,200,-200.0
3307,163,-163.0
3308,167,-167.0
3309,200,-200.0
3310,142,-142.0
3311,165,-165.0
3312,200,-200.0
3313,200,-200.0
3314,173,-173.0
3315,198,-198.0
3316,158,-158.0
3317,200,-200.0
3318,170,-170.0
3319,200,-200.0
3320,157,-157.0
3321,141,-141.0
3322,143,-143.0
3323,200,-200.0
3324,200,-200.0
3325,98,-98.0
3326,140,-140.0
3327,127,-127.0
3328,158,-158.0
3329,200,-200.0
3330,200,-200.0
3331,200,-200.0
3332,132,-132.0
3333,200,-200.0
3334,112,-112.0
3335,198,-198.0
3336,109,-109.0
3337,167,-167.0
3338,120,-120.0
3339,114,-114.0
3340,91,-91.0
3341,169,-169.0
3342,91,-91.0
3343,117,-117.0
3344,112,-112.0
3345,89,-89.0
3346,109,-109.0
3347,145,-145.0
3348,160,-160.0
3349,105,-105.0
3350,111,-111.0
3351,148,-148.0
3352,149,-149.0
3353,91,-91.0
3354,169,-169.0
3355,177,-177.0
3356,159,-159.0
3357,200,-200.0
3358,175,-175.0
3359,121,-121.0
3360,110,-110.0
3361,162,-162.0
3362,166,-166.0
3363,94,-94.0
3364,159,-159.0
3365,118,-118.0
3366,172,-172.0
3367,160,-160.0
3368,164,-164.0
3369,169,-169.0
3370,87,-87.0
3371,200,-200.0
3372,104,-104.0
3373,85,-85.0
3374,156,-156.0
3375,200,-200.0
3376,152,-152.0
3377,158,-158.0
3378,174,-174.0
3379,200,-200.0
3380,200,-200.0
3381,165,-165.0
3382,200,-200.0
3383,163,-163.0
3384,104,-104.0
3385,159,-159.0
3386,162,-162.0
3387,142,-142.0
3388,141,-141.0
3389,147,-147.0
3390,83,-83.0
3391,149,-149.0
3392,146,-146.0
3393,158,-158.0
3394,200,-200.0
3395,157,-157.0
3396,168,-168.0
3397,176,-176.0
3398,153,-153.0
3399,157,-157.0
3400,88,-88.0
3401,157,-157.0
3402,180,-180.0
3403,121,-121.0
3404,159,-159.0
3405,164,-164.0
3406,155,-155.0
3407,167,-167.0
3408,155,-155.0
3409,157,-157.0
3410,149,-149.0
3411,154,-154.0
3412,126,-126.0
3413,171,-171.0
3414,105,-105.0
3415,117,-117.0
3416,160,-160.0
3417,171,-171.0
3418,172,-172.0
3419,169,-169.0
3420,108,-108.0
3421,151,-151.0
3422,151,-151.0
3423,122,-122.0
3424,119,-119.0
3425,102,-102.0
3426,144,-144.0
3427,200,-200.0
3428,119,-119.0
3429,167,-167.0
3430,154,-154.0
3431,172,-172.0
3432,144,-144.0
3433,87,-87.0
3434,150,-150.0
3435,187,-187.0
3436,152,-152.0
3437,165,-165.0
3438,200,-200.0
3439,119,-119.0
3440,200,-200.0
3441,159,-159.0
3442,119,-119.0
3443,117,-117.0
3444,134,-134.0
3445,114,-114.0
3446,141,-141.0
3447,156,-156.0
3448,119,-119.0
3449,114,-114.0
3450,156,-156.0
3451,112,-112.0
3452,126,-126.0
3453,115,-115.0
3454,185,-185.0
3455,159,-159.0
3456,119,-119.0
3457,151,-151.0
3458,110,-110.0
3459,150,-150.0
3460,132,-132.0
3461,91,-91.0
3462,87,-87.0
3463,187,-187.0
3464,117,-117.0
3465,88,-88.0
3466,166,-166.0
3467,118,-118.0
3468,159,-159.0
3469,170,-170.0
3470,119,-119.0
3471,113,-113.0
3472,104,-104.0
3473,200,-200.0
3474,88,-88.0
3475,177,-177.0
3476,177,-177.0
3477,117,-117.0
3478,161,-161.0
3479,159,-159.0
3480,162,-162.0
3481,103,-103.0
3482,200,-200.0
3483,174,-174.0
3484,184,-184.0
3485,119,-119.0
3486,142,-142.0
3487,94,-94.0
3488,85,-85.0
3489,118,-118.0
3490,146,-146.0
3491,155,-155.0
3492,154,-154.0
3493,85,-85.0
3494,162,-162.0
3495,118,-118.0
3496,159,-159.0
3497,93,-93.0
3498,92,-92.0
3499,176,-176.0
3500,200,-200.0
3501,113,-113.0
3502,152,-152.0
3503,130,-130.0
3504,90,-90.0
3505,113,-113.0
3506,119,-119.0
3507,161,-161.0
3508,173,-173.0
3509,151,-151.0
3510,121,-121.0
3511,129,-129.0
3512,92,-92.0
3513,151,-151.0
3514,113,-113.0
3515,148,-148.0
3516,89,-89.0
3517,168,-168.0
3518,122,-122.0
3519,116,-116.0
3520,95,-95.0
3521,119,-119.0
3522,153,-153.0
3523,84,-84.0
3524,90,-90.0
3525,154,-154.0
3526,86,-86.0
3527,98,-98.0
3528,157,-157.0
3529,103,-103.0
3530,160,-160.0
3531,142,-142.0
3532,114,-114.0
3533,106,-106.0
3534,170,-170.0
3535,103,-103.0
3536,173,-173.0
3537,111,-111.0
3538,155,-155.0
3539,159,-159.0
3540,117,-117.0
3541,164,-164.0
3542,146,-146.0
3543,156,-156.0
3544,171,-171.0
3545,165,-165.0
3546,161,-161.0
3547,156,-156.0
3548,117,-117.0
3549,156,-156.0
3550,154,-154.0
3551,153,-153.0
3552,140,-140.0
3553,150,-150.0
3554,158,-158.0
3555,156,-156.0
3556,94,-94.0
3557,88,-88.0
3558,87,-87.0
3559,161,-161.0
3560,152,-152.0
3561,129,-129.0
3562,161,-161.0
3563,164,-164.0
3564,156,-156.0
3565,146,-146.0
3566,146,-146.0
3567,84,-84.0
3568,196,-196.0
3569,184,-184.0
3570,148,-148.0
3571,108,-108.0
3572,149,-149.0
3573,156,-156.0
3574,134,-134.0
3575,159,-159.0
3576,190,-190.0
3577,96,-96.0
3578,159,-159.0
3579,134,-134.0
3580,153,-153.0
3581,140,-140.0
3582,140,-140.0
3583,149,-149.0
3584,111,-111.0
3585,159,-159.0
3586,149,-149.0
3587,102,-102.0
3588,140,-140.0
3589,160,-160.0
3590,152,-152.0
3591,148,-148.0
3592,191,-191.0
3593,161,-161.0
3594,156,-156.0
3595,97,-97.0
3596,137,-137.0
3597,151,-151.0
3598,186,-186.0
3599,153,-153.0
3600,156,-156.0
3601,149,-149.0
3602,141,-141.0
3603,197,-197.0
3604,91,-91.0
3605,193,-193.0
3606,142,-142.0
3607,155,-155.0
3608,167,-167.0
3609,200,-200.0
3610,142,-142.0
3611,146,-146.0
3612,151,-151.0
3613,149,-149.0
3614,146,-146.0
3615,160,-160.0
3616,158,-158.0
3617,96,-96.0
3618,144,-144.0
3619,127,-127.0
3620,105,-105.0
3621,112,-112.0
3622,154,-154.0
3623,149,-149.0
3624,92,-92.0
3625,195,-195.0
3626,169,-169.0
3627,149,-149.0
3628,152,-152.0
3629,155,-155.0
3630,86,-86.0
3631,148,-148.0
3632,148,-148.0
3633,138,-138.0
3634,142,-142.0
3635,158,-158.0
3636,155,-155.0
3637,146,-146.0
3638,155,-155.0
3639,149,-149.0
3640,171,-171.0
3641,146,-146.0
3642,149,-149.0
3643,152,-152.0
3644,149,-149.0
3645,151,-151.0
3646,89,-89.0
3647,156,-156.0
3648,154,-154.0
3649,152,-152.0
3650,152,-152.0
3651,200,-200.0
3652,174,-174.0
3653,153,-153.0
3654,147,-147.0
3655,150,-150.0
3656,139,-139.0
3657,165,-165.0
3658,108,-108.0
3659,152,-152.0
3660,148,-148.0
3661,144,-144.0
3662,149,-149.0
3663,181,-181.0
3664,142,-142.0
3665,145,-145.0
3666,140,-140.0
3667,149,-149.0
3668,167,-167.0
3669,147,-147.0
3670,144,-144.0
3671,152,-152.0
3672,147,-147.0
3673,149,-149.0
3674,143,-143.0
3675,158,-158.0
3676,84,-84.0
3677,160,-160.0
3678,152,-152.0
3679,186,-186.0
3680,152,-152.0
3681,88,-88.0
3682,177,-177.0
3683,149,-149.0
3684,149,-149.0
3685,200,-200.0
3686,162,-162.0
3687,97,-97.0
3688,149,-149.0
3689,200,-200.0
3690,90,-90.0
3691,89,-89.0
3692,134,-134.0
3693,147,-147.0
3694,149,-149.0
3695,146,-146.0
3696,155,-155.0
3697,164,-164.0
3698,145,-145.0
3699,92,-92.0
3700,155,-155.0
3701,200,-200.0
3702,87,-87.0
3703,158,-158.0
3704,150,-150.0
3705,147,-147.0
3706,137,-137.0
3707,144,-144.0
3708,101,-101.0
3709,153,-153.0
3710,168,-168.0
3711,145,-145.0
3712,194,-194.0
3713,149,-149.0
3714,143,-143.0
3715,147,-147.0
3716,149,-149.0
3717,182,-182.0
3718,151,-151.0
3719,146,-146.0
3720,141,-141.0
3721,151,-151.0
3722,144,-144.0
3723,152,-152.0
3724,145,-145.0
3725,92,-92.0
3726,153,-153.0
3727,144,-144.0
3728,200,-200.0
3729,147,-147.0
3730,101,-101.0
3731,173,-173.0
3732,145,-145.0
3733,150,-150.0
3734,148,-148.0
3735,142,-142.0
3736,150,-150.0
3737,141,-141.0
3738,147,-147.0
3739,145,-145.0
3740,168,-168.0
3741,160,-160.0
3742,152,-152.0
3743,142,-142.0
3744,147,-147.0
3745,162,-162.0
3746,143,-143.0
3747,148,-148.0
3748,200,-200.0
3749,102,-102.0
3750,95,-95.0
3751,155,-155.0
3752,150,-150.0
3753,94,-94.0
3754,140,-140.0
3755,139,-139.0
3756,156,-156.0
3757,150,-150.0
3758,139,-139.0
3759,142,-142.0
3760,186,-186.0
3761,157,-157.0
3762,144,-144.0
3763,146,-146.0
3764,95,-95.0
3765,141,-141.0
3766,160,-160.0
3767,89,-89.0
3768,132,-132.0
3769,143,-143.0
3770,141,-141.0
3771,150,-150.0
3772,151,-151.0
3773,145,-145.0
3774,151,-151.0
3775,148,-148.0
3776,142,-142.0
3777,148,-148.0
3778,146,-146.0
3779,140,-140.0
3780,149,-149.0
3781,166,-166.0
3782,154,-154.0
3783,142,-142.0
3784,150,-150.0
3785,143,-143.0
3786,90,-90.0
3787,153,-153.0
3788,143,-143.0
3789,137,-137.0
3790,156,-156.0
3791,147,-147.0
3792,169,-169.0
3793,182,-182.0
3794,139,-139.0
3795,131,-131.0
3796,178,-178.0
3797,153,-153.0
3798,143,-143.0
3799,92,-92.0
3800,147,-147.0
3801,154,-154.0
3802,164,-164.0
3803,200,-200.0
3804,151,-151.0
3805,139,-139.0
3806,157,-157.0
3807,154,-154.0
3808,109,-109.0
3809,117,-117.0
3810,143,-143.0
3811,136,-136.0
3812,135,-135.0
3813,136,-136.0
3814,93,-93.0
3815,136,-136.0
3816,124,-124.0
3817,168,-168.0
3818,118,-118.0
3819,170,-170.0
3820,136,-136.0
3821,145,-145.0
3822,122,-122.0
3823,121,-121.0
3824,126,-126.0
3825,120,-120.0
3826,154,-154.0
3827,178,-178.0
3828,170,-170.0
3829,115,-115.0
3830,166,-166.0
3831,100,-100.0
3832,182,-182.0
3833,129,-129.0
3834,184,-184.0
3835,200,-200.0
3836,171,-171.0
3837,127,-127.0
3838,147,-147.0
3839,149,-149.0
3840,153,-153.0
3841,116,-116.0
3842,136,-136.0
3843,152,-152.0
3844,116,-116.0
3845,171,-171.0
3846,157,-157.0
3847,87,-87.0
3848,115,-115.0
3849,158,-158.0
3850,118,-118.0
3851,112,-112.0
3852,149,-149.0
3853,174,-174.0
3854,131,-131.0
3855,110,-110.0
3856,163,-163.0
3857,121,-121.0
3858,179,-179.0
3859,115,-115.0
3860,91,-91.0
3861,112,-112.0
3862,113,-113.0
3863,92,-92.0
3864,151,-151.0
3865,120,-120.0
3866,83,-83.0
3867,187,-187.0
3868,111,-111.0
3869,144,-144.0
3870,134,-134.0
3871,200,-200.0
3872,116,-116.0
3873,88,-88.0
3874,142,-142.0
3875,163,-163.0
3876,84,-84.0
3877,87,-87.0
3878,90,-90.0
3879,127,-127.0
3880,159,-159.0
3881,150,-150.0
3882,109,-109.0
3883,145,-145.0
3884,158,-158.0
3885,113,-113.0
3886,89,-89.0
3887,177,-177.0
3888,96,-96.0
3889,152,-152.0
3890,169,-169.0
3891,165,-165.0
3892,104,-104.0
3893,200,-200.0
3894,127,-127.0
3895,113,-113.0
3896,171,-171.0
3897,158,-158.0
3898,109,-109.0
3899,148,-148.0
3900,93,-93.0
3901,154,-154.0
3902,169,-169.0
3903,110,-110.0
3904,200,-200.0
3905,140,-140.0
3906,132,-132.0
3907,125,-125.0
3908,160,-160.0
3909,174,-174.0
3910,157,-157.0
3911,170,-170.0
3912,123,-123.0
3913,94,-94.0
3914,93,-93.0
3915,92,-92.0
3916,95,-95.0
3917,191,-191.0
3918,136,-136.0
3919,97,-97.0
3920,169,-169.0
3921,93,-93.0
3922,112,-112.0
3923,108,-108.0
3924,149,-149.0
3925,117,-117.0
3926,144,-144.0
3927,146,-146.0
3928,90,-90.0
3929,147,-147.0
3930,142,-142.0
3931,111,-111.0
3932,86,-86.0
3933,89,-89.0
3934,105,-105.0
3935,86,-86.0
3936,141,-141.0
3937,115,-115.0
3938,145,-145.0
3939,160,-160.0
3940,166,-166.0
3941,162,-162.0
3942,110,-110.0
3943,111,-111.0
3944,125,-125.0
3945,120,-120.0
3946,93,-93.0
3947,155,-155.0
3948,115,-115.0
3949,87,-87.0
3950,89,-89.0
3951,116,-116.0
3952,149,-149.0
3953,112,-112.0
3954,141,-141.0
3955,116,-116.0
3956,87,-87.0
3957,128,-128.0
3958,136,-136.0
3959,109,-109.0
3960,114,-114.0
3961,161,-161.0
3962,109,-109.0
3963,105,-105.0
3964,149,-149.0
3965,149,-149.0
3966,116,-116.0
3967,105,-105.0
3968,108,-108.0
3969,90,-90.0
3970,154,-154.0
3971,160,-160.0
3972,113,-113.0
3973,151,-151.0
3974,89,-89.0
3975,86,-86.0
3976,177,-177.0
3977,161,-161.0
3978,147,-147.0
3979,141,-141.0
3980,200,-200.0
3981,153,-153.0
3982,169,-169.0
3983,138,-138.0
3984,92,-92.0
3985,101,-101.0
3986,145,-145.0
3987,192,-192.0
3988,140,-140.0
3989,140,-140.0
3990,92,-92.0
3991,115,-115.0
3992,110,-110.0
3993,115,-115.0
3994,135,-135.0
3995,113,-113.0
3996,109,-109.0
3997,118,-118.0
3998,86,-86.0
3999,150,-150.0
4000,142,-142.0
4001,156,-156.0
4002,116,-116.0
4003,147,-147.0
4004,114,-114.0
4005,148,-148.0
4006,160,-160.0
4007,113,-113.0
4008,141,-141.0
4009,134,-134.0
4010,170,-170.0
4011,126,-126.0
4012,200,-200.0
4013,200,-200.0
4014,134,-134.0
4015,132,-132.0
4016,185,-185.0
4017,147,-147.0
4018,160,-160.0
4019,126,-126.0
4020,130,-130.0
4021,142,-142.0
4022,147,-147.0
4023,131,-131.0
4024,143,-143.0
4025,167,-167.0
4026,111,-111.0
4027,115,-115.0
4028,143,-143.0
4029,141,-141.0
4030,169,-169.0
4031,168,-168.0
4032,137,-137.0
4033,193,-193.0
4034,117,-117.0
4035,142,-142.0
4036,120,-120.0
4037,158,-158.0
4038,132,-132.0
4039,200,-200.0
4040,162,-162.0
4041,180,-180.0
4042,172,-172.0
4043,200,-200.0
4044,200,-200.0
4045,200,-200.0
4046,200,-200.0
4047,155,-155.0
4048,169,-169.0
4049,182,-182.0
4050,200,-200.0
4051,184,-184.0
4052,149,-149.0
4053,95,-95.0
4054,153,-153.0
4055,155,-155.0
4056,174,-174.0
4057,161,-161.0
4058,154,-154.0
4059,155,-155.0
4060,177,-177.0
4061,161,-161.0
4062,200,-200.0
4063,166,-166.0
4064,152,-152.0
4065,135,-135.0
4066,200,-200.0
4067,168,-168.0
4068,123,-123.0
4069,146,-146.0
4070,200,-200.0
4071,148,-148.0
4072,174,-174.0
4073,113,-113.0
4074,135,-135.0
4075,167,-167.0
4076,151,-151.0
4077,191,-191.0
4078,85,-85.0
4079,158,-158.0
4080,87,-87.0
4081,200,-200.0
4082,88,-88.0
4083,200,-200.0
4084,152,-152.0
4085,166,-166.0
4086,147,-147.0
4087,155,-155.0
4088,200,-200.0
4089,118,-118.0
4090,170,-170.0
4091,172,-172.0
4092,200,-200.0
4093,159,-159.0
4094,171,-171.0
4095,159,-159.0
4096,197,-197.0
4097,109,-109.0
4098,113,-113.0
4099,95,-95.0
4100,199,-199.0
4101,190,-190.0
4102,146,-146.0
4103,156,-156.0
4104,162,-162.0
4105,119,-119.0
4106,200,-200.0
4107,136,-136.0
4108,163,-163.0
4109,134,-134.0
4110,162,-162.0
4111,124,-124.0
4112,181,-181.0
4113,119,-119.0
4114,94,-94.0
4115,172,-172.0
4116,123,-123.0
4117,128,-128.0
4118,187,-187.0
4119,145,-145.0
4120,86,-86.0
4121,200,-200.0
4122,143,-143.0
4123,132,-132.0
4124,121,-121.0
4125,155,-155.0
4126,157,-157.0
4127,174,-174.0
4128,133,-133.0
4129,133,-133.0
4130,115,-115.0
4131,117,-117.0
4132,150,-150.0
4133,118,-118.0
4134,112,-112.0
4135,200,-200.0
4136,89,-89.0
4137,172,-172.0
4138,120,-120.0
4139,122,-122.0
4140,200,-200.0
4141,149,-149.0
4142,199,-199.0
4143,124,-124.0
4144,122,-122.0
4145,194,-194.0
4146,96,-96.0
4147,145,-145.0
4148,117,-117.0
4149,123,-123.0
4150,158,-158.0
