episodes,steps,rewards
0,200,-200.0
1,200,-200.0
2,200,-200.0
3,200,-200.0
4,200,-200.0
5,200,-200.0
6,200,-200.0
7,200,-200.0
8,200,-200.0
9,200,-200.0
10,200,-200.0
11,200,-200.0
12,200,-200.0
13,200,-200.0
14,200,-200.0
15,200,-200.0
16,200,-200.0
17,200,-200.0
18,200,-200.0
19,200,-200.0
20,200,-200.0
21,200,-200.0
22,171,-171.0
23,200,-200.0
24,200,-200.0
25,200,-200.0
26,200,-200.0
27,200,-200.0
28,200,-200.0
29,200,-200.0
30,200,-200.0
31,200,-200.0
32,200,-200.0
33,200,-200.0
34,134,-134.0
35,200,-200.0
36,200,-200.0
37,200,-200.0
38,200,-200.0
39,200,-200.0
40,200,-200.0
41,200,-200.0
42,200,-200.0
43,200,-200.0
44,200,-200.0
45,200,-200.0
46,200,-200.0
47,200,-200.0
48,200,-200.0
49,200,-200.0
50,200,-200.0
51,200,-200.0
52,177,-177.0
53,192,-192.0
54,200,-200.0
55,200,-200.0
56,200,-200.0
57,200,-200.0
58,200,-200.0
59,154,-154.0
60,200,-200.0
61,194,-194.0
62,200,-200.0
63,200,-200.0
64,200,-200.0
65,200,-200.0
66,200,-200.0
67,200,-200.0
68,111,-111.0
69,200,-200.0
70,200,-200.0
71,200,-200.0
72,159,-159.0
73,200,-200.0
74,200,-200.0
75,200,-200.0
76,200,-200.0
77,200,-200.0
78,200,-200.0
79,200,-200.0
80,200,-200.0
81,200,-200.0
82,200,-200.0
83,200,-200.0
84,200,-200.0
85,200,-200.0
86,200,-200.0
87,200,-200.0
88,200,-200.0
89,155,-155.0
90,200,-200.0
91,146,-146.0
92,200,-200.0
93,146,-146.0
94,157,-157.0
95,200,-200.0
96,108,-108.0
97,167,-167.0
98,200,-200.0
99,200,-200.0
100,200,-200.0
101,87,-87.0
102,96,-96.0
103,149,-149.0
104,200,-200.0
105,139,-139.0
106,149,-149.0
107,200,-200.0
108,157,-157.0
109,200,-200.0
110,185,-185.0
111,170,-170.0
112,132,-132.0
113,200,-200.0
114,124,-124.0
115,200,-200.0
116,200,-200.0
117,200,-200.0
118,200,-200.0
119,200,-200.0
120,169,-169.0
121,87,-87.0
122,200,-200.0
123,113,-113.0
124,200,-200.0
125,142,-142.0
126,146,-146.0
127,200,-200.0
128,181,-181.0
129,173,-173.0
130,200,-200.0
131,91,-91.0
132,105,-105.0
133,110,-110.0
134,200,-200.0
135,200,-200.0
136,200,-200.0
137,106,-106.0
138,93,-93.0
139,97,-97.0
140,151,-151.0
141,147,-147.0
142,91,-91.0
143,85,-85.0
144,200,-200.0
145,111,-111.0
146,86,-86.0
147,200,-200.0
148,124,-124.0
149,109,-109.0
150,200,-200.0
151,86,-86.0
152,90,-90.0
153,200,-200.0
154,167,-167.0
155,183,-183.0
156,200,-200.0
157,200,-200.0
158,177,-177.0
159,159,-159.0
160,91,-91.0
161,144,-144.0
162,158,-158.0
163,200,-200.0
164,200,-200.0
165,166,-166.0
166,159,-159.0
167,200,-200.0
168,111,-111.0
169,154,-154.0
170,113,-113.0
171,173,-173.0
172,137,-137.0
173,173,-173.0
174,200,-200.0
175,164,-164.0
176,105,-105.0
177,166,-166.0
178,128,-128.0
179,94,-94.0
180,191,-191.0
181,174,-174.0
182,161,-161.0
183,177,-177.0
184,177,-177.0
185,171,-171.0
186,161,-161.0
187,97,-97.0
188,130,-130.0
189,163,-163.0
190,160,-160.0
191,164,-164.0
192,113,-113.0
193,200,-200.0
194,190,-190.0
195,124,-124.0
196,162,-162.0
197,129,-129.0
198,100,-100.0
199,182,-182.0
200,161,-161.0
201,116,-116.0
202,127,-127.0
203,122,-122.0
204,192,-192.0
205,188,-188.0
206,200,-200.0
207,193,-193.0
208,114,-114.0
209,156,-156.0
210,117,-117.0
211,199,-199.0
212,176,-176.0
213,171,-171.0
214,85,-85.0
215,122,-122.0
216,87,-87.0
217,164,-164.0
218,124,-124.0
219,143,-143.0
220,170,-170.0
221,177,-177.0
222,122,-122.0
223,179,-179.0
224,166,-166.0
225,171,-171.0
226,101,-101.0
227,88,-88.0
228,122,-122.0
229,173,-173.0
230,115,-115.0
231,165,-165.0
232,109,-109.0
233,108,-108.0
234,175,-175.0
235,131,-131.0
236,157,-157.0
237,154,-154.0
238,89,-89.0
239,168,-168.0
240,121,-121.0
241,200,-200.0
242,172,-172.0
243,90,-90.0
244,118,-118.0
245,142,-142.0
246,165,-165.0
247,167,-167.0
248,174,-174.0
249,170,-170.0
250,173,-173.0
251,165,-165.0
252,96,-96.0
253,186,-186.0
254,200,-200.0
255,165,-165.0
256,88,-88.0
257,91,-91.0
258,84,-84.0
259,153,-153.0
260,167,-167.0
261,161,-161.0
262,96,-96.0
263,162,-162.0
264,193,-193.0
265,166,-166.0
266,164,-164.0
267,108,-108.0
268,167,-167.0
269,159,-159.0
270,113,-113.0
271,170,-170.0
272,158,-158.0
273,187,-187.0
274,140,-140.0
275,161,-161.0
276,150,-150.0
277,155,-155.0
278,85,-85.0
279,96,-96.0
280,86,-86.0
281,111,-111.0
282,98,-98.0
283,159,-159.0
284,90,-90.0
285,171,-171.0
286,113,-113.0
287,103,-103.0
288,111,-111.0
289,190,-190.0
290,112,-112.0
291,143,-143.0
292,160,-160.0
293,146,-146.0
294,154,-154.0
295,86,-86.0
296,96,-96.0
297,112,-112.0
298,150,-150.0
299,139,-139.0
300,162,-162.0
301,151,-151.0
302,149,-149.0
303,169,-169.0
304,144,-144.0
305,114,-114.0
306,135,-135.0
307,88,-88.0
308,184,-184.0
309,134,-134.0
310,85,-85.0
311,86,-86.0
312,129,-129.0
313,143,-143.0
314,88,-88.0
315,154,-154.0
316,89,-89.0
317,156,-156.0
318,166,-166.0
319,88,-88.0
320,153,-153.0
321,165,-165.0
322,88,-88.0
323,86,-86.0
324,153,-153.0
325,85,-85.0
326,146,-146.0
327,123,-123.0
328,140,-140.0
329,175,-175.0
330,89,-89.0
331,88,-88.0
332,157,-157.0
333,166,-166.0
334,147,-147.0
335,147,-147.0
336,153,-153.0
337,186,-186.0
338,143,-143.0
339,88,-88.0
340,177,-177.0
341,91,-91.0
342,139,-139.0
343,141,-141.0
344,146,-146.0
345,200,-200.0
346,91,-91.0
347,133,-133.0
348,145,-145.0
349,149,-149.0
350,87,-87.0
351,141,-141.0
352,112,-112.0
353,146,-146.0
354,93,-93.0
355,145,-145.0
356,147,-147.0
357,145,-145.0
358,104,-104.0
359,138,-138.0
360,138,-138.0
361,111,-111.0
362,158,-158.0
363,136,-136.0
364,138,-138.0
365,144,-144.0
366,88,-88.0
367,154,-154.0
368,137,-137.0
369,137,-137.0
370,153,-153.0
371,146,-146.0
372,140,-140.0
373,83,-83.0
374,154,-154.0
375,146,-146.0
376,145,-145.0
377,145,-145.0
378,142,-142.0
379,95,-95.0
380,144,-144.0
381,85,-85.0
382,85,-85.0
383,147,-147.0
384,155,-155.0
385,142,-142.0
386,151,-151.0
387,95,-95.0
388,91,-91.0
389,134,-134.0
390,135,-135.0
391,138,-138.0
392,186,-186.0
393,139,-139.0
394,163,-163.0
395,156,-156.0
396,143,-143.0
397,162,-162.0
398,123,-123.0
399,139,-139.0
400,160,-160.0
401,141,-141.0
402,136,-136.0
403,148,-148.0
404,144,-144.0
405,140,-140.0
406,94,-94.0
407,102,-102.0
408,148,-148.0
409,144,-144.0
410,137,-137.0
411,110,-110.0
412,113,-113.0
413,136,-136.0
414,136,-136.0
415,116,-116.0
416,110,-110.0
417,125,-125.0
418,91,-91.0
419,143,-143.0
420,133,-133.0
421,137,-137.0
422,146,-146.0
423,166,-166.0
424,168,-168.0
425,174,-174.0
426,114,-114.0
427,153,-153.0
428,154,-154.0
429,151,-151.0
430,149,-149.0
431,101,-101.0
432,111,-111.0
433,145,-145.0
434,152,-152.0
435,158,-158.0
436,153,-153.0
437,200,-200.0
438,152,-152.0
439,142,-142.0
440,86,-86.0
441,102,-102.0
442,88,-88.0
443,151,-151.0
444,149,-149.0
445,144,-144.0
446,178,-178.0
447,87,-87.0
448,148,-148.0
449,149,-149.0
450,150,-150.0
451,148,-148.0
452,95,-95.0
453,159,-159.0
454,154,-154.0
455,154,-154.0
456,147,-147.0
457,154,-154.0
458,148,-148.0
459,142,-142.0
460,83,-83.0
461,147,-147.0
462,87,-87.0
463,148,-148.0
464,154,-154.0
465,85,-85.0
466,141,-141.0
467,156,-156.0
468,157,-157.0
469,157,-157.0
470,163,-163.0
471,86,-86.0
472,154,-154.0
473,159,-159.0
474,153,-153.0
475,158,-158.0
476,161,-161.0
477,162,-162.0
478,168,-168.0
479,163,-163.0
480,157,-157.0
481,157,-157.0
482,168,-168.0
483,155,-155.0
484,151,-151.0
485,200,-200.0
486,142,-142.0
487,88,-88.0
488,157,-157.0
489,134,-134.0
490,88,-88.0
491,93,-93.0
492,145,-145.0
493,141,-141.0
494,140,-140.0
495,149,-149.0
496,142,-142.0
497,165,-165.0
498,139,-139.0
499,165,-165.0
500,85,-85.0
501,143,-143.0
502,142,-142.0
503,138,-138.0
504,148,-148.0
505,143,-143.0
506,147,-147.0
507,155,-155.0
508,146,-146.0
509,145,-145.0
510,200,-200.0
511,149,-149.0
512,145,-145.0
513,200,-200.0
514,152,-152.0
515,200,-200.0
516,145,-145.0
517,200,-200.0
518,152,-152.0
519,200,-200.0
520,143,-143.0
521,141,-141.0
522,151,-151.0
523,145,-145.0
524,145,-145.0
525,145,-145.0
526,161,-161.0
527,153,-153.0
528,141,-141.0
529,200,-200.0
530,137,-137.0
531,132,-132.0
532,85,-85.0
533,139,-139.0
534,132,-132.0
535,156,-156.0
536,91,-91.0
537,150,-150.0
538,106,-106.0
539,156,-156.0
540,142,-142.0
541,140,-140.0
542,169,-169.0
543,88,-88.0
544,136,-136.0
545,144,-144.0
546,147,-147.0
547,104,-104.0
548,98,-98.0
549,156,-156.0
550,183,-183.0
551,89,-89.0
552,161,-161.0
553,164,-164.0
554,153,-153.0
555,172,-172.0
556,90,-90.0
557,166,-166.0
558,160,-160.0
559,158,-158.0
560,156,-156.0
561,166,-166.0
562,165,-165.0
563,178,-178.0
564,162,-162.0
565,88,-88.0
566,139,-139.0
567,86,-86.0
568,88,-88.0
569,171,-171.0
570,152,-152.0
571,150,-150.0
572,139,-139.0
573,144,-144.0
574,150,-150.0
575,94,-94.0
576,99,-99.0
577,162,-162.0
578,87,-87.0
579,85,-85.0
580,170,-170.0
581,87,-87.0
582,155,-155.0
583,95,-95.0
584,150,-150.0
585,153,-153.0
586,147,-147.0
587,96,-96.0
588,146,-146.0
589,148,-148.0
590,142,-142.0
591,141,-141.0
592,180,-180.0
593,183,-183.0
594,123,-123.0
595,160,-160.0
596,141,-141.0
597,166,-166.0
598,142,-142.0
599,152,-152.0
600,163,-163.0
601,146,-146.0
602,156,-156.0
603,155,-155.0
604,158,-158.0
605,123,-123.0
606,163,-163.0
607,170,-170.0
608,148,-148.0
609,192,-192.0
610,164,-164.0
611,146,-146.0
612,173,-173.0
613,144,-144.0
614,142,-142.0
615,178,-178.0
616,145,-145.0
617,153,-153.0
618,143,-143.0
619,95,-95.0
620,160,-160.0
621,149,-149.0
622,168,-168.0
623,155,-155.0
624,167,-167.0
625,200,-200.0
626,150,-150.0
627,178,-178.0
628,186,-186.0
629,101,-101.0
630,169,-169.0
631,145,-145.0
632,150,-150.0
633,199,-199.0
634,157,-157.0
635,168,-168.0
636,174,-174.0
637,153,-153.0
638,149,-149.0
639,90,-90.0
640,96,-96.0
641,96,-96.0
642,143,-143.0
643,184,-184.0
644,169,-169.0
645,93,-93.0
646,164,-164.0
647,93,-93.0
648,113,-113.0
649,102,-102.0
650,151,-151.0
651,145,-145.0
652,161,-161.0
653,87,-87.0
654,91,-91.0
655,139,-139.0
656,167,-167.0
657,144,-144.0
658,88,-88.0
659,147,-147.0
660,88,-88.0
661,100,-100.0
662,189,-189.0
663,138,-138.0
664,159,-159.0
665,144,-144.0
666,86,-86.0
667,140,-140.0
668,200,-200.0
669,200,-200.0
670,200,-200.0
671,97,-97.0
672,90,-90.0
673,171,-171.0
674,162,-162.0
675,108,-108.0
676,163,-163.0
677,162,-162.0
678,152,-152.0
679,165,-165.0
680,159,-159.0
681,93,-93.0
682,200,-200.0
683,101,-101.0
684,163,-163.0
685,156,-156.0
686,155,-155.0
687,187,-187.0
688,200,-200.0
689,93,-93.0
690,113,-113.0
691,104,-104.0
692,145,-145.0
693,97,-97.0
694,180,-180.0
695,160,-160.0
696,144,-144.0
697,116,-116.0
698,145,-145.0
699,139,-139.0
700,200,-200.0
701,93,-93.0
702,147,-147.0
703,96,-96.0
704,148,-148.0
705,109,-109.0
706,187,-187.0
707,151,-151.0
708,168,-168.0
709,123,-123.0
710,149,-149.0
711,171,-171.0
712,200,-200.0
713,95,-95.0
714,169,-169.0
715,87,-87.0
716,86,-86.0
717,200,-200.0
718,157,-157.0
719,95,-95.0
720,103,-103.0
721,166,-166.0
722,85,-85.0
723,157,-157.0
724,111,-111.0
725,158,-158.0
726,200,-200.0
727,125,-125.0
728,88,-88.0
729,200,-200.0
730,86,-86.0
731,101,-101.0
732,158,-158.0
733,200,-200.0
734,198,-198.0
735,156,-156.0
736,108,-108.0
737,162,-162.0
738,91,-91.0
739,200,-200.0
740,162,-162.0
741,200,-200.0
742,189,-189.0
743,200,-200.0
744,161,-161.0
745,153,-153.0
746,160,-160.0
747,118,-118.0
748,159,-159.0
749,136,-136.0
750,103,-103.0
751,197,-197.0
752,200,-200.0
753,159,-159.0
754,200,-200.0
755,200,-200.0
756,125,-125.0
757,200,-200.0
758,200,-200.0
759,171,-171.0
760,138,-138.0
761,171,-171.0
762,142,-142.0
763,200,-200.0
764,200,-200.0
765,175,-175.0
766,171,-171.0
767,185,-185.0
768,200,-200.0
769,186,-186.0
770,121,-121.0
771,107,-107.0
772,200,-200.0
773,173,-173.0
774,200,-200.0
775,200,-200.0
776,135,-135.0
777,200,-200.0
778,200,-200.0
779,112,-112.0
780,200,-200.0
781,200,-200.0
782,200,-200.0
783,200,-200.0
784,200,-200.0
785,92,-92.0
786,128,-128.0
787,172,-172.0
788,192,-192.0
789,190,-190.0
790,110,-110.0
791,167,-167.0
792,194,-194.0
793,125,-125.0
794,159,-159.0
795,200,-200.0
796,200,-200.0
797,167,-167.0
798,188,-188.0
799,91,-91.0
800,87,-87.0
801,153,-153.0
802,126,-126.0
803,164,-164.0
804,175,-175.0
805,133,-133.0
806,173,-173.0
807,98,-98.0
808,95,-95.0
809,94,-94.0
810,170,-170.0
811,200,-200.0
812,103,-103.0
813,174,-174.0
814,159,-159.0
815,129,-129.0
816,98,-98.0
817,91,-91.0
818,200,-200.0
819,95,-95.0
820,161,-161.0
821,115,-115.0
822,162,-162.0
823,89,-89.0
824,126,-126.0
825,200,-200.0
826,169,-169.0
827,132,-132.0
828,91,-91.0
829,156,-156.0
830,148,-148.0
831,169,-169.0
832,148,-148.0
833,124,-124.0
834,112,-112.0
835,148,-148.0
836,158,-158.0
837,88,-88.0
838,159,-159.0
839,159,-159.0
840,149,-149.0
841,149,-149.0
842,151,-151.0
843,164,-164.0
844,154,-154.0
845,145,-145.0
846,87,-87.0
847,91,-91.0
848,182,-182.0
849,91,-91.0
850,156,-156.0
851,96,-96.0
852,189,-189.0
853,99,-99.0
854,101,-101.0
855,156,-156.0
856,151,-151.0
857,174,-174.0
858,166,-166.0
859,153,-153.0
860,196,-196.0
861,147,-147.0
862,155,-155.0
863,155,-155.0
864,147,-147.0
865,153,-153.0
866,139,-139.0
867,141,-141.0
868,178,-178.0
869,98,-98.0
870,113,-113.0
871,144,-144.0
872,89,-89.0
873,143,-143.0
874,139,-139.0
875,155,-155.0
876,151,-151.0
877,113,-113.0
878,143,-143.0
879,182,-182.0
880,159,-159.0
881,117,-117.0
882,140,-140.0
883,104,-104.0
884,114,-114.0
885,113,-113.0
886,156,-156.0
887,111,-111.0
888,155,-155.0
889,160,-160.0
890,159,-159.0
891,88,-88.0
892,118,-118.0
893,159,-159.0
894,168,-168.0
895,92,-92.0
896,84,-84.0
897,102,-102.0
898,122,-122.0
899,115,-115.0
900,156,-156.0
901,145,-145.0
902,93,-93.0
903,166,-166.0
904,187,-187.0
905,86,-86.0
906,159,-159.0
907,92,-92.0
908,164,-164.0
909,161,-161.0
910,180,-180.0
911,186,-186.0
912,157,-157.0
913,157,-157.0
914,158,-158.0
915,159,-159.0
916,157,-157.0
917,162,-162.0
918,106,-106.0
919,86,-86.0
920,160,-160.0
921,156,-156.0
922,152,-152.0
923,96,-96.0
924,192,-192.0
925,88,-88.0
926,91,-91.0
927,112,-112.0
928,161,-161.0
929,151,-151.0
930,98,-98.0
931,188,-188.0
932,157,-157.0
933,162,-162.0
934,190,-190.0
935,168,-168.0
936,100,-100.0
937,89,-89.0
938,112,-112.0
939,156,-156.0
940,174,-174.0
941,156,-156.0
942,164,-164.0
943,132,-132.0
944,158,-158.0
945,200,-200.0
946,200,-200.0
947,200,-200.0
948,85,-85.0
949,200,-200.0
950,157,-157.0
951,89,-89.0
952,192,-192.0
953,200,-200.0
954,200,-200.0
955,136,-136.0
956,200,-200.0
957,200,-200.0
958,139,-139.0
959,200,-200.0
960,114,-114.0
961,120,-120.0
962,118,-118.0
963,102,-102.0
964,165,-165.0
965,158,-158.0
966,200,-200.0
967,145,-145.0
968,121,-121.0
969,94,-94.0
970,90,-90.0
971,153,-153.0
972,180,-180.0
973,140,-140.0
974,159,-159.0
975,198,-198.0
976,115,-115.0
977,117,-117.0
978,114,-114.0
979,165,-165.0
980,99,-99.0
981,87,-87.0
982,154,-154.0
983,122,-122.0
984,117,-117.0
985,116,-116.0
986,117,-117.0
987,157,-157.0
988,101,-101.0
989,117,-117.0
990,111,-111.0
991,86,-86.0
992,150,-150.0
993,92,-92.0
994,109,-109.0
995,149,-149.0
996,86,-86.0
997,190,-190.0
998,163,-163.0
999,121,-121.0
1000,122,-122.0
1001,114,-114.0
1002,115,-115.0
1003,119,-119.0
1004,114,-114.0
1005,160,-160.0
1006,92,-92.0
1007,85,-85.0
1008,147,-147.0
1009,90,-90.0
1010,156,-156.0
1011,151,-151.0
1012,152,-152.0
1013,168,-168.0
1014,120,-120.0
1015,97,-97.0
1016,125,-125.0
1017,119,-119.0
1018,114,-114.0
1019,149,-149.0
1020,116,-116.0
1021,88,-88.0
1022,130,-130.0
1023,119,-119.0
1024,111,-111.0
1025,89,-89.0
1026,84,-84.0
1027,88,-88.0
1028,125,-125.0
1029,146,-146.0
1030,151,-151.0
1031,148,-148.0
1032,123,-123.0
1033,94,-94.0
1034,172,-172.0
1035,99,-99.0
1036,147,-147.0
1037,152,-152.0
1038,102,-102.0
1039,89,-89.0
1040,88,-88.0
1041,101,-101.0
1042,114,-114.0
1043,116,-116.0
1044,149,-149.0
1045,120,-120.0
1046,114,-114.0
1047,112,-112.0
1048,95,-95.0
1049,110,-110.0
1050,87,-87.0
1051,149,-149.0
1052,119,-119.0
1053,111,-111.0
1054,87,-87.0
1055,114,-114.0
1056,111,-111.0
1057,111,-111.0
1058,153,-153.0
1059,106,-106.0
1060,110,-110.0
1061,112,-112.0
1062,114,-114.0
1063,88,-88.0
1064,95,-95.0
1065,113,-113.0
1066,130,-130.0
1067,90,-90.0
1068,105,-105.0
1069,111,-111.0
1070,105,-105.0
1071,168,-168.0
1072,115,-115.0
1073,119,-119.0
1074,123,-123.0
1075,111,-111.0
1076,149,-149.0
1077,93,-93.0
1078,154,-154.0
1079,169,-169.0
1080,152,-152.0
1081,130,-130.0
1082,86,-86.0
1083,123,-123.0
1084,107,-107.0
1085,84,-84.0
1086,125,-125.0
1087,128,-128.0
1088,94,-94.0
1089,124,-124.0
1090,118,-118.0
1091,112,-112.0
1092,90,-90.0
1093,126,-126.0
1094,120,-120.0
1095,123,-123.0
1096,189,-189.0
1097,116,-116.0
1098,108,-108.0
1099,116,-116.0
1100,94,-94.0
1101,112,-112.0
1102,111,-111.0
1103,106,-106.0
1104,84,-84.0
1105,120,-120.0
1106,159,-159.0
1107,147,-147.0
1108,98,-98.0
1109,128,-128.0
1110,143,-143.0
1111,116,-116.0
1112,169,-169.0
1113,125,-125.0
1114,120,-120.0
1115,90,-90.0
1116,120,-120.0
1117,127,-127.0
1118,116,-116.0
1119,114,-114.0
1120,122,-122.0
1121,153,-153.0
1122,123,-123.0
1123,130,-130.0
1124,173,-173.0
1125,163,-163.0
1126,141,-141.0
1127,106,-106.0
1128,133,-133.0
1129,110,-110.0
1130,92,-92.0
1131,145,-145.0
1132,163,-163.0
1133,103,-103.0
1134,200,-200.0
1135,144,-144.0
1136,181,-181.0
1137,147,-147.0
1138,155,-155.0
1139,173,-173.0
1140,117,-117.0
1141,169,-169.0
1142,163,-163.0
1143,178,-178.0
1144,149,-149.0
1145,128,-128.0
1146,174,-174.0
1147,145,-145.0
1148,163,-163.0
1149,141,-141.0
1150,138,-138.0
1151,151,-151.0
1152,142,-142.0
1153,187,-187.0
1154,169,-169.0
1155,155,-155.0
1156,119,-119.0
1157,130,-130.0
1158,155,-155.0
1159,110,-110.0
1160,146,-146.0
1161,156,-156.0
1162,149,-149.0
1163,150,-150.0
1164,155,-155.0
1165,157,-157.0
1166,173,-173.0
1167,136,-136.0
1168,135,-135.0
1169,112,-112.0
1170,108,-108.0
1171,110,-110.0
1172,141,-141.0
1173,114,-114.0
1174,115,-115.0
1175,159,-159.0
1176,146,-146.0
1177,111,-111.0
1178,113,-113.0
1179,111,-111.0
1180,114,-114.0
1181,109,-109.0
1182,122,-122.0
1183,108,-108.0
1184,156,-156.0
1185,163,-163.0
1186,120,-120.0
1187,112,-112.0
1188,105,-105.0
1189,116,-116.0
1190,118,-118.0
1191,110,-110.0
1192,157,-157.0
1193,160,-160.0
1194,160,-160.0
1195,111,-111.0
1196,153,-153.0
1197,159,-159.0
1198,161,-161.0
1199,111,-111.0
1200,155,-155.0
1201,138,-138.0
1202,162,-162.0
1203,107,-107.0
1204,108,-108.0
1205,163,-163.0
1206,156,-156.0
1207,158,-158.0
1208,156,-156.0
1209,116,-116.0
1210,89,-89.0
1211,153,-153.0
1212,115,-115.0
1213,151,-151.0
1214,92,-92.0
1215,150,-150.0
1216,98,-98.0
1217,88,-88.0
1218,154,-154.0
1219,88,-88.0
1220,99,-99.0
1221,109,-109.0
1222,153,-153.0
1223,105,-105.0
1224,110,-110.0
1225,167,-167.0
1226,89,-89.0
1227,110,-110.0
1228,97,-97.0
1229,107,-107.0
1230,107,-107.0
1231,149,-149.0
1232,86,-86.0
1233,112,-112.0
1234,89,-89.0
1235,155,-155.0
1236,160,-160.0
1237,161,-161.0
1238,186,-186.0
1239,179,-179.0
1240,93,-93.0
1241,155,-155.0
1242,150,-150.0
1243,92,-92.0
1244,91,-91.0
1245,176,-176.0
1246,163,-163.0
1247,84,-84.0
1248,120,-120.0
1249,155,-155.0
1250,148,-148.0
1251,116,-116.0
1252,89,-89.0
1253,123,-123.0
1254,106,-106.0
1255,110,-110.0
1256,95,-95.0
1257,149,-149.0
1258,87,-87.0
1259,95,-95.0
1260,146,-146.0
1261,87,-87.0
1262,174,-174.0
1263,149,-149.0
1264,110,-110.0
1265,83,-83.0
1266,119,-119.0
1267,200,-200.0
1268,200,-200.0
1269,166,-166.0
1270,155,-155.0
1271,153,-153.0
1272,145,-145.0
1273,162,-162.0
1274,146,-146.0
1275,149,-149.0
1276,148,-148.0
1277,149,-149.0
1278,155,-155.0
1279,154,-154.0
1280,94,-94.0
1281,156,-156.0
1282,157,-157.0
1283,149,-149.0
1284,147,-147.0
1285,144,-144.0
1286,99,-99.0
1287,89,-89.0
1288,145,-145.0
1289,85,-85.0
1290,136,-136.0
1291,145,-145.0
1292,184,-184.0
1293,161,-161.0
1294,85,-85.0
1295,150,-150.0
1296,141,-141.0
1297,86,-86.0
1298,144,-144.0
1299,85,-85.0
1300,100,-100.0
1301,144,-144.0
1302,85,-85.0
1303,163,-163.0
1304,85,-85.0
1305,143,-143.0
1306,88,-88.0
1307,86,-86.0
1308,87,-87.0
1309,153,-153.0
1310,152,-152.0
1311,149,-149.0
1312,106,-106.0
1313,145,-145.0
1314,152,-152.0
1315,88,-88.0
1316,159,-159.0
1317,141,-141.0
1318,200,-200.0
1319,150,-150.0
1320,147,-147.0
1321,93,-93.0
1322,145,-145.0
1323,87,-87.0
1324,141,-141.0
1325,85,-85.0
1326,95,-95.0
1327,153,-153.0
1328,141,-141.0
1329,152,-152.0
1330,149,-149.0
1331,105,-105.0
1332,138,-138.0
1333,91,-91.0
1334,121,-121.0
1335,88,-88.0
1336,85,-85.0
1337,108,-108.0
1338,138,-138.0
1339,140,-140.0
1340,137,-137.0
1341,91,-91.0
1342,141,-141.0
1343,137,-137.0
1344,134,-134.0
1345,200,-200.0
1346,137,-137.0
1347,146,-146.0
1348,149,-149.0
1349,92,-92.0
1350,145,-145.0
1351,141,-141.0
1352,142,-142.0
1353,138,-138.0
1354,141,-141.0
1355,138,-138.0
1356,141,-141.0
1357,135,-135.0
1358,140,-140.0
1359,139,-139.0
1360,140,-140.0
1361,141,-141.0
1362,143,-143.0
1363,155,-155.0
1364,136,-136.0
1365,149,-149.0
1366,152,-152.0
1367,88,-88.0
1368,163,-163.0
1369,141,-141.0
1370,85,-85.0
1371,159,-159.0
1372,136,-136.0
1373,171,-171.0
1374,103,-103.0
1375,136,-136.0
1376,138,-138.0
1377,144,-144.0
1378,152,-152.0
1379,157,-157.0
1380,92,-92.0
1381,100,-100.0
1382,147,-147.0
1383,147,-147.0
1384,152,-152.0
1385,200,-200.0
1386,174,-174.0
1387,182,-182.0
1388,133,-133.0
1389,117,-117.0
1390,137,-137.0
1391,169,-169.0
1392,134,-134.0
1393,133,-133.0
1394,180,-180.0
1395,114,-114.0
1396,113,-113.0
1397,93,-93.0
1398,142,-142.0
1399,91,-91.0
1400,141,-141.0
1401,159,-159.0
1402,99,-99.0
1403,111,-111.0
1404,116,-116.0
1405,187,-187.0
1406,93,-93.0
1407,146,-146.0
1408,131,-131.0
1409,145,-145.0
1410,147,-147.0
1411,181,-181.0
1412,161,-161.0
1413,191,-191.0
1414,164,-164.0
1415,114,-114.0
1416,153,-153.0
1417,154,-154.0
1418,103,-103.0
1419,148,-148.0
1420,153,-153.0
1421,151,-151.0
1422,151,-151.0
1423,153,-153.0
1424,145,-145.0
1425,109,-109.0
1426,147,-147.0
1427,130,-130.0
1428,112,-112.0
1429,117,-117.0
1430,178,-178.0
1431,194,-194.0
1432,117,-117.0
1433,119,-119.0
1434,200,-200.0
1435,124,-124.0
1436,125,-125.0
1437,124,-124.0
1438,112,-112.0
1439,199,-199.0
1440,135,-135.0
1441,137,-137.0
1442,200,-200.0
1443,116,-116.0
1444,128,-128.0
1445,141,-141.0
1446,125,-125.0
1447,190,-190.0
1448,177,-177.0
1449,125,-125.0
1450,200,-200.0
1451,117,-117.0
1452,179,-179.0
1453,182,-182.0
1454,200,-200.0
1455,114,-114.0
1456,176,-176.0
1457,119,-119.0
1458,110,-110.0
1459,111,-111.0
1460,111,-111.0
1461,200,-200.0
1462,159,-159.0
1463,115,-115.0
1464,110,-110.0
1465,110,-110.0
1466,109,-109.0
1467,109,-109.0
1468,110,-110.0
1469,116,-116.0
1470,114,-114.0
1471,163,-163.0
1472,179,-179.0
1473,116,-116.0
1474,169,-169.0
1475,151,-151.0
1476,111,-111.0
1477,170,-170.0
1478,104,-104.0
1479,156,-156.0
1480,152,-152.0
1481,197,-197.0
1482,106,-106.0
1483,199,-199.0
1484,106,-106.0
1485,155,-155.0
1486,149,-149.0
1487,106,-106.0
1488,156,-156.0
1489,106,-106.0
1490,105,-105.0
1491,147,-147.0
1492,106,-106.0
1493,105,-105.0
1494,170,-170.0
1495,106,-106.0
1496,106,-106.0
1497,129,-129.0
1498,150,-150.0
1499,184,-184.0
1500,87,-87.0
1501,106,-106.0
1502,108,-108.0
1503,149,-149.0
1504,143,-143.0
1505,106,-106.0
1506,117,-117.0
1507,110,-110.0
1508,114,-114.0
1509,122,-122.0
1510,163,-163.0
1511,116,-116.0
1512,109,-109.0
1513,104,-104.0
1514,105,-105.0
1515,106,-106.0
1516,86,-86.0
1517,138,-138.0
1518,106,-106.0
1519,106,-106.0
1520,146,-146.0
1521,105,-105.0
1522,107,-107.0
1523,111,-111.0
1524,107,-107.0
1525,93,-93.0
1526,106,-106.0
1527,104,-104.0
1528,108,-108.0
1529,146,-146.0
1530,106,-106.0
1531,106,-106.0
1532,159,-159.0
1533,105,-105.0
1534,110,-110.0
1535,86,-86.0
1536,105,-105.0
1537,105,-105.0
1538,89,-89.0
1539,89,-89.0
1540,109,-109.0
1541,127,-127.0
1542,104,-104.0
1543,104,-104.0
1544,104,-104.0
1545,104,-104.0
1546,105,-105.0
1547,108,-108.0
1548,104,-104.0
1549,106,-106.0
1550,107,-107.0
1551,119,-119.0
1552,109,-109.0
1553,104,-104.0
1554,105,-105.0
1555,97,-97.0
1556,133,-133.0
1557,153,-153.0
1558,106,-106.0
1559,91,-91.0
1560,95,-95.0
1561,148,-148.0
1562,116,-116.0
1563,158,-158.0
1564,171,-171.0
1565,161,-161.0
1566,147,-147.0
1567,132,-132.0
1568,141,-141.0
1569,148,-148.0
1570,106,-106.0
1571,136,-136.0
1572,150,-150.0
1573,126,-126.0
1574,145,-145.0
1575,135,-135.0
1576,135,-135.0
1577,138,-138.0
1578,139,-139.0
1579,151,-151.0
1580,90,-90.0
1581,96,-96.0
1582,132,-132.0
1583,159,-159.0
1584,138,-138.0
1585,137,-137.0
1586,165,-165.0
1587,169,-169.0
1588,177,-177.0
1589,191,-191.0
1590,133,-133.0
1591,134,-134.0
1592,131,-131.0
1593,87,-87.0
1594,96,-96.0
1595,88,-88.0
1596,136,-136.0
1597,180,-180.0
1598,157,-157.0
1599,111,-111.0
1600,194,-194.0
1601,149,-149.0
1602,174,-174.0
1603,90,-90.0
1604,102,-102.0
1605,107,-107.0
1606,106,-106.0
1607,108,-108.0
1608,88,-88.0
1609,145,-145.0
1610,165,-165.0
1611,86,-86.0
1612,104,-104.0
1613,87,-87.0
1614,144,-144.0
1615,100,-100.0
1616,89,-89.0
1617,108,-108.0
1618,97,-97.0
1619,101,-101.0
1620,160,-160.0
1621,159,-159.0
1622,176,-176.0
1623,108,-108.0
1624,89,-89.0
1625,110,-110.0
1626,105,-105.0
1627,84,-84.0
1628,90,-90.0
1629,116,-116.0
1630,160,-160.0
1631,86,-86.0
1632,114,-114.0
1633,154,-154.0
1634,107,-107.0
1635,200,-200.0
1636,159,-159.0
1637,90,-90.0
1638,86,-86.0
1639,145,-145.0
1640,92,-92.0
1641,152,-152.0
1642,90,-90.0
1643,94,-94.0
1644,139,-139.0
1645,151,-151.0
1646,143,-143.0
1647,92,-92.0
1648,86,-86.0
1649,102,-102.0
1650,88,-88.0
1651,97,-97.0
1652,149,-149.0
1653,86,-86.0
1654,167,-167.0
1655,95,-95.0
1656,159,-159.0
1657,162,-162.0
1658,166,-166.0
1659,152,-152.0
1660,142,-142.0
1661,146,-146.0
1662,178,-178.0
1663,155,-155.0
1664,142,-142.0
1665,151,-151.0
1666,175,-175.0
1667,173,-173.0
1668,200,-200.0
1669,94,-94.0
1670,152,-152.0
1671,156,-156.0
1672,150,-150.0
1673,95,-95.0
1674,180,-180.0
1675,131,-131.0
1676,186,-186.0
1677,152,-152.0
1678,105,-105.0
1679,171,-171.0
1680,105,-105.0
1681,120,-120.0
1682,112,-112.0
1683,92,-92.0
1684,132,-132.0
1685,151,-151.0
1686,190,-190.0
1687,112,-112.0
1688,126,-126.0
1689,94,-94.0
1690,105,-105.0
1691,116,-116.0
1692,111,-111.0
1693,154,-154.0
1694,144,-144.0
1695,119,-119.0
1696,154,-154.0
1697,177,-177.0
1698,122,-122.0
1699,99,-99.0
1700,170,-170.0
1701,114,-114.0
1702,102,-102.0
1703,102,-102.0
1704,159,-159.0
1705,95,-95.0
1706,122,-122.0
1707,101,-101.0
1708,150,-150.0
1709,101,-101.0
1710,99,-99.0
1711,162,-162.0
1712,200,-200.0
1713,125,-125.0
1714,200,-200.0
1715,85,-85.0
1716,200,-200.0
1717,150,-150.0
1718,158,-158.0
1719,146,-146.0
1720,153,-153.0
1721,170,-170.0
1722,200,-200.0
1723,170,-170.0
1724,96,-96.0
1725,98,-98.0
1726,190,-190.0
1727,184,-184.0
1728,157,-157.0
1729,142,-142.0
1730,144,-144.0
1731,180,-180.0
1732,150,-150.0
1733,200,-200.0
1734,86,-86.0
1735,145,-145.0
1736,144,-144.0
1737,150,-150.0
1738,112,-112.0
1739,128,-128.0
1740,144,-144.0
1741,145,-145.0
1742,153,-153.0
1743,142,-142.0
1744,145,-145.0
1745,148,-148.0
1746,101,-101.0
1747,153,-153.0
1748,151,-151.0
1749,150,-150.0
1750,96,-96.0
1751,145,-145.0
1752,161,-161.0
1753,104,-104.0
1754,119,-119.0
1755,89,-89.0
1756,151,-151.0
1757,158,-158.0
1758,91,-91.0
1759,162,-162.0
1760,114,-114.0
1761,142,-142.0
1762,160,-160.0
1763,86,-86.0
1764,183,-183.0
1765,142,-142.0
1766,200,-200.0
1767,144,-144.0
1768,104,-104.0
1769,155,-155.0
1770,143,-143.0
1771,154,-154.0
1772,152,-152.0
1773,143,-143.0
1774,88,-88.0
1775,102,-102.0
1776,161,-161.0
1777,84,-84.0
1778,116,-116.0
1779,200,-200.0
1780,84,-84.0
1781,150,-150.0
1782,150,-150.0
1783,175,-175.0
1784,168,-168.0
1785,104,-104.0
1786,161,-161.0
1787,115,-115.0
1788,189,-189.0
1789,152,-152.0
1790,163,-163.0
1791,167,-167.0
1792,147,-147.0
1793,98,-98.0
1794,143,-143.0
1795,144,-144.0
1796,150,-150.0
1797,149,-149.0
1798,149,-149.0
1799,177,-177.0
1800,84,-84.0
1801,97,-97.0
1802,119,-119.0
1803,157,-157.0
1804,87,-87.0
1805,142,-142.0
1806,145,-145.0
1807,158,-158.0
1808,150,-150.0
1809,164,-164.0
1810,120,-120.0
1811,151,-151.0
1812,184,-184.0
1813,149,-149.0
1814,148,-148.0
1815,158,-158.0
1816,149,-149.0
1817,166,-166.0
1818,142,-142.0
1819,162,-162.0
1820,153,-153.0
1821,88,-88.0
1822,200,-200.0
1823,153,-153.0
1824,120,-120.0
1825,200,-200.0
1826,151,-151.0
1827,200,-200.0
1828,151,-151.0
1829,145,-145.0
1830,147,-147.0
1831,151,-151.0
1832,118,-118.0
1833,89,-89.0
1834,147,-147.0
1835,192,-192.0
1836,192,-192.0
1837,200,-200.0
1838,153,-153.0
1839,142,-142.0
1840,155,-155.0
1841,149,-149.0
1842,143,-143.0
1843,176,-176.0
1844,150,-150.0
1845,85,-85.0
1846,200,-200.0
1847,169,-169.0
1848,153,-153.0
1849,120,-120.0
1850,195,-195.0
1851,196,-196.0
1852,178,-178.0
1853,148,-148.0
1854,200,-200.0
1855,159,-159.0
1856,97,-97.0
1857,156,-156.0
1858,149,-149.0
1859,158,-158.0
1860,200,-200.0
1861,155,-155.0
1862,200,-200.0
1863,152,-152.0
1864,151,-151.0
1865,200,-200.0
1866,153,-153.0
1867,163,-163.0
1868,155,-155.0
1869,148,-148.0
1870,178,-178.0
1871,88,-88.0
1872,181,-181.0
1873,177,-177.0
1874,152,-152.0
1875,169,-169.0
1876,157,-157.0
1877,173,-173.0
1878,159,-159.0
1879,156,-156.0
1880,90,-90.0
1881,94,-94.0
1882,200,-200.0
1883,161,-161.0
1884,192,-192.0
1885,120,-120.0
1886,163,-163.0
1887,193,-193.0
1888,200,-200.0
1889,155,-155.0
1890,148,-148.0
1891,173,-173.0
1892,87,-87.0
1893,200,-200.0
1894,160,-160.0
1895,155,-155.0
1896,92,-92.0
1897,188,-188.0
1898,161,-161.0
1899,149,-149.0
1900,184,-184.0
1901,164,-164.0
1902,167,-167.0
1903,134,-134.0
1904,170,-170.0
1905,151,-151.0
1906,175,-175.0
1907,200,-200.0
1908,164,-164.0
1909,167,-167.0
1910,176,-176.0
1911,176,-176.0
1912,190,-190.0
1913,182,-182.0
1914,184,-184.0
1915,175,-175.0
1916,96,-96.0
1917,90,-90.0
1918,181,-181.0
1919,103,-103.0
1920,143,-143.0
1921,190,-190.0
1922,87,-87.0
1923,84,-84.0
1924,112,-112.0
1925,108,-108.0
1926,190,-190.0
1927,151,-151.0
1928,125,-125.0
1929,174,-174.0
1930,165,-165.0
1931,111,-111.0
1932,161,-161.0
1933,147,-147.0
1934,158,-158.0
1935,159,-159.0
1936,166,-166.0
1937,194,-194.0
1938,87,-87.0
1939,130,-130.0
1940,167,-167.0
1941,173,-173.0
1942,88,-88.0
1943,92,-92.0
1944,200,-200.0
1945,92,-92.0
1946,92,-92.0
1947,168,-168.0
1948,153,-153.0
1949,105,-105.0
1950,145,-145.0
1951,156,-156.0
1952,162,-162.0
1953,172,-172.0
1954,165,-165.0
1955,105,-105.0
1956,182,-182.0
1957,174,-174.0
1958,200,-200.0
1959,86,-86.0
1960,93,-93.0
1961,168,-168.0
1962,165,-165.0
1963,89,-89.0
1964,85,-85.0
1965,87,-87.0
1966,165,-165.0
1967,156,-156.0
1968,153,-153.0
1969,187,-187.0
1970,106,-106.0
1971,162,-162.0
1972,161,-161.0
1973,157,-157.0
1974,166,-166.0
1975,150,-150.0
1976,192,-192.0
1977,94,-94.0
1978,86,-86.0
1979,141,-141.0
1980,162,-162.0
1981,87,-87.0
1982,158,-158.0
1983,155,-155.0
1984,152,-152.0
1985,127,-127.0
1986,187,-187.0
1987,190,-190.0
1988,89,-89.0
1989,153,-153.0
1990,147,-147.0
1991,152,-152.0
1992,155,-155.0
1993,154,-154.0
1994,157,-157.0
1995,148,-148.0
1996,157,-157.0
1997,156,-156.0
1998,98,-98.0
1999,175,-175.0
2000,151,-151.0
2001,154,-154.0
2002,89,-89.0
2003,153,-153.0
2004,148,-148.0
2005,152,-152.0
2006,152,-152.0
2007,163,-163.0
2008,168,-168.0
2009,166,-166.0
2010,158,-158.0
2011,89,-89.0
2012,150,-150.0
2013,155,-155.0
2014,147,-147.0
2015,172,-172.0
2016,107,-107.0
2017,144,-144.0
2018,140,-140.0
2019,138,-138.0
2020,143,-143.0
2021,136,-136.0
2022,135,-135.0
2023,136,-136.0
2024,140,-140.0
2025,137,-137.0
2026,134,-134.0
2027,135,-135.0
2028,149,-149.0
2029,87,-87.0
2030,93,-93.0
2031,151,-151.0
2032,200,-200.0
2033,137,-137.0
2034,143,-143.0
2035,85,-85.0
2036,149,-149.0
2037,143,-143.0
2038,150,-150.0
2039,152,-152.0
2040,156,-156.0
2041,148,-148.0
2042,152,-152.0
2043,162,-162.0
2044,147,-147.0
2045,158,-158.0
2046,95,-95.0
2047,137,-137.0
2048,148,-148.0
2049,146,-146.0
2050,107,-107.0
2051,138,-138.0
2052,113,-113.0
2053,149,-149.0
2054,149,-149.0
2055,156,-156.0
2056,157,-157.0
2057,101,-101.0
2058,144,-144.0
2059,90,-90.0
2060,145,-145.0
2061,87,-87.0
2062,142,-142.0
2063,178,-178.0
2064,97,-97.0
2065,111,-111.0
2066,150,-150.0
2067,90,-90.0
2068,175,-175.0
2069,115,-115.0
2070,184,-184.0
2071,173,-173.0
2072,163,-163.0
2073,157,-157.0
2074,105,-105.0
2075,153,-153.0
2076,151,-151.0
2077,95,-95.0
2078,200,-200.0
2079,140,-140.0
2080,117,-117.0
2081,166,-166.0
2082,158,-158.0
2083,194,-194.0
2084,132,-132.0
2085,184,-184.0
2086,108,-108.0
2087,92,-92.0
2088,200,-200.0
2089,195,-195.0
2090,162,-162.0
2091,184,-184.0
2092,177,-177.0
2093,147,-147.0
2094,153,-153.0
2095,167,-167.0
2096,184,-184.0
2097,152,-152.0
2098,154,-154.0
2099,152,-152.0
2100,177,-177.0
2101,185,-185.0
2102,96,-96.0
2103,117,-117.0
2104,87,-87.0
2105,124,-124.0
2106,89,-89.0
2107,113,-113.0
2108,114,-114.0
2109,110,-110.0
2110,91,-91.0
2111,109,-109.0
2112,108,-108.0
2113,149,-149.0
2114,138,-138.0
2115,91,-91.0
2116,85,-85.0
2117,112,-112.0
2118,92,-92.0
2119,144,-144.0
2120,159,-159.0
2121,90,-90.0
2122,84,-84.0
2123,94,-94.0
2124,109,-109.0
2125,137,-137.0
2126,152,-152.0
2127,112,-112.0
2128,120,-120.0
2129,114,-114.0
2130,183,-183.0
2131,117,-117.0
2132,116,-116.0
2133,151,-151.0
2134,119,-119.0
2135,106,-106.0
2136,124,-124.0
2137,200,-200.0
2138,100,-100.0
2139,188,-188.0
2140,135,-135.0
2141,156,-156.0
2142,146,-146.0
2143,158,-158.0
2144,137,-137.0
2145,125,-125.0
2146,200,-200.0
2147,200,-200.0
2148,200,-200.0
2149,200,-200.0
2150,200,-200.0
2151,200,-200.0
2152,200,-200.0
2153,200,-200.0
2154,153,-153.0
2155,200,-200.0
2156,171,-171.0
2157,200,-200.0
2158,200,-200.0
2159,200,-200.0
2160,200,-200.0
2161,200,-200.0
2162,200,-200.0
2163,200,-200.0
2164,200,-200.0
2165,200,-200.0
2166,200,-200.0
2167,126,-126.0
2168,123,-123.0
2169,125,-125.0
2170,200,-200.0
2171,186,-186.0
2172,189,-189.0
2173,200,-200.0
2174,200,-200.0
2175,200,-200.0
2176,200,-200.0
2177,189,-189.0
2178,200,-200.0
2179,200,-200.0
2180,200,-200.0
2181,200,-200.0
2182,147,-147.0
2183,126,-126.0
2184,200,-200.0
2185,200,-200.0
2186,146,-146.0
2187,197,-197.0
2188,200,-200.0
2189,196,-196.0
2190,200,-200.0
2191,146,-146.0
2192,161,-161.0
2193,137,-137.0
2194,186,-186.0
2195,172,-172.0
2196,142,-142.0
2197,153,-153.0
2198,141,-141.0
2199,159,-159.0
2200,136,-136.0
2201,94,-94.0
2202,200,-200.0
2203,118,-118.0
2204,135,-135.0
2205,97,-97.0
2206,189,-189.0
2207,150,-150.0
2208,162,-162.0
2209,180,-180.0
2210,141,-141.0
2211,146,-146.0
2212,163,-163.0
2213,177,-177.0
2214,140,-140.0
2215,150,-150.0
2216,133,-133.0
2217,136,-136.0
2218,148,-148.0
2219,146,-146.0
2220,138,-138.0
2221,143,-143.0
2222,146,-146.0
2223,181,-181.0
2224,148,-148.0
2225,164,-164.0
2226,144,-144.0
2227,188,-188.0
2228,153,-153.0
2229,142,-142.0
2230,147,-147.0
2231,200,-200.0
2232,152,-152.0
2233,153,-153.0
2234,200,-200.0
2235,194,-194.0
2236,200,-200.0
2237,170,-170.0
2238,152,-152.0
2239,200,-200.0
2240,195,-195.0
2241,129,-129.0
2242,145,-145.0
2243,172,-172.0
2244,177,-177.0
2245,154,-154.0
2246,200,-200.0
2247,161,-161.0
2248,166,-166.0
2249,158,-158.0
2250,150,-150.0
2251,157,-157.0
2252,144,-144.0
2253,157,-157.0
2254,150,-150.0
2255,153,-153.0
2256,152,-152.0
2257,155,-155.0
2258,199,-199.0
2259,163,-163.0
2260,193,-193.0
2261,171,-171.0
2262,168,-168.0
2263,200,-200.0
2264,165,-165.0
2265,176,-176.0
2266,165,-165.0
2267,120,-120.0
2268,156,-156.0
2269,115,-115.0
2270,113,-113.0
2271,168,-168.0
2272,89,-89.0
2273,154,-154.0
2274,90,-90.0
2275,89,-89.0
2276,185,-185.0
2277,119,-119.0
2278,87,-87.0
2279,164,-164.0
2280,116,-116.0
2281,162,-162.0
2282,109,-109.0
2283,180,-180.0
2284,158,-158.0
2285,160,-160.0
2286,84,-84.0
2287,171,-171.0
2288,163,-163.0
2289,115,-115.0
2290,112,-112.0
2291,153,-153.0
2292,84,-84.0
2293,89,-89.0
2294,169,-169.0
2295,95,-95.0
2296,154,-154.0
2297,176,-176.0
2298,154,-154.0
2299,200,-200.0
2300,85,-85.0
2301,160,-160.0
2302,97,-97.0
2303,108,-108.0
2304,162,-162.0
2305,159,-159.0
2306,167,-167.0
2307,160,-160.0
2308,105,-105.0
2309,86,-86.0
2310,153,-153.0
2311,158,-158.0
2312,88,-88.0
2313,89,-89.0
2314,158,-158.0
2315,165,-165.0
2316,120,-120.0
2317,161,-161.0
2318,158,-158.0
2319,124,-124.0
2320,198,-198.0
2321,167,-167.0
2322,120,-120.0
2323,85,-85.0
2324,151,-151.0
2325,111,-111.0
2326,106,-106.0
2327,111,-111.0
2328,162,-162.0
2329,107,-107.0
2330,126,-126.0
2331,156,-156.0
2332,156,-156.0
2333,153,-153.0
2334,189,-189.0
2335,116,-116.0
2336,90,-90.0
2337,156,-156.0
2338,94,-94.0
2339,88,-88.0
2340,168,-168.0
2341,114,-114.0
2342,87,-87.0
2343,156,-156.0
2344,89,-89.0
2345,149,-149.0
2346,168,-168.0
2347,112,-112.0
2348,113,-113.0
2349,152,-152.0
2350,84,-84.0
2351,113,-113.0
2352,84,-84.0
2353,122,-122.0
2354,153,-153.0
2355,158,-158.0
2356,108,-108.0
2357,108,-108.0
2358,109,-109.0
2359,107,-107.0
2360,150,-150.0
2361,150,-150.0
2362,156,-156.0
2363,151,-151.0
2364,145,-145.0
2365,111,-111.0
2366,151,-151.0
2367,117,-117.0
2368,86,-86.0
2369,113,-113.0
2370,115,-115.0
2371,139,-139.0
2372,107,-107.0
2373,169,-169.0
2374,92,-92.0
2375,175,-175.0
2376,111,-111.0
2377,107,-107.0
2378,163,-163.0
2379,106,-106.0
2380,164,-164.0
2381,89,-89.0
2382,112,-112.0
2383,158,-158.0
2384,96,-96.0
2385,140,-140.0
2386,111,-111.0
2387,104,-104.0
2388,149,-149.0
2389,84,-84.0
2390,130,-130.0
2391,149,-149.0
2392,178,-178.0
2393,160,-160.0
2394,96,-96.0
2395,151,-151.0
2396,91,-91.0
2397,104,-104.0
2398,184,-184.0
2399,159,-159.0
2400,163,-163.0
2401,109,-109.0
2402,162,-162.0
2403,107,-107.0
2404,97,-97.0
2405,154,-154.0
2406,134,-134.0
2407,166,-166.0
2408,148,-148.0
2409,169,-169.0
2410,103,-103.0
2411,136,-136.0
2412,136,-136.0
2413,88,-88.0
2414,86,-86.0
2415,138,-138.0
2416,86,-86.0
2417,136,-136.0
2418,106,-106.0
2419,146,-146.0
2420,143,-143.0
2421,166,-166.0
2422,188,-188.0
2423,193,-193.0
2424,89,-89.0
2425,143,-143.0
2426,144,-144.0
2427,200,-200.0
2428,200,-200.0
2429,147,-147.0
2430,146,-146.0
2431,88,-88.0
2432,146,-146.0
2433,200,-200.0
2434,142,-142.0
2435,200,-200.0
2436,142,-142.0
2437,86,-86.0
2438,96,-96.0
2439,185,-185.0
2440,199,-199.0
2441,84,-84.0
2442,141,-141.0
2443,86,-86.0
2444,150,-150.0
2445,145,-145.0
2446,156,-156.0
2447,159,-159.0
2448,152,-152.0
2449,90,-90.0
2450,148,-148.0
2451,179,-179.0
2452,162,-162.0
2453,96,-96.0
2454,164,-164.0
2455,178,-178.0
2456,152,-152.0
2457,101,-101.0
2458,176,-176.0
2459,115,-115.0
2460,91,-91.0
2461,118,-118.0
2462,119,-119.0
2463,101,-101.0
2464,144,-144.0
2465,94,-94.0
2466,84,-84.0
2467,112,-112.0
2468,159,-159.0
2469,143,-143.0
2470,144,-144.0
2471,154,-154.0
2472,112,-112.0
2473,122,-122.0
2474,90,-90.0
2475,145,-145.0
2476,142,-142.0
2477,144,-144.0
2478,117,-117.0
2479,143,-143.0
2480,85,-85.0
2481,114,-114.0
2482,105,-105.0
2483,153,-153.0
2484,92,-92.0
2485,107,-107.0
2486,144,-144.0
2487,89,-89.0
2488,88,-88.0
2489,111,-111.0
2490,107,-107.0
2491,108,-108.0
2492,114,-114.0
2493,99,-99.0
2494,107,-107.0
2495,170,-170.0
2496,109,-109.0
2497,153,-153.0
2498,115,-115.0
2499,146,-146.0
2500,112,-112.0
2501,114,-114.0
2502,115,-115.0
2503,107,-107.0
2504,167,-167.0
2505,107,-107.0
2506,158,-158.0
2507,109,-109.0
2508,141,-141.0
2509,141,-141.0
2510,134,-134.0
2511,106,-106.0
2512,107,-107.0
2513,105,-105.0
2514,139,-139.0
2515,146,-146.0
2516,110,-110.0
2517,143,-143.0
2518,150,-150.0
2519,145,-145.0
2520,106,-106.0
2521,106,-106.0
2522,112,-112.0
2523,111,-111.0
2524,145,-145.0
2525,143,-143.0
2526,144,-144.0
2527,115,-115.0
2528,131,-131.0
2529,164,-164.0
2530,113,-113.0
2531,152,-152.0
2532,175,-175.0
2533,159,-159.0
2534,101,-101.0
2535,125,-125.0
2536,97,-97.0
2537,123,-123.0
2538,119,-119.0
2539,149,-149.0
2540,122,-122.0
2541,130,-130.0
2542,131,-131.0
2543,116,-116.0
2544,125,-125.0
2545,98,-98.0
2546,110,-110.0
2547,116,-116.0
2548,145,-145.0
2549,134,-134.0
2550,141,-141.0
2551,85,-85.0
2552,147,-147.0
2553,122,-122.0
2554,112,-112.0
2555,160,-160.0
2556,200,-200.0
2557,111,-111.0
2558,110,-110.0
2559,111,-111.0
2560,157,-157.0
2561,169,-169.0
2562,119,-119.0
2563,122,-122.0
2564,109,-109.0
2565,154,-154.0
2566,83,-83.0
2567,146,-146.0
2568,87,-87.0
2569,169,-169.0
2570,167,-167.0
2571,173,-173.0
2572,191,-191.0
2573,160,-160.0
2574,165,-165.0
2575,119,-119.0
2576,156,-156.0
2577,107,-107.0
2578,150,-150.0
2579,165,-165.0
2580,170,-170.0
2581,149,-149.0
2582,149,-149.0
2583,153,-153.0
2584,115,-115.0
2585,111,-111.0
2586,111,-111.0
2587,132,-132.0
2588,164,-164.0
2589,159,-159.0
2590,110,-110.0
2591,112,-112.0
2592,115,-115.0
2593,117,-117.0
2594,113,-113.0
2595,118,-118.0
2596,176,-176.0
2597,200,-200.0
2598,200,-200.0
2599,169,-169.0
2600,167,-167.0
2601,200,-200.0
2602,200,-200.0
2603,200,-200.0
2604,189,-189.0
2605,200,-200.0
2606,193,-193.0
2607,150,-150.0
2608,200,-200.0
2609,143,-143.0
2610,200,-200.0
2611,163,-163.0
2612,200,-200.0
2613,200,-200.0
2614,170,-170.0
2615,129,-129.0
2616,135,-135.0
2617,148,-148.0
2618,144,-144.0
2619,158,-158.0
2620,144,-144.0
2621,163,-163.0
2622,145,-145.0
2623,154,-154.0
2624,148,-148.0
2625,155,-155.0
2626,95,-95.0
2627,155,-155.0
2628,161,-161.0
2629,165,-165.0
2630,148,-148.0
2631,151,-151.0
2632,152,-152.0
2633,155,-155.0
2634,154,-154.0
2635,148,-148.0
2636,154,-154.0
2637,152,-152.0
2638,96,-96.0
2639,168,-168.0
2640,160,-160.0
2641,162,-162.0
2642,179,-179.0
2643,180,-180.0
2644,92,-92.0
2645,200,-200.0
2646,164,-164.0
2647,169,-169.0
2648,84,-84.0
2649,200,-200.0
2650,155,-155.0
2651,170,-170.0
2652,165,-165.0
2653,200,-200.0
2654,119,-119.0
2655,183,-183.0
2656,200,-200.0
2657,163,-163.0
2658,153,-153.0
2659,180,-180.0
2660,170,-170.0
2661,200,-200.0
2662,200,-200.0
2663,200,-200.0
2664,130,-130.0
2665,200,-200.0
2666,200,-200.0
2667,200,-200.0
2668,200,-200.0
2669,200,-200.0
2670,163,-163.0
2671,200,-200.0
2672,180,-180.0
2673,200,-200.0
2674,185,-185.0
2675,200,-200.0
2676,200,-200.0
2677,200,-200.0
2678,200,-200.0
2679,174,-174.0
2680,200,-200.0
2681,175,-175.0
2682,200,-200.0
2683,180,-180.0
2684,200,-200.0
2685,176,-176.0
2686,177,-177.0
2687,200,-200.0
2688,200,-200.0
2689,132,-132.0
2690,200,-200.0
2691,200,-200.0
2692,190,-190.0
2693,200,-200.0
2694,124,-124.0
2695,175,-175.0
2696,200,-200.0
2697,175,-175.0
2698,138,-138.0
2699,166,-166.0
2700,132,-132.0
2701,200,-200.0
2702,156,-156.0
2703,116,-116.0
2704,119,-119.0
2705,128,-128.0
2706,123,-123.0
2707,173,-173.0
2708,123,-123.0
2709,130,-130.0
2710,130,-130.0
2711,177,-177.0
2712,135,-135.0
2713,122,-122.0
2714,109,-109.0
2715,122,-122.0
2716,133,-133.0
2717,112,-112.0
2718,174,-174.0
2719,115,-115.0
2720,169,-169.0
2721,114,-114.0
2722,115,-115.0
2723,113,-113.0
2724,157,-157.0
2725,97,-97.0
2726,130,-130.0
2727,130,-130.0
2728,118,-118.0
2729,177,-177.0
2730,200,-200.0
2731,164,-164.0
2732,185,-185.0
2733,169,-169.0
2734,115,-115.0
2735,136,-136.0
2736,177,-177.0
2737,178,-178.0
2738,200,-200.0
2739,157,-157.0
2740,167,-167.0
2741,122,-122.0
2742,200,-200.0
2743,200,-200.0
2744,171,-171.0
2745,174,-174.0
2746,123,-123.0
2747,171,-171.0
2748,165,-165.0
2749,181,-181.0
2750,122,-122.0
2751,182,-182.0
2752,198,-198.0
2753,115,-115.0
2754,177,-177.0
2755,200,-200.0
2756,166,-166.0
2757,114,-114.0
2758,162,-162.0
2759,184,-184.0
2760,166,-166.0
2761,119,-119.0
2762,187,-187.0
2763,173,-173.0
2764,200,-200.0
2765,162,-162.0
2766,159,-159.0
2767,200,-200.0
2768,198,-198.0
2769,117,-117.0
2770,164,-164.0
2771,170,-170.0
2772,120,-120.0
2773,130,-130.0
2774,118,-118.0
2775,143,-143.0
2776,140,-140.0
2777,165,-165.0
2778,156,-156.0
2779,118,-118.0
2780,104,-104.0
2781,159,-159.0
2782,98,-98.0
2783,110,-110.0
2784,163,-163.0
2785,159,-159.0
2786,144,-144.0
2787,141,-141.0
2788,200,-200.0
2789,159,-159.0
2790,113,-113.0
2791,179,-179.0
2792,163,-163.0
2793,170,-170.0
2794,108,-108.0
2795,100,-100.0
2796,162,-162.0
2797,160,-160.0
2798,95,-95.0
2799,120,-120.0
2800,200,-200.0
2801,164,-164.0
2802,159,-159.0
2803,148,-148.0
2804,170,-170.0
2805,200,-200.0
2806,159,-159.0
2807,156,-156.0
2808,103,-103.0
2809,118,-118.0
2810,158,-158.0
2811,170,-170.0
2812,169,-169.0
2813,162,-162.0
2814,161,-161.0
2815,107,-107.0
2816,161,-161.0
2817,102,-102.0
2818,159,-159.0
2819,160,-160.0
2820,176,-176.0
2821,158,-158.0
2822,153,-153.0
2823,161,-161.0
2824,158,-158.0
2825,91,-91.0
2826,158,-158.0
2827,90,-90.0
2828,153,-153.0
2829,162,-162.0
2830,92,-92.0
2831,160,-160.0
2832,158,-158.0
2833,158,-158.0
2834,107,-107.0
2835,176,-176.0
2836,192,-192.0
2837,150,-150.0
2838,167,-167.0
2839,108,-108.0
2840,106,-106.0
2841,105,-105.0
2842,146,-146.0
2843,157,-157.0
2844,105,-105.0
2845,146,-146.0
2846,162,-162.0
2847,164,-164.0
2848,122,-122.0
2849,150,-150.0
2850,155,-155.0
2851,193,-193.0
2852,156,-156.0
2853,97,-97.0
2854,172,-172.0
2855,96,-96.0
2856,108,-108.0
2857,151,-151.0
2858,158,-158.0
2859,158,-158.0
2860,94,-94.0
2861,102,-102.0
2862,200,-200.0
2863,150,-150.0
2864,179,-179.0
2865,99,-99.0
2866,175,-175.0
2867,158,-158.0
2868,161,-161.0
2869,101,-101.0
2870,182,-182.0
2871,100,-100.0
2872,91,-91.0
2873,101,-101.0
2874,159,-159.0
2875,151,-151.0
2876,99,-99.0
2877,181,-181.0
2878,124,-124.0
2879,180,-180.0
2880,200,-200.0
2881,172,-172.0
2882,85,-85.0
2883,180,-180.0
2884,178,-178.0
2885,199,-199.0
2886,115,-115.0
2887,116,-116.0
2888,116,-116.0
2889,190,-190.0
2890,153,-153.0
2891,150,-150.0
2892,118,-118.0
2893,200,-200.0
2894,140,-140.0
2895,126,-126.0
2896,166,-166.0
2897,113,-113.0
2898,149,-149.0
2899,123,-123.0
2900,159,-159.0
2901,161,-161.0
2902,196,-196.0
2903,200,-200.0
2904,200,-200.0
2905,200,-200.0
2906,152,-152.0
2907,185,-185.0
2908,200,-200.0
2909,158,-158.0
2910,120,-120.0
2911,200,-200.0
2912,104,-104.0
2913,151,-151.0
2914,200,-200.0
2915,165,-165.0
2916,162,-162.0
2917,93,-93.0
2918,99,-99.0
2919,148,-148.0
2920,95,-95.0
2921,101,-101.0
2922,153,-153.0
2923,184,-184.0
2924,171,-171.0
2925,153,-153.0
2926,183,-183.0
2927,185,-185.0
2928,178,-178.0
2929,164,-164.0
2930,158,-158.0
2931,173,-173.0
2932,106,-106.0
2933,181,-181.0
2934,148,-148.0
2935,146,-146.0
2936,172,-172.0
2937,93,-93.0
2938,103,-103.0
2939,185,-185.0
2940,189,-189.0
2941,96,-96.0
2942,101,-101.0
2943,170,-170.0
2944,160,-160.0
2945,114,-114.0
2946,157,-157.0
2947,178,-178.0
2948,160,-160.0
2949,123,-123.0
2950,199,-199.0
2951,200,-200.0
2952,200,-200.0
2953,193,-193.0
2954,200,-200.0
2955,167,-167.0
2956,173,-173.0
2957,176,-176.0
2958,200,-200.0
2959,198,-198.0
2960,184,-184.0
2961,166,-166.0
2962,164,-164.0
2963,166,-166.0
2964,160,-160.0
2965,185,-185.0
2966,146,-146.0
2967,200,-200.0
2968,112,-112.0
2969,162,-162.0
2970,151,-151.0
2971,113,-113.0
2972,189,-189.0
2973,146,-146.0
2974,150,-150.0
2975,150,-150.0
2976,149,-149.0
2977,148,-148.0
2978,161,-161.0
2979,169,-169.0
2980,153,-153.0
2981,166,-166.0
2982,156,-156.0
2983,108,-108.0
2984,162,-162.0
2985,164,-164.0
2986,168,-168.0
2987,182,-182.0
2988,120,-120.0
2989,166,-166.0
2990,181,-181.0
2991,157,-157.0
2992,117,-117.0
2993,154,-154.0
2994,177,-177.0
2995,96,-96.0
2996,162,-162.0
2997,99,-99.0
2998,200,-200.0
2999,159,-159.0
3000,151,-151.0
3001,153,-153.0
3002,165,-165.0
3003,152,-152.0
3004,115,-115.0
3005,87,-87.0
3006,167,-167.0
3007,162,-162.0
3008,87,-87.0
3009,89,-89.0
3010,158,-158.0
3011,170,-170.0
3012,165,-165.0
3013,160,-160.0
3014,160,-160.0
3015,111,-111.0
3016,171,-171.0
3017,86,-86.0
3018,142,-142.0
3019,159,-159.0
3020,181,-181.0
3021,165,-165.0
3022,149,-149.0
3023,155,-155.0
3024,164,-164.0
3025,125,-125.0
3026,146,-146.0
3027,99,-99.0
3028,157,-157.0
3029,149,-149.0
3030,164,-164.0
3031,151,-151.0
3032,172,-172.0
3033,152,-152.0
3034,155,-155.0
3035,157,-157.0
3036,157,-157.0
3037,152,-152.0
3038,159,-159.0
3039,107,-107.0
3040,147,-147.0
3041,154,-154.0
3042,150,-150.0
3043,147,-147.0
3044,162,-162.0
3045,161,-161.0
3046,155,-155.0
3047,151,-151.0
3048,163,-163.0
3049,174,-174.0
3050,93,-93.0
3051,168,-168.0
3052,88,-88.0
3053,156,-156.0
3054,157,-157.0
3055,164,-164.0
3056,106,-106.0
3057,148,-148.0
3058,163,-163.0
3059,145,-145.0
3060,176,-176.0
3061,165,-165.0
3062,155,-155.0
3063,144,-144.0
3064,147,-147.0
3065,146,-146.0
3066,165,-165.0
3067,154,-154.0
3068,153,-153.0
3069,141,-141.0
3070,151,-151.0
3071,162,-162.0
3072,143,-143.0
3073,174,-174.0
3074,156,-156.0
3075,157,-157.0
3076,147,-147.0
3077,172,-172.0
3078,164,-164.0
3079,144,-144.0
3080,153,-153.0
3081,101,-101.0
3082,151,-151.0
3083,149,-149.0
3084,180,-180.0
3085,200,-200.0
3086,200,-200.0
3087,95,-95.0
3088,153,-153.0
3089,184,-184.0
3090,155,-155.0
3091,157,-157.0
3092,195,-195.0
3093,91,-91.0
3094,174,-174.0
3095,153,-153.0
3096,183,-183.0
3097,92,-92.0
3098,151,-151.0
3099,169,-169.0
3100,191,-191.0
3101,112,-112.0
3102,168,-168.0
3103,96,-96.0
3104,167,-167.0
3105,97,-97.0
3106,146,-146.0
3107,162,-162.0
3108,91,-91.0
3109,163,-163.0
3110,151,-151.0
3111,152,-152.0
3112,124,-124.0
3113,105,-105.0
3114,111,-111.0
3115,167,-167.0
3116,154,-154.0
3117,108,-108.0
3118,100,-100.0
3119,170,-170.0
3120,200,-200.0
3121,165,-165.0
3122,177,-177.0
3123,146,-146.0
3124,200,-200.0
3125,94,-94.0
3126,148,-148.0
3127,116,-116.0
3128,159,-159.0
3129,196,-196.0
3130,200,-200.0
3131,97,-97.0
3132,163,-163.0
3133,173,-173.0
3134,200,-200.0
3135,92,-92.0
3136,149,-149.0
3137,160,-160.0
3138,163,-163.0
3139,155,-155.0
3140,83,-83.0
3141,200,-200.0
3142,174,-174.0
3143,148,-148.0
3144,150,-150.0
3145,158,-158.0
3146,145,-145.0
3147,181,-181.0
3148,200,-200.0
3149,170,-170.0
3150,107,-107.0
3151,200,-200.0
3152,92,-92.0
3153,200,-200.0
3154,200,-200.0
3155,200,-200.0
3156,200,-200.0
3157,96,-96.0
3158,147,-147.0
3159,170,-170.0
3160,168,-168.0
3161,155,-155.0
3162,158,-158.0
3163,200,-200.0
3164,200,-200.0
3165,185,-185.0
3166,146,-146.0
3167,99,-99.0
3168,171,-171.0
3169,154,-154.0
3170,91,-91.0
3171,94,-94.0
3172,200,-200.0
3173,147,-147.0
3174,187,-187.0
3175,200,-200.0
3176,146,-146.0
3177,156,-156.0
3178,161,-161.0
3179,146,-146.0
3180,166,-166.0
3181,200,-200.0
3182,182,-182.0
3183,173,-173.0
3184,168,-168.0
3185,150,-150.0
3186,166,-166.0
3187,139,-139.0
3188,200,-200.0
3189,154,-154.0
3190,177,-177.0
3191,156,-156.0
3192,167,-167.0
3193,97,-97.0
3194,161,-161.0
3195,152,-152.0
3196,158,-158.0
3197,200,-200.0
3198,200,-200.0
3199,200,-200.0
3200,165,-165.0
3201,95,-95.0
3202,200,-200.0
3203,112,-112.0
3204,162,-162.0
3205,200,-200.0
3206,165,-165.0
3207,169,-169.0
3208,162,-162.0
3209,155,-155.0
3210,176,-176.0
3211,90,-90.0
3212,169,-169.0
3213,108,-108.0
3214,151,-151.0
3215,200,-200.0
3216,145,-145.0
3217,190,-190.0
3218,127,-127.0
3219,200,-200.0
3220,90,-90.0
3221,125,-125.0
3222,200,-200.0
3223,133,-133.0
3224,200,-200.0
3225,200,-200.0
3226,119,-119.0
3227,111,-111.0
3228,200,-200.0
3229,103,-103.0
3230,106,-106.0
3231,91,-91.0
3232,200,-200.0
3233,200,-200.0
3234,200,-200.0
3235,105,-105.0
3236,200,-200.0
3237,200,-200.0
3238,153,-153.0
3239,200,-200.0
3240,162,-162.0
3241,148,-148.0
3242,185,-185.0
3243,160,-160.0
3244,175,-175.0
3245,146,-146.0
3246,160,-160.0
3247,144,-144.0
3248,179,-179.0
3249,162,-162.0
3250,161,-161.0
3251,115,-115.0
3252,149,-149.0
3253,149,-149.0
3254,167,-167.0
3255,135,-135.0
3256,195,-195.0
3257,151,-151.0
3258,149,-149.0
3259,103,-103.0
3260,141,-141.0
3261,176,-176.0
3262,89,-89.0
3263,200,-200.0
3264,200,-200.0
3265,115,-115.0
3266,142,-142.0
3267,137,-137.0
3268,151,-151.0
3269,165,-165.0
3270,110,-110.0
3271,187,-187.0
3272,168,-168.0
3273,192,-192.0
3274,150,-150.0
3275,140,-140.0
3276,142,-142.0
3277,150,-150.0
3278,167,-167.0
3279,98,-98.0
3280,142,-142.0
3281,200,-200.0
3282,200,-200.0
3283,84,-84.0
3284,160,-160.0
3285,117,-117.0
3286,85,-85.0
3287,200,-200.0
3288,152,-152.0
3289,148,-148.0
3290,93,-93.0
3291,166,-166.0
3292,83,-83.0
3293,160,-160.0
3294,151,-151.0
3295,148,-148.0
3296,165,-165.0
3297,155,-155.0
3298,150,-150.0
3299,84,-84.0
3300,90,-90.0
3301,149,-149.0
3302,146,-146.0
3303,154,-154.0
3304,139,-139.0
3305,104,-104.0
3306,97,-97.0
3307,155,-155.0
3308,155,-155.0
3309,157,-157.0
3310,86,-86.0
3311,89,-89.0
3312,86,-86.0
3313,200,-200.0
3314,132,-132.0
3315,94,-94.0
3316,110,-110.0
3317,136,-136.0
3318,160,-160.0
3319,91,-91.0
3320,155,-155.0
3321,133,-133.0
3322,105,-105.0
3323,106,-106.0
3324,200,-200.0
3325,104,-104.0
3326,146,-146.0
3327,168,-168.0
3328,152,-152.0
3329,94,-94.0
3330,85,-85.0
3331,146,-146.0
3332,99,-99.0
3333,149,-149.0
3334,101,-101.0
3335,97,-97.0
3336,106,-106.0
3337,89,-89.0
3338,141,-141.0
3339,95,-95.0
3340,94,-94.0
3341,97,-97.0
3342,146,-146.0
3343,162,-162.0
3344,156,-156.0
3345,143,-143.0
3346,171,-171.0
3347,157,-157.0
3348,138,-138.0
3349,155,-155.0
3350,133,-133.0
3351,137,-137.0
3352,105,-105.0
3353,153,-153.0
3354,155,-155.0
3355,147,-147.0
3356,155,-155.0
3357,87,-87.0
3358,151,-151.0
3359,95,-95.0
3360,111,-111.0
3361,172,-172.0
3362,179,-179.0
3363,139,-139.0
3364,180,-180.0
3365,164,-164.0
3366,103,-103.0
3367,89,-89.0
3368,167,-167.0
3369,148,-148.0
3370,146,-146.0
3371,157,-157.0
3372,106,-106.0
3373,88,-88.0
3374,166,-166.0
3375,175,-175.0
3376,142,-142.0
3377,153,-153.0
3378,88,-88.0
3379,96,-96.0
3380,91,-91.0
3381,150,-150.0
3382,154,-154.0
3383,141,-141.0
3384,149,-149.0
3385,146,-146.0
3386,159,-159.0
3387,176,-176.0
3388,180,-180.0
3389,200,-200.0
3390,200,-200.0
3391,153,-153.0
3392,173,-173.0
3393,152,-152.0
3394,162,-162.0
3395,145,-145.0
3396,181,-181.0
3397,185,-185.0
3398,193,-193.0
3399,147,-147.0
3400,200,-200.0
3401,160,-160.0
3402,161,-161.0
3403,200,-200.0
3404,161,-161.0
3405,158,-158.0
3406,112,-112.0
3407,104,-104.0
3408,110,-110.0
3409,184,-184.0
3410,120,-120.0
3411,199,-199.0
3412,174,-174.0
3413,110,-110.0
3414,156,-156.0
3415,113,-113.0
3416,107,-107.0
3417,128,-128.0
3418,185,-185.0
3419,137,-137.0
3420,122,-122.0
3421,130,-130.0
3422,138,-138.0
3423,144,-144.0
3424,200,-200.0
3425,119,-119.0
3426,112,-112.0
3427,176,-176.0
3428,151,-151.0
3429,200,-200.0
3430,109,-109.0
3431,87,-87.0
3432,200,-200.0
3433,144,-144.0
3434,144,-144.0
3435,145,-145.0
3436,104,-104.0
3437,96,-96.0
3438,145,-145.0
3439,103,-103.0
3440,142,-142.0
3441,109,-109.0
3442,90,-90.0
3443,107,-107.0
3444,168,-168.0
3445,99,-99.0
3446,108,-108.0
3447,126,-126.0
3448,84,-84.0
3449,109,-109.0
3450,106,-106.0
3451,105,-105.0
3452,84,-84.0
3453,102,-102.0
3454,147,-147.0
3455,162,-162.0
3456,95,-95.0
3457,97,-97.0
3458,106,-106.0
3459,158,-158.0
3460,109,-109.0
3461,114,-114.0
3462,87,-87.0
3463,115,-115.0
3464,101,-101.0
3465,89,-89.0
3466,107,-107.0
3467,104,-104.0
3468,104,-104.0
3469,103,-103.0
3470,105,-105.0
3471,161,-161.0
3472,150,-150.0
3473,113,-113.0
3474,109,-109.0
3475,151,-151.0
3476,157,-157.0
3477,89,-89.0
3478,168,-168.0
3479,129,-129.0
3480,102,-102.0
3481,150,-150.0
3482,157,-157.0
3483,162,-162.0
3484,90,-90.0
3485,142,-142.0
3486,155,-155.0
3487,133,-133.0
3488,146,-146.0
3489,89,-89.0
3490,127,-127.0
3491,85,-85.0
3492,115,-115.0
3493,149,-149.0
3494,146,-146.0
3495,105,-105.0
3496,100,-100.0
3497,152,-152.0
3498,157,-157.0
3499,128,-128.0
3500,162,-162.0
3501,86,-86.0
3502,101,-101.0
3503,164,-164.0
3504,98,-98.0
3505,150,-150.0
3506,178,-178.0
3507,150,-150.0
3508,145,-145.0
3509,163,-163.0
3510,179,-179.0
3511,155,-155.0
3512,147,-147.0
3513,165,-165.0
3514,165,-165.0
3515,89,-89.0
3516,147,-147.0
3517,94,-94.0
3518,88,-88.0
3519,155,-155.0
3520,148,-148.0
3521,158,-158.0
3522,200,-200.0
3523,152,-152.0
3524,146,-146.0
3525,168,-168.0
3526,193,-193.0
3527,152,-152.0
3528,158,-158.0
3529,86,-86.0
3530,161,-161.0
3531,120,-120.0
3532,153,-153.0
3533,184,-184.0
3534,84,-84.0
3535,142,-142.0
3536,200,-200.0
3537,156,-156.0
3538,102,-102.0
3539,145,-145.0
3540,149,-149.0
3541,170,-170.0
3542,200,-200.0
3543,152,-152.0
3544,200,-200.0
3545,149,-149.0
3546,189,-189.0
3547,183,-183.0
3548,141,-141.0
3549,200,-200.0
3550,200,-200.0
3551,200,-200.0
3552,200,-200.0
3553,200,-200.0
3554,200,-200.0
3555,200,-200.0
3556,200,-200.0
3557,136,-136.0
3558,144,-144.0
3559,92,-92.0
3560,142,-142.0
3561,142,-142.0
3562,119,-119.0
3563,177,-177.0
3564,95,-95.0
3565,179,-179.0
3566,143,-143.0
3567,176,-176.0
3568,103,-103.0
3569,183,-183.0
3570,170,-170.0
3571,129,-129.0
3572,166,-166.0
3573,123,-123.0
3574,154,-154.0
3575,142,-142.0
3576,157,-157.0
3577,130,-130.0
3578,200,-200.0
3579,141,-141.0
3580,123,-123.0
3581,123,-123.0
3582,200,-200.0
3583,200,-200.0
3584,183,-183.0
3585,125,-125.0
3586,123,-123.0
3587,189,-189.0
3588,200,-200.0
3589,133,-133.0
3590,138,-138.0
3591,183,-183.0
3592,200,-200.0
3593,200,-200.0
3594,115,-115.0
3595,200,-200.0
3596,122,-122.0
3597,200,-200.0
3598,128,-128.0
3599,120,-120.0
3600,152,-152.0
3601,113,-113.0
3602,159,-159.0
3603,120,-120.0
3604,177,-177.0
3605,169,-169.0
3606,145,-145.0
3607,124,-124.0
3608,117,-117.0
3609,170,-170.0
3610,132,-132.0
3611,172,-172.0
3612,116,-116.0
3613,121,-121.0
3614,200,-200.0
3615,126,-126.0
3616,111,-111.0
3617,110,-110.0
3618,113,-113.0
3619,116,-116.0
3620,116,-116.0
3621,135,-135.0
3622,96,-96.0
3623,113,-113.0
3624,155,-155.0
3625,109,-109.0
3626,114,-114.0
3627,108,-108.0
3628,151,-151.0
3629,116,-116.0
3630,118,-118.0
3631,200,-200.0
3632,117,-117.0
3633,149,-149.0
3634,140,-140.0
3635,200,-200.0
3636,116,-116.0
3637,132,-132.0
3638,123,-123.0
3639,119,-119.0
3640,117,-117.0
3641,112,-112.0
3642,101,-101.0
3643,111,-111.0
3644,152,-152.0
3645,132,-132.0
3646,153,-153.0
3647,180,-180.0
3648,118,-118.0
3649,108,-108.0
3650,147,-147.0
3651,109,-109.0
3652,151,-151.0
3653,119,-119.0
3654,138,-138.0
3655,145,-145.0
3656,173,-173.0
3657,124,-124.0
3658,111,-111.0
3659,130,-130.0
3660,122,-122.0
3661,154,-154.0
3662,117,-117.0
3663,118,-118.0
3664,149,-149.0
3665,121,-121.0
3666,153,-153.0
3667,120,-120.0
3668,163,-163.0
3669,155,-155.0
3670,162,-162.0
3671,161,-161.0
3672,131,-131.0
3673,127,-127.0
3674,116,-116.0
3675,113,-113.0
3676,150,-150.0
3677,147,-147.0
3678,200,-200.0
3679,109,-109.0
3680,92,-92.0
3681,158,-158.0
3682,148,-148.0
3683,107,-107.0
3684,149,-149.0
3685,109,-109.0
3686,113,-113.0
3687,117,-117.0
3688,92,-92.0
3689,153,-153.0
3690,100,-100.0
3691,144,-144.0
3692,155,-155.0
3693,152,-152.0
3694,87,-87.0
3695,110,-110.0
3696,100,-100.0
3697,175,-175.0
3698,128,-128.0
3699,113,-113.0
3700,109,-109.0
3701,111,-111.0
3702,142,-142.0
3703,115,-115.0
3704,86,-86.0
3705,116,-116.0
3706,109,-109.0
3707,141,-141.0
3708,136,-136.0
3709,145,-145.0
3710,109,-109.0
3711,110,-110.0
3712,109,-109.0
3713,172,-172.0
3714,139,-139.0
3715,147,-147.0
3716,119,-119.0
3717,86,-86.0
3718,162,-162.0
3719,195,-195.0
3720,105,-105.0
3721,100,-100.0
3722,129,-129.0
3723,143,-143.0
3724,142,-142.0
3725,109,-109.0
3726,113,-113.0
3727,114,-114.0
3728,97,-97.0
3729,111,-111.0
3730,109,-109.0
3731,113,-113.0
3732,155,-155.0
3733,169,-169.0
3734,88,-88.0
3735,113,-113.0
3736,103,-103.0
3737,113,-113.0
3738,110,-110.0
3739,110,-110.0
3740,136,-136.0
3741,84,-84.0
3742,97,-97.0
3743,141,-141.0
3744,116,-116.0
3745,141,-141.0
3746,106,-106.0
3747,114,-114.0
3748,115,-115.0
3749,89,-89.0
3750,119,-119.0
3751,93,-93.0
3752,114,-114.0
3753,120,-120.0
3754,113,-113.0
3755,110,-110.0
3756,113,-113.0
3757,112,-112.0
3758,137,-137.0
3759,195,-195.0
3760,140,-140.0
3761,112,-112.0
3762,86,-86.0
3763,90,-90.0
3764,118,-118.0
3765,110,-110.0
3766,96,-96.0
3767,114,-114.0
3768,114,-114.0
3769,107,-107.0
3770,113,-113.0
3771,113,-113.0
3772,144,-144.0
3773,117,-117.0
3774,84,-84.0
3775,117,-117.0
3776,115,-115.0
3777,101,-101.0
3778,94,-94.0
3779,193,-193.0
3780,110,-110.0
3781,112,-112.0
3782,120,-120.0
3783,105,-105.0
3784,176,-176.0
3785,137,-137.0
3786,111,-111.0
3787,119,-119.0
3788,114,-114.0
3789,111,-111.0
3790,110,-110.0
3791,88,-88.0
3792,110,-110.0
3793,114,-114.0
3794,89,-89.0
3795,87,-87.0
3796,136,-136.0
3797,93,-93.0
3798,107,-107.0
3799,112,-112.0
3800,159,-159.0
3801,171,-171.0
3802,138,-138.0
3803,141,-141.0
3804,112,-112.0
3805,139,-139.0
3806,188,-188.0
3807,102,-102.0
3808,145,-145.0
3809,139,-139.0
3810,97,-97.0
3811,158,-158.0
3812,139,-139.0
3813,101,-101.0
3814,151,-151.0
3815,161,-161.0
3816,137,-137.0
3817,85,-85.0
3818,88,-88.0
3819,137,-137.0
3820,93,-93.0
3821,138,-138.0
3822,141,-141.0
3823,108,-108.0
3824,166,-166.0
3825,88,-88.0
3826,88,-88.0
3827,105,-105.0
3828,138,-138.0
3829,135,-135.0
3830,92,-92.0
3831,144,-144.0
3832,138,-138.0
3833,114,-114.0
3834,146,-146.0
3835,142,-142.0
3836,137,-137.0
3837,145,-145.0
3838,139,-139.0
3839,164,-164.0
3840,144,-144.0
3841,89,-89.0
3842,142,-142.0
3843,144,-144.0
3844,139,-139.0
3845,194,-194.0
3846,148,-148.0
3847,88,-88.0
3848,138,-138.0
3849,183,-183.0
3850,142,-142.0
3851,140,-140.0
3852,142,-142.0
3853,87,-87.0
3854,89,-89.0
3855,98,-98.0
3856,145,-145.0
3857,140,-140.0
3858,139,-139.0
3859,162,-162.0
3860,85,-85.0
3861,88,-88.0
3862,140,-140.0
3863,85,-85.0
3864,145,-145.0
3865,148,-148.0
3866,105,-105.0
3867,146,-146.0
3868,151,-151.0
3869,86,-86.0
3870,163,-163.0
3871,98,-98.0
3872,96,-96.0
3873,108,-108.0
3874,85,-85.0
3875,97,-97.0
3876,151,-151.0
3877,131,-131.0
3878,87,-87.0
3879,145,-145.0
3880,200,-200.0
3881,145,-145.0
3882,151,-151.0
3883,89,-89.0
3884,108,-108.0
3885,155,-155.0
3886,87,-87.0
3887,144,-144.0
3888,108,-108.0
3889,106,-106.0
3890,150,-150.0
3891,104,-104.0
3892,86,-86.0
3893,144,-144.0
3894,149,-149.0
3895,148,-148.0
3896,107,-107.0
3897,153,-153.0
3898,105,-105.0
3899,149,-149.0
3900,89,-89.0
3901,88,-88.0
3902,84,-84.0
3903,122,-122.0
3904,108,-108.0
3905,104,-104.0
3906,107,-107.0
3907,151,-151.0
3908,104,-104.0
3909,107,-107.0
3910,84,-84.0
3911,98,-98.0
3912,153,-153.0
3913,93,-93.0
3914,107,-107.0
3915,107,-107.0
3916,107,-107.0
3917,133,-133.0
3918,99,-99.0
3919,108,-108.0
3920,107,-107.0
3921,165,-165.0
3922,86,-86.0
3923,149,-149.0
3924,104,-104.0
3925,108,-108.0
3926,95,-95.0
3927,200,-200.0
3928,146,-146.0
3929,86,-86.0
3930,94,-94.0
3931,167,-167.0
3932,90,-90.0
3933,103,-103.0
3934,84,-84.0
3935,172,-172.0
3936,157,-157.0
3937,86,-86.0
3938,89,-89.0
3939,105,-105.0
3940,108,-108.0
3941,113,-113.0
3942,166,-166.0
3943,97,-97.0
3944,84,-84.0
3945,98,-98.0
3946,105,-105.0
3947,91,-91.0
3948,92,-92.0
3949,88,-88.0
3950,92,-92.0
3951,176,-176.0
3952,90,-90.0
3953,147,-147.0
3954,145,-145.0
3955,90,-90.0
3956,104,-104.0
3957,152,-152.0
3958,161,-161.0
3959,85,-85.0
3960,110,-110.0
3961,200,-200.0
3962,99,-99.0
3963,157,-157.0
3964,167,-167.0
3965,92,-92.0
3966,147,-147.0
3967,90,-90.0
3968,154,-154.0
3969,153,-153.0
3970,151,-151.0
3971,102,-102.0
3972,91,-91.0
3973,151,-151.0
3974,153,-153.0
3975,94,-94.0
3976,94,-94.0
3977,105,-105.0
3978,148,-148.0
3979,172,-172.0
3980,156,-156.0
3981,113,-113.0
3982,156,-156.0
3983,99,-99.0
3984,146,-146.0
3985,162,-162.0
3986,106,-106.0
3987,176,-176.0
3988,162,-162.0
3989,151,-151.0
3990,200,-200.0
3991,150,-150.0
3992,162,-162.0
3993,153,-153.0
3994,161,-161.0
3995,165,-165.0
3996,92,-92.0
3997,143,-143.0
3998,157,-157.0
3999,200,-200.0
4000,110,-110.0
4001,150,-150.0
4002,155,-155.0
4003,162,-162.0
4004,160,-160.0
4005,154,-154.0
4006,150,-150.0
4007,99,-99.0
4008,150,-150.0
4009,154,-154.0
4010,148,-148.0
4011,163,-163.0
4012,171,-171.0
4013,145,-145.0
4014,156,-156.0
4015,116,-116.0
4016,152,-152.0
4017,106,-106.0
4018,155,-155.0
4019,149,-149.0
4020,123,-123.0
4021,92,-92.0
4022,157,-157.0
4023,147,-147.0
4024,140,-140.0
4025,111,-111.0
4026,107,-107.0
4027,140,-140.0
4028,92,-92.0
4029,106,-106.0
4030,149,-149.0
4031,133,-133.0
4032,151,-151.0
4033,141,-141.0
4034,156,-156.0
4035,88,-88.0
4036,155,-155.0
4037,183,-183.0
4038,98,-98.0
4039,147,-147.0
4040,88,-88.0
4041,149,-149.0
4042,122,-122.0
4043,151,-151.0
4044,146,-146.0
4045,103,-103.0
4046,108,-108.0
4047,144,-144.0
4048,109,-109.0
4049,97,-97.0
4050,149,-149.0
4051,155,-155.0
4052,200,-200.0
4053,176,-176.0
4054,106,-106.0
4055,198,-198.0
4056,157,-157.0
4057,117,-117.0
4058,111,-111.0
4059,109,-109.0
4060,109,-109.0
4061,118,-118.0
4062,110,-110.0
4063,91,-91.0
4064,108,-108.0
4065,102,-102.0
4066,99,-99.0
4067,94,-94.0
4068,103,-103.0
4069,149,-149.0
4070,151,-151.0
4071,148,-148.0
4072,147,-147.0
4073,89,-89.0
4074,150,-150.0
4075,88,-88.0
4076,153,-153.0
4077,190,-190.0
4078,146,-146.0
4079,92,-92.0
4080,105,-105.0
4081,106,-106.0
4082,107,-107.0
4083,111,-111.0
4084,106,-106.0
4085,106,-106.0
4086,200,-200.0
4087,103,-103.0
4088,171,-171.0
4089,85,-85.0
4090,109,-109.0
4091,177,-177.0
4092,107,-107.0
4093,182,-182.0
4094,200,-200.0
4095,175,-175.0
4096,108,-108.0
4097,88,-88.0
4098,94,-94.0
4099,113,-113.0
4100,200,-200.0
4101,200,-200.0
4102,112,-112.0
4103,200,-200.0
4104,200,-200.0
4105,200,-200.0
4106,156,-156.0
4107,165,-165.0
4108,109,-109.0
4109,168,-168.0
4110,90,-90.0
4111,88,-88.0
4112,116,-116.0
4113,158,-158.0
4114,158,-158.0
4115,176,-176.0
4116,175,-175.0
4117,120,-120.0
4118,200,-200.0
4119,152,-152.0
4120,109,-109.0
4121,94,-94.0
4122,146,-146.0
4123,167,-167.0
4124,146,-146.0
4125,154,-154.0
4126,110,-110.0
4127,151,-151.0
4128,151,-151.0
4129,143,-143.0
4130,149,-149.0
4131,92,-92.0
4132,87,-87.0
4133,144,-144.0
4134,147,-147.0
4135,149,-149.0
4136,152,-152.0
4137,120,-120.0
4138,199,-199.0
4139,121,-121.0
4140,144,-144.0
4141,144,-144.0
4142,159,-159.0
4143,143,-143.0
4144,145,-145.0
4145,85,-85.0
4146,86,-86.0
4147,158,-158.0
4148,158,-158.0
4149,95,-95.0
4150,171,-171.0
4151,143,-143.0
4152,156,-156.0
4153,92,-92.0
4154,144,-144.0
4155,153,-153.0
4156,144,-144.0
4157,147,-147.0
4158,92,-92.0
4159,144,-144.0
4160,141,-141.0
4161,149,-149.0
4162,180,-180.0
4163,94,-94.0
4164,143,-143.0
4165,142,-142.0
4166,147,-147.0
4167,143,-143.0
4168,150,-150.0
4169,171,-171.0
4170,140,-140.0
4171,140,-140.0
4172,141,-141.0
4173,87,-87.0
4174,161,-161.0
4175,151,-151.0
4176,141,-141.0
4177,142,-142.0
4178,182,-182.0
4179,84,-84.0
4180,142,-142.0
4181,144,-144.0
4182,160,-160.0
4183,150,-150.0
4184,152,-152.0
4185,144,-144.0
4186,149,-149.0
4187,113,-113.0
4188,111,-111.0
4189,158,-158.0
4190,85,-85.0
4191,161,-161.0
4192,145,-145.0
4193,149,-149.0
4194,120,-120.0
4195,119,-119.0
4196,93,-93.0
4197,177,-177.0
4198,191,-191.0
4199,151,-151.0
4200,156,-156.0
4201,153,-153.0
4202,156,-156.0
4203,158,-158.0
4204,95,-95.0
4205,124,-124.0
4206,151,-151.0
4207,151,-151.0
4208,162,-162.0
4209,89,-89.0
4210,144,-144.0
4211,147,-147.0
4212,110,-110.0
4213,155,-155.0
4214,170,-170.0
4215,142,-142.0
4216,135,-135.0
4217,148,-148.0
4218,147,-147.0
4219,110,-110.0
4220,176,-176.0
4221,171,-171.0
4222,147,-147.0
4223,86,-86.0
4224,147,-147.0
4225,172,-172.0
4226,121,-121.0
4227,86,-86.0
4228,151,-151.0
4229,120,-120.0
4230,118,-118.0
4231,150,-150.0
4232,87,-87.0
4233,157,-157.0
4234,150,-150.0
4235,148,-148.0
4236,149,-149.0
4237,156,-156.0
4238,145,-145.0
4239,153,-153.0
4240,148,-148.0
4241,147,-147.0
4242,154,-154.0
4243,152,-152.0
4244,153,-153.0
4245,159,-159.0
4246,86,-86.0
4247,153,-153.0
4248,154,-154.0
4249,160,-160.0
4250,158,-158.0
4251,149,-149.0
4252,155,-155.0
4253,153,-153.0
4254,156,-156.0
4255,155,-155.0
4256,155,-155.0
4257,115,-115.0
4258,188,-188.0
4259,166,-166.0
4260,113,-113.0
4261,200,-200.0
4262,114,-114.0
4263,119,-119.0
4264,117,-117.0
4265,153,-153.0
4266,179,-179.0
4267,120,-120.0
4268,130,-130.0
4269,155,-155.0
4270,183,-183.0
4271,114,-114.0
4272,109,-109.0
4273,115,-115.0
4274,128,-128.0
4275,141,-141.0
4276,200,-200.0
4277,167,-167.0
4278,182,-182.0
4279,169,-169.0
4280,162,-162.0
4281,159,-159.0
4282,130,-130.0
4283,128,-128.0
4284,200,-200.0
4285,183,-183.0
4286,161,-161.0
4287,177,-177.0
4288,188,-188.0
4289,161,-161.0
4290,159,-159.0
4291,89,-89.0
4292,130,-130.0
4293,179,-179.0
4294,170,-170.0
4295,88,-88.0
4296,90,-90.0
4297,187,-187.0
4298,96,-96.0
4299,171,-171.0
4300,92,-92.0
4301,88,-88.0
4302,92,-92.0
4303,84,-84.0
4304,200,-200.0
4305,200,-200.0
4306,167,-167.0
4307,168,-168.0
4308,200,-200.0
4309,200,-200.0
4310,96,-96.0
4311,149,-149.0
4312,140,-140.0
4313,131,-131.0
4314,133,-133.0
4315,200,-200.0
4316,161,-161.0
4317,200,-200.0
4318,156,-156.0
4319,131,-131.0
4320,143,-143.0
4321,155,-155.0
4322,150,-150.0
4323,139,-139.0
4324,136,-136.0
4325,200,-200.0
4326,141,-141.0
4327,136,-136.0
4328,136,-136.0
4329,143,-143.0
4330,158,-158.0
4331,163,-163.0
4332,158,-158.0
4333,133,-133.0
4334,117,-117.0
4335,170,-170.0
4336,159,-159.0
4337,139,-139.0
4338,200,-200.0
4339,148,-148.0
4340,128,-128.0
4341,140,-140.0
4342,193,-193.0
4343,142,-142.0
4344,195,-195.0
4345,171,-171.0
4346,174,-174.0
4347,173,-173.0
4348,138,-138.0
4349,111,-111.0
4350,123,-123.0
4351,117,-117.0
4352,119,-119.0
4353,191,-191.0
4354,139,-139.0
4355,167,-167.0
4356,200,-200.0
4357,200,-200.0
4358,200,-200.0
4359,111,-111.0
4360,182,-182.0
4361,113,-113.0
4362,161,-161.0
4363,146,-146.0
4364,105,-105.0
4365,200,-200.0
4366,109,-109.0
4367,159,-159.0
4368,112,-112.0
4369,193,-193.0
4370,200,-200.0
4371,198,-198.0
4372,155,-155.0
4373,85,-85.0
4374,107,-107.0
4375,139,-139.0
4376,200,-200.0
4377,104,-104.0
4378,186,-186.0
4379,200,-200.0
4380,175,-175.0
4381,115,-115.0
4382,175,-175.0
4383,135,-135.0
4384,94,-94.0
4385,163,-163.0
4386,123,-123.0
4387,118,-118.0
4388,139,-139.0
4389,147,-147.0
4390,147,-147.0
4391,148,-148.0
4392,115,-115.0
4393,197,-197.0
4394,150,-150.0
4395,108,-108.0
4396,115,-115.0
4397,88,-88.0
4398,112,-112.0
4399,83,-83.0
4400,115,-115.0
