episodes,steps,rewards
0,200,-200.0
1,200,-200.0
2,200,-200.0
3,200,-200.0
4,200,-200.0
5,200,-200.0
6,200,-200.0
7,200,-200.0
8,200,-200.0
9,200,-200.0
10,200,-200.0
11,200,-200.0
12,200,-200.0
13,200,-200.0
14,200,-200.0
15,200,-200.0
16,200,-200.0
17,200,-200.0
18,200,-200.0
19,200,-200.0
20,200,-200.0
21,200,-200.0
22,200,-200.0
23,200,-200.0
24,200,-200.0
25,200,-200.0
26,200,-200.0
27,200,-200.0
28,200,-200.0
29,200,-200.0
30,200,-200.0
31,200,-200.0
32,200,-200.0
33,200,-200.0
34,200,-200.0
35,200,-200.0
36,200,-200.0
37,200,-200.0
38,200,-200.0
39,200,-200.0
40,200,-200.0
41,200,-200.0
42,200,-200.0
43,200,-200.0
44,200,-200.0
45,200,-200.0
46,200,-200.0
47,200,-200.0
48,200,-200.0
49,200,-200.0
50,200,-200.0
51,200,-200.0
52,200,-200.0
53,200,-200.0
54,200,-200.0
55,200,-200.0
56,200,-200.0
57,200,-200.0
58,200,-200.0
59,200,-200.0
60,200,-200.0
61,200,-200.0
62,200,-200.0
63,200,-200.0
64,200,-200.0
65,200,-200.0
66,200,-200.0
67,200,-200.0
68,200,-200.0
69,200,-200.0
70,200,-200.0
71,200,-200.0
72,200,-200.0
73,200,-200.0
74,200,-200.0
75,200,-200.0
76,200,-200.0
77,200,-200.0
78,200,-200.0
79,200,-200.0
80,200,-200.0
81,200,-200.0
82,200,-200.0
83,200,-200.0
84,200,-200.0
85,200,-200.0
86,200,-200.0
87,200,-200.0
88,200,-200.0
89,200,-200.0
90,200,-200.0
91,200,-200.0
92,200,-200.0
93,200,-200.0
94,200,-200.0
95,200,-200.0
96,200,-200.0
97,200,-200.0
98,200,-200.0
99,200,-200.0
100,200,-200.0
101,200,-200.0
102,200,-200.0
103,200,-200.0
104,200,-200.0
105,200,-200.0
106,200,-200.0
107,200,-200.0
108,200,-200.0
109,200,-200.0
110,200,-200.0
111,200,-200.0
112,200,-200.0
113,200,-200.0
114,200,-200.0
115,200,-200.0
116,200,-200.0
117,200,-200.0
118,200,-200.0
119,200,-200.0
120,200,-200.0
121,200,-200.0
122,200,-200.0
123,200,-200.0
124,200,-200.0
125,200,-200.0
126,200,-200.0
127,200,-200.0
128,200,-200.0
129,200,-200.0
130,200,-200.0
131,200,-200.0
132,200,-200.0
133,200,-200.0
134,200,-200.0
135,200,-200.0
136,200,-200.0
137,200,-200.0
138,200,-200.0
139,200,-200.0
140,200,-200.0
141,200,-200.0
142,200,-200.0
143,200,-200.0
144,200,-200.0
145,200,-200.0
146,200,-200.0
147,200,-200.0
148,200,-200.0
149,200,-200.0
150,200,-200.0
151,200,-200.0
152,200,-200.0
153,200,-200.0
154,200,-200.0
155,200,-200.0
156,200,-200.0
157,200,-200.0
158,200,-200.0
159,200,-200.0
160,200,-200.0
161,200,-200.0
162,200,-200.0
163,200,-200.0
164,200,-200.0
165,200,-200.0
166,200,-200.0
167,200,-200.0
168,200,-200.0
169,200,-200.0
170,200,-200.0
171,200,-200.0
172,200,-200.0
173,200,-200.0
174,200,-200.0
175,200,-200.0
176,200,-200.0
177,200,-200.0
178,200,-200.0
179,200,-200.0
180,182,-182.0
181,200,-200.0
182,200,-200.0
183,200,-200.0
184,200,-200.0
185,200,-200.0
186,200,-200.0
187,200,-200.0
188,200,-200.0
189,200,-200.0
190,200,-200.0
191,200,-200.0
192,200,-200.0
193,200,-200.0
194,200,-200.0
195,200,-200.0
196,200,-200.0
197,200,-200.0
198,200,-200.0
199,200,-200.0
200,200,-200.0
201,200,-200.0
202,200,-200.0
203,200,-200.0
204,200,-200.0
205,200,-200.0
206,200,-200.0
207,200,-200.0
208,200,-200.0
209,200,-200.0
210,200,-200.0
211,120,-120.0
212,200,-200.0
213,200,-200.0
214,200,-200.0
215,200,-200.0
216,200,-200.0
217,200,-200.0
218,200,-200.0
219,200,-200.0
220,200,-200.0
221,200,-200.0
222,200,-200.0
223,172,-172.0
224,200,-200.0
225,200,-200.0
226,200,-200.0
227,173,-173.0
228,200,-200.0
229,131,-131.0
230,200,-200.0
231,200,-200.0
232,200,-200.0
233,174,-174.0
234,200,-200.0
235,199,-199.0
236,200,-200.0
237,200,-200.0
238,188,-188.0
239,200,-200.0
240,200,-200.0
241,185,-185.0
242,194,-194.0
243,163,-163.0
244,200,-200.0
245,133,-133.0
246,200,-200.0
247,200,-200.0
248,200,-200.0
249,200,-200.0
250,200,-200.0
251,200,-200.0
252,200,-200.0
253,200,-200.0
254,200,-200.0
255,200,-200.0
256,200,-200.0
257,200,-200.0
258,176,-176.0
259,200,-200.0
260,200,-200.0
261,200,-200.0
262,200,-200.0
263,200,-200.0
264,200,-200.0
265,200,-200.0
266,200,-200.0
267,200,-200.0
268,200,-200.0
269,194,-194.0
270,176,-176.0
271,200,-200.0
272,200,-200.0
273,200,-200.0
274,200,-200.0
275,200,-200.0
276,200,-200.0
277,190,-190.0
278,200,-200.0
279,168,-168.0
280,200,-200.0
281,105,-105.0
282,200,-200.0
283,200,-200.0
284,200,-200.0
285,200,-200.0
286,200,-200.0
287,200,-200.0
288,200,-200.0
289,170,-170.0
290,200,-200.0
291,200,-200.0
292,200,-200.0
293,184,-184.0
294,200,-200.0
295,200,-200.0
296,200,-200.0
297,174,-174.0
298,200,-200.0
299,200,-200.0
300,200,-200.0
301,184,-184.0
302,171,-171.0
303,200,-200.0
304,174,-174.0
305,171,-171.0
306,95,-95.0
307,104,-104.0
308,200,-200.0
309,200,-200.0
310,160,-160.0
311,106,-106.0
312,200,-200.0
313,200,-200.0
314,200,-200.0
315,200,-200.0
316,200,-200.0
317,92,-92.0
318,200,-200.0
319,200,-200.0
320,100,-100.0
321,200,-200.0
322,200,-200.0
323,95,-95.0
324,190,-190.0
325,91,-91.0
326,200,-200.0
327,200,-200.0
328,200,-200.0
329,200,-200.0
330,200,-200.0
331,200,-200.0
332,200,-200.0
333,200,-200.0
334,200,-200.0
335,200,-200.0
336,200,-200.0
337,200,-200.0
338,200,-200.0
339,200,-200.0
340,200,-200.0
341,139,-139.0
342,200,-200.0
343,200,-200.0
344,200,-200.0
345,200,-200.0
346,200,-200.0
347,200,-200.0
348,200,-200.0
349,200,-200.0
350,200,-200.0
351,200,-200.0
352,200,-200.0
353,200,-200.0
354,168,-168.0
355,134,-134.0
356,170,-170.0
357,136,-136.0
358,200,-200.0
359,200,-200.0
360,200,-200.0
361,200,-200.0
362,200,-200.0
363,200,-200.0
364,168,-168.0
365,137,-137.0
366,155,-155.0
367,199,-199.0
368,148,-148.0
369,200,-200.0
370,145,-145.0
371,164,-164.0
372,169,-169.0
373,200,-200.0
374,200,-200.0
375,200,-200.0
376,200,-200.0
377,200,-200.0
378,200,-200.0
379,144,-144.0
380,173,-173.0
381,148,-148.0
382,89,-89.0
383,200,-200.0
384,200,-200.0
385,144,-144.0
386,155,-155.0
387,151,-151.0
388,200,-200.0
389,108,-108.0
390,157,-157.0
391,90,-90.0
392,189,-189.0
393,191,-191.0
394,166,-166.0
395,200,-200.0
396,200,-200.0
397,158,-158.0
398,200,-200.0
399,197,-197.0
400,200,-200.0
401,200,-200.0
402,200,-200.0
403,170,-170.0
404,172,-172.0
405,200,-200.0
406,177,-177.0
407,161,-161.0
408,99,-99.0
409,169,-169.0
410,200,-200.0
411,200,-200.0
412,200,-200.0
413,182,-182.0
414,111,-111.0
415,200,-200.0
416,154,-154.0
417,147,-147.0
418,200,-200.0
419,200,-200.0
420,167,-167.0
421,164,-164.0
422,160,-160.0
423,200,-200.0
424,200,-200.0
425,200,-200.0
426,179,-179.0
427,200,-200.0
428,200,-200.0
429,156,-156.0
430,200,-200.0
431,168,-168.0
432,153,-153.0
433,200,-200.0
434,145,-145.0
435,142,-142.0
436,148,-148.0
437,148,-148.0
438,147,-147.0
439,146,-146.0
440,145,-145.0
441,153,-153.0
442,155,-155.0
443,144,-144.0
444,150,-150.0
445,141,-141.0
446,143,-143.0
447,142,-142.0
448,138,-138.0
449,140,-140.0
450,138,-138.0
451,139,-139.0
452,149,-149.0
453,142,-142.0
454,136,-136.0
455,158,-158.0
456,153,-153.0
457,154,-154.0
458,151,-151.0
459,200,-200.0
460,165,-165.0
461,171,-171.0
462,200,-200.0
463,200,-200.0
464,152,-152.0
465,173,-173.0
466,200,-200.0
467,137,-137.0
468,164,-164.0
469,152,-152.0
470,150,-150.0
471,200,-200.0
472,200,-200.0
473,200,-200.0
474,147,-147.0
475,200,-200.0
476,164,-164.0
477,200,-200.0
478,180,-180.0
479,109,-109.0
480,94,-94.0
481,90,-90.0
482,200,-200.0
483,200,-200.0
484,200,-200.0
485,162,-162.0
486,100,-100.0
487,95,-95.0
488,200,-200.0
489,200,-200.0
490,152,-152.0
491,163,-163.0
492,200,-200.0
493,160,-160.0
494,200,-200.0
495,163,-163.0
496,200,-200.0
497,200,-200.0
498,167,-167.0
499,149,-149.0
500,159,-159.0
501,200,-200.0
502,93,-93.0
503,200,-200.0
504,200,-200.0
505,200,-200.0
506,171,-171.0
507,135,-135.0
508,171,-171.0
509,132,-132.0
510,200,-200.0
511,200,-200.0
512,169,-169.0
513,200,-200.0
514,193,-193.0
515,102,-102.0
516,105,-105.0
517,189,-189.0
518,180,-180.0
519,200,-200.0
520,140,-140.0
521,200,-200.0
522,96,-96.0
523,171,-171.0
524,157,-157.0
525,179,-179.0
526,164,-164.0
527,168,-168.0
528,200,-200.0
529,200,-200.0
530,162,-162.0
531,96,-96.0
532,92,-92.0
533,107,-107.0
534,164,-164.0
535,91,-91.0
536,200,-200.0
537,189,-189.0
538,176,-176.0
539,92,-92.0
540,94,-94.0
541,100,-100.0
542,164,-164.0
543,98,-98.0
544,92,-92.0
545,102,-102.0
546,115,-115.0
547,165,-165.0
548,169,-169.0
549,167,-167.0
550,165,-165.0
551,166,-166.0
552,194,-194.0
553,147,-147.0
554,190,-190.0
555,149,-149.0
556,150,-150.0
557,158,-158.0
558,155,-155.0
559,146,-146.0
560,143,-143.0
561,161,-161.0
562,160,-160.0
563,143,-143.0
564,148,-148.0
565,154,-154.0
566,103,-103.0
567,150,-150.0
568,101,-101.0
569,157,-157.0
570,154,-154.0
571,198,-198.0
572,175,-175.0
573,103,-103.0
574,91,-91.0
575,157,-157.0
576,147,-147.0
577,120,-120.0
578,95,-95.0
579,143,-143.0
580,106,-106.0
581,159,-159.0
582,94,-94.0
583,143,-143.0
584,148,-148.0
585,142,-142.0
586,191,-191.0
587,148,-148.0
588,84,-84.0
589,155,-155.0
590,88,-88.0
591,106,-106.0
592,178,-178.0
593,86,-86.0
594,159,-159.0
595,107,-107.0
596,200,-200.0
597,84,-84.0
598,149,-149.0
599,153,-153.0
600,152,-152.0
601,154,-154.0
602,85,-85.0
603,162,-162.0
604,155,-155.0
605,92,-92.0
606,146,-146.0
607,140,-140.0
608,142,-142.0
609,92,-92.0
610,84,-84.0
611,85,-85.0
612,156,-156.0
613,143,-143.0
614,126,-126.0
615,90,-90.0
616,84,-84.0
617,154,-154.0
618,103,-103.0
619,84,-84.0
620,156,-156.0
621,160,-160.0
622,98,-98.0
623,91,-91.0
624,175,-175.0
625,200,-200.0
626,200,-200.0
627,134,-134.0
628,97,-97.0
629,183,-183.0
630,94,-94.0
631,186,-186.0
632,170,-170.0
633,161,-161.0
634,99,-99.0
635,86,-86.0
636,140,-140.0
637,177,-177.0
638,146,-146.0
639,186,-186.0
640,188,-188.0
641,85,-85.0
642,183,-183.0
643,88,-88.0
644,149,-149.0
645,85,-85.0
646,200,-200.0
647,89,-89.0
648,89,-89.0
649,92,-92.0
650,89,-89.0
651,145,-145.0
652,145,-145.0
653,194,-194.0
654,91,-91.0
655,168,-168.0
656,154,-154.0
657,93,-93.0
658,90,-90.0
659,178,-178.0
660,199,-199.0
661,103,-103.0
662,200,-200.0
663,165,-165.0
664,190,-190.0
665,168,-168.0
666,150,-150.0
667,103,-103.0
668,110,-110.0
669,92,-92.0
670,103,-103.0
671,98,-98.0
672,144,-144.0
673,90,-90.0
674,142,-142.0
675,200,-200.0
676,103,-103.0
677,155,-155.0
678,103,-103.0
679,91,-91.0
680,168,-168.0
681,93,-93.0
682,185,-185.0
683,200,-200.0
684,161,-161.0
685,89,-89.0
686,147,-147.0
687,94,-94.0
688,156,-156.0
689,120,-120.0
690,90,-90.0
691,178,-178.0
692,91,-91.0
693,105,-105.0
694,86,-86.0
695,151,-151.0
696,151,-151.0
697,153,-153.0
698,155,-155.0
699,98,-98.0
700,159,-159.0
701,105,-105.0
702,157,-157.0
703,88,-88.0
704,150,-150.0
705,98,-98.0
706,178,-178.0
707,90,-90.0
708,160,-160.0
709,175,-175.0
710,151,-151.0
711,97,-97.0
712,88,-88.0
713,159,-159.0
714,154,-154.0
715,87,-87.0
716,144,-144.0
717,86,-86.0
718,153,-153.0
719,162,-162.0
720,150,-150.0
721,175,-175.0
722,153,-153.0
723,148,-148.0
724,143,-143.0
725,146,-146.0
726,142,-142.0
727,98,-98.0
728,90,-90.0
729,155,-155.0
730,159,-159.0
731,149,-149.0
732,145,-145.0
733,140,-140.0
734,140,-140.0
735,91,-91.0
736,110,-110.0
737,139,-139.0
738,141,-141.0
739,140,-140.0
740,140,-140.0
741,136,-136.0
742,179,-179.0
743,143,-143.0
744,145,-145.0
745,85,-85.0
746,193,-193.0
747,148,-148.0
748,164,-164.0
749,177,-177.0
750,181,-181.0
751,88,-88.0
752,179,-179.0
753,169,-169.0
754,146,-146.0
755,88,-88.0
756,103,-103.0
757,146,-146.0
758,150,-150.0
759,113,-113.0
760,120,-120.0
761,137,-137.0
762,93,-93.0
763,163,-163.0
764,123,-123.0
765,102,-102.0
766,93,-93.0
767,163,-163.0
768,100,-100.0
769,121,-121.0
770,89,-89.0
771,116,-116.0
772,168,-168.0
773,118,-118.0
774,114,-114.0
775,144,-144.0
776,88,-88.0
777,159,-159.0
778,156,-156.0
779,87,-87.0
780,163,-163.0
781,154,-154.0
782,146,-146.0
783,151,-151.0
784,146,-146.0
785,140,-140.0
786,143,-143.0
787,141,-141.0
788,114,-114.0
789,147,-147.0
790,145,-145.0
791,143,-143.0
792,156,-156.0
793,147,-147.0
794,141,-141.0
795,115,-115.0
796,145,-145.0
797,151,-151.0
798,147,-147.0
799,142,-142.0
800,146,-146.0
801,147,-147.0
802,146,-146.0
803,142,-142.0
804,88,-88.0
805,149,-149.0
806,148,-148.0
807,148,-148.0
808,85,-85.0
809,150,-150.0
810,168,-168.0
811,149,-149.0
812,158,-158.0
813,149,-149.0
814,151,-151.0
815,153,-153.0
816,157,-157.0
817,158,-158.0
818,119,-119.0
819,154,-154.0
820,151,-151.0
821,152,-152.0
822,144,-144.0
823,88,-88.0
824,148,-148.0
825,149,-149.0
826,148,-148.0
827,153,-153.0
828,151,-151.0
829,147,-147.0
830,146,-146.0
831,146,-146.0
832,85,-85.0
833,152,-152.0
834,90,-90.0
835,168,-168.0
836,100,-100.0
837,113,-113.0
838,193,-193.0
839,86,-86.0
840,96,-96.0
841,85,-85.0
842,93,-93.0
843,88,-88.0
844,163,-163.0
845,200,-200.0
846,106,-106.0
847,90,-90.0
848,95,-95.0
849,161,-161.0
850,86,-86.0
851,200,-200.0
852,100,-100.0
853,182,-182.0
854,92,-92.0
855,89,-89.0
856,143,-143.0
857,88,-88.0
858,137,-137.0
859,93,-93.0
860,138,-138.0
861,135,-135.0
862,109,-109.0
863,99,-99.0
864,136,-136.0
865,142,-142.0
866,136,-136.0
867,143,-143.0
868,146,-146.0
869,142,-142.0
870,200,-200.0
871,154,-154.0
872,163,-163.0
873,200,-200.0
874,167,-167.0
875,86,-86.0
876,143,-143.0
877,96,-96.0
878,153,-153.0
879,195,-195.0
880,112,-112.0
881,95,-95.0
882,87,-87.0
883,84,-84.0
884,142,-142.0
885,143,-143.0
886,152,-152.0
887,173,-173.0
888,85,-85.0
889,200,-200.0
890,200,-200.0
891,143,-143.0
892,162,-162.0
893,160,-160.0
894,151,-151.0
895,148,-148.0
896,146,-146.0
897,144,-144.0
898,157,-157.0
899,91,-91.0
900,91,-91.0
901,95,-95.0
902,160,-160.0
903,144,-144.0
904,151,-151.0
905,161,-161.0
906,145,-145.0
907,147,-147.0
908,147,-147.0
909,154,-154.0
910,163,-163.0
911,200,-200.0
912,157,-157.0
913,143,-143.0
914,147,-147.0
915,151,-151.0
916,159,-159.0
917,155,-155.0
918,144,-144.0
919,154,-154.0
920,149,-149.0
921,148,-148.0
922,200,-200.0
923,146,-146.0
924,143,-143.0
925,143,-143.0
926,152,-152.0
927,167,-167.0
928,158,-158.0
929,154,-154.0
930,87,-87.0
931,94,-94.0
932,152,-152.0
933,147,-147.0
934,156,-156.0
935,88,-88.0
936,148,-148.0
937,156,-156.0
938,159,-159.0
939,108,-108.0
940,200,-200.0
941,150,-150.0
942,146,-146.0
943,88,-88.0
944,179,-179.0
945,144,-144.0
946,88,-88.0
947,147,-147.0
948,95,-95.0
949,150,-150.0
950,143,-143.0
951,103,-103.0
952,89,-89.0
953,84,-84.0
954,200,-200.0
955,146,-146.0
956,200,-200.0
957,90,-90.0
958,200,-200.0
959,173,-173.0
960,163,-163.0
961,143,-143.0
962,161,-161.0
963,93,-93.0
964,191,-191.0
965,158,-158.0
966,200,-200.0
967,160,-160.0
968,200,-200.0
969,86,-86.0
970,156,-156.0
971,151,-151.0
972,87,-87.0
973,88,-88.0
974,92,-92.0
975,158,-158.0
976,158,-158.0
977,160,-160.0
978,200,-200.0
979,169,-169.0
980,149,-149.0
981,153,-153.0
982,85,-85.0
983,141,-141.0
984,183,-183.0
985,168,-168.0
986,144,-144.0
987,149,-149.0
988,167,-167.0
989,156,-156.0
990,146,-146.0
991,158,-158.0
992,163,-163.0
993,162,-162.0
994,148,-148.0
995,143,-143.0
996,143,-143.0
997,146,-146.0
998,141,-141.0
999,141,-141.0
1000,144,-144.0
1001,154,-154.0
1002,149,-149.0
1003,146,-146.0
1004,166,-166.0
1005,158,-158.0
1006,150,-150.0
1007,169,-169.0
1008,157,-157.0
1009,155,-155.0
1010,164,-164.0
1011,152,-152.0
1012,156,-156.0
1013,155,-155.0
1014,143,-143.0
1015,148,-148.0
1016,152,-152.0
1017,134,-134.0
1018,140,-140.0
1019,135,-135.0
1020,139,-139.0
1021,142,-142.0
1022,166,-166.0
1023,162,-162.0
1024,146,-146.0
1025,139,-139.0
1026,150,-150.0
1027,145,-145.0
1028,149,-149.0
1029,147,-147.0
1030,138,-138.0
1031,147,-147.0
1032,152,-152.0
1033,143,-143.0
1034,145,-145.0
1035,148,-148.0
1036,143,-143.0
1037,140,-140.0
1038,147,-147.0
1039,140,-140.0
1040,134,-134.0
1041,186,-186.0
1042,153,-153.0
1043,136,-136.0
1044,173,-173.0
1045,146,-146.0
1046,139,-139.0
1047,139,-139.0
1048,137,-137.0
1049,150,-150.0
1050,144,-144.0
1051,141,-141.0
1052,149,-149.0
1053,138,-138.0
1054,177,-177.0
1055,155,-155.0
1056,147,-147.0
1057,139,-139.0
1058,140,-140.0
1059,142,-142.0
1060,139,-139.0
1061,142,-142.0
1062,142,-142.0
1063,156,-156.0
1064,155,-155.0
1065,143,-143.0
1066,142,-142.0
1067,85,-85.0
1068,139,-139.0
1069,146,-146.0
1070,139,-139.0
1071,190,-190.0
1072,149,-149.0
1073,139,-139.0
1074,115,-115.0
1075,140,-140.0
1076,183,-183.0
1077,152,-152.0
1078,147,-147.0
1079,200,-200.0
1080,149,-149.0
1081,138,-138.0
1082,146,-146.0
1083,140,-140.0
1084,147,-147.0
1085,154,-154.0
1086,200,-200.0
1087,157,-157.0
1088,141,-141.0
1089,191,-191.0
1090,144,-144.0
1091,143,-143.0
1092,139,-139.0
1093,139,-139.0
1094,139,-139.0
1095,110,-110.0
1096,143,-143.0
1097,143,-143.0
1098,112,-112.0
1099,141,-141.0
1100,141,-141.0
1101,138,-138.0
1102,147,-147.0
1103,176,-176.0
1104,145,-145.0
1105,109,-109.0
1106,148,-148.0
1107,155,-155.0
1108,110,-110.0
1109,110,-110.0
1110,188,-188.0
1111,109,-109.0
1112,114,-114.0
1113,152,-152.0
1114,113,-113.0
1115,181,-181.0
1116,111,-111.0
1117,109,-109.0
1118,111,-111.0
1119,157,-157.0
1120,110,-110.0
1121,168,-168.0
1122,113,-113.0
1123,98,-98.0
1124,108,-108.0
1125,111,-111.0
1126,182,-182.0
1127,109,-109.0
1128,200,-200.0
1129,159,-159.0
1130,167,-167.0
1131,141,-141.0
1132,140,-140.0
1133,139,-139.0
1134,91,-91.0
1135,139,-139.0
1136,90,-90.0
1137,130,-130.0
1138,89,-89.0
1139,160,-160.0
1140,112,-112.0
1141,138,-138.0
1142,148,-148.0
1143,151,-151.0
1144,92,-92.0
1145,90,-90.0
1146,150,-150.0
1147,162,-162.0
1148,165,-165.0
1149,150,-150.0
1150,111,-111.0
1151,100,-100.0
1152,148,-148.0
1153,175,-175.0
1154,156,-156.0
1155,152,-152.0
1156,153,-153.0
1157,149,-149.0
1158,147,-147.0
1159,164,-164.0
1160,149,-149.0
1161,148,-148.0
1162,155,-155.0
1163,160,-160.0
1164,152,-152.0
1165,155,-155.0
1166,153,-153.0
1167,149,-149.0
1168,142,-142.0
1169,167,-167.0
1170,150,-150.0
1171,175,-175.0
1172,159,-159.0
1173,153,-153.0
1174,153,-153.0
1175,157,-157.0
1176,166,-166.0
1177,149,-149.0
1178,173,-173.0
1179,153,-153.0
1180,152,-152.0
1181,154,-154.0
1182,155,-155.0
1183,153,-153.0
1184,150,-150.0
1185,150,-150.0
1186,155,-155.0
1187,149,-149.0
1188,160,-160.0
1189,144,-144.0
1190,145,-145.0
1191,149,-149.0
1192,147,-147.0
1193,143,-143.0
1194,165,-165.0
1195,161,-161.0
1196,166,-166.0
1197,159,-159.0
1198,154,-154.0
1199,156,-156.0
1200,159,-159.0
1201,151,-151.0
1202,122,-122.0
1203,200,-200.0
1204,154,-154.0
1205,160,-160.0
1206,162,-162.0
1207,200,-200.0
1208,161,-161.0
1209,159,-159.0
1210,157,-157.0
1211,112,-112.0
1212,163,-163.0
1213,171,-171.0
1214,167,-167.0
1215,119,-119.0
1216,113,-113.0
1217,162,-162.0
1218,152,-152.0
1219,118,-118.0
1220,159,-159.0
1221,155,-155.0
1222,112,-112.0
1223,151,-151.0
1224,165,-165.0
1225,159,-159.0
1226,163,-163.0
1227,157,-157.0
1228,158,-158.0
1229,161,-161.0
1230,163,-163.0
1231,171,-171.0
1232,166,-166.0
1233,160,-160.0
1234,146,-146.0
1235,147,-147.0
1236,144,-144.0
1237,143,-143.0
1238,200,-200.0
1239,142,-142.0
1240,144,-144.0
1241,152,-152.0
1242,148,-148.0
1243,143,-143.0
1244,148,-148.0
1245,143,-143.0
1246,146,-146.0
1247,145,-145.0
1248,144,-144.0
1249,146,-146.0
1250,142,-142.0
1251,148,-148.0
1252,154,-154.0
1253,141,-141.0
1254,142,-142.0
1255,140,-140.0
1256,150,-150.0
1257,143,-143.0
1258,152,-152.0
1259,200,-200.0
1260,143,-143.0
1261,145,-145.0
1262,147,-147.0
1263,200,-200.0
1264,164,-164.0
1265,163,-163.0
1266,152,-152.0
1267,154,-154.0
1268,149,-149.0
1269,200,-200.0
1270,146,-146.0
1271,200,-200.0
1272,171,-171.0
1273,147,-147.0
1274,180,-180.0
1275,192,-192.0
1276,112,-112.0
1277,177,-177.0
1278,141,-141.0
1279,185,-185.0
1280,146,-146.0
1281,145,-145.0
1282,147,-147.0
1283,146,-146.0
1284,152,-152.0
1285,148,-148.0
1286,157,-157.0
1287,157,-157.0
1288,156,-156.0
1289,155,-155.0
1290,162,-162.0
1291,158,-158.0
1292,161,-161.0
1293,158,-158.0
1294,161,-161.0
1295,159,-159.0
1296,159,-159.0
1297,151,-151.0
1298,150,-150.0
1299,144,-144.0
1300,152,-152.0
1301,158,-158.0
1302,157,-157.0
1303,156,-156.0
1304,150,-150.0
1305,163,-163.0
1306,149,-149.0
1307,150,-150.0
1308,153,-153.0
1309,157,-157.0
1310,156,-156.0
1311,155,-155.0
1312,157,-157.0
1313,200,-200.0
1314,158,-158.0
1315,158,-158.0
1316,146,-146.0
1317,151,-151.0
1318,149,-149.0
1319,148,-148.0
1320,155,-155.0
1321,154,-154.0
1322,157,-157.0
1323,156,-156.0
1324,144,-144.0
1325,147,-147.0
1326,154,-154.0
1327,143,-143.0
1328,120,-120.0
1329,153,-153.0
1330,149,-149.0
1331,153,-153.0
1332,153,-153.0
1333,155,-155.0
1334,200,-200.0
1335,154,-154.0
1336,154,-154.0
1337,153,-153.0
1338,189,-189.0
1339,162,-162.0
1340,131,-131.0
1341,153,-153.0
1342,153,-153.0
1343,152,-152.0
1344,153,-153.0
1345,153,-153.0
1346,150,-150.0
1347,151,-151.0
1348,200,-200.0
1349,152,-152.0
1350,147,-147.0
1351,149,-149.0
1352,151,-151.0
1353,148,-148.0
1354,125,-125.0
1355,125,-125.0
1356,200,-200.0
1357,146,-146.0
1358,196,-196.0
1359,122,-122.0
1360,150,-150.0
1361,197,-197.0
1362,161,-161.0
1363,123,-123.0
1364,159,-159.0
1365,123,-123.0
1366,153,-153.0
1367,153,-153.0
1368,150,-150.0
1369,152,-152.0
1370,126,-126.0
1371,200,-200.0
1372,123,-123.0
1373,124,-124.0
1374,130,-130.0
1375,127,-127.0
1376,200,-200.0
1377,127,-127.0
1378,122,-122.0
1379,127,-127.0
1380,200,-200.0
1381,200,-200.0
1382,175,-175.0
1383,200,-200.0
1384,200,-200.0
1385,138,-138.0
1386,200,-200.0
1387,200,-200.0
1388,200,-200.0
1389,126,-126.0
1390,151,-151.0
1391,121,-121.0
1392,200,-200.0
1393,197,-197.0
1394,200,-200.0
1395,200,-200.0
1396,123,-123.0
1397,124,-124.0
1398,200,-200.0
1399,200,-200.0
1400,200,-200.0
1401,137,-137.0
1402,200,-200.0
1403,200,-200.0
1404,200,-200.0
1405,150,-150.0
1406,200,-200.0
1407,139,-139.0
1408,185,-185.0
1409,200,-200.0
1410,200,-200.0
1411,200,-200.0
1412,200,-200.0
1413,200,-200.0
1414,200,-200.0
1415,164,-164.0
1416,200,-200.0
1417,200,-200.0
1418,200,-200.0
1419,200,-200.0
1420,200,-200.0
1421,200,-200.0
1422,200,-200.0
1423,200,-200.0
1424,200,-200.0
1425,200,-200.0
1426,200,-200.0
1427,200,-200.0
1428,200,-200.0
1429,200,-200.0
1430,200,-200.0
1431,200,-200.0
1432,200,-200.0
1433,144,-144.0
1434,198,-198.0
1435,180,-180.0
1436,128,-128.0
1437,200,-200.0
1438,127,-127.0
1439,129,-129.0
1440,155,-155.0
1441,200,-200.0
1442,200,-200.0
1443,200,-200.0
1444,173,-173.0
1445,200,-200.0
1446,170,-170.0
1447,200,-200.0
1448,200,-200.0
1449,188,-188.0
1450,192,-192.0
1451,200,-200.0
1452,200,-200.0
1453,161,-161.0
1454,158,-158.0
1455,200,-200.0
1456,163,-163.0
1457,150,-150.0
1458,172,-172.0
1459,168,-168.0
1460,200,-200.0
1461,200,-200.0
1462,200,-200.0
1463,181,-181.0
1464,149,-149.0
1465,200,-200.0
1466,200,-200.0
1467,193,-193.0
1468,200,-200.0
1469,200,-200.0
1470,200,-200.0
1471,200,-200.0
1472,200,-200.0
1473,200,-200.0
1474,200,-200.0
1475,200,-200.0
1476,167,-167.0
1477,166,-166.0
1478,200,-200.0
1479,151,-151.0
1480,200,-200.0
1481,172,-172.0
1482,167,-167.0
1483,161,-161.0
1484,158,-158.0
1485,180,-180.0
1486,162,-162.0
1487,200,-200.0
1488,174,-174.0
1489,200,-200.0
1490,200,-200.0
1491,130,-130.0
1492,132,-132.0
1493,126,-126.0
1494,170,-170.0
1495,200,-200.0
1496,200,-200.0
1497,200,-200.0
1498,174,-174.0
1499,167,-167.0
1500,167,-167.0
1501,129,-129.0
1502,200,-200.0
1503,175,-175.0
1504,200,-200.0
1505,174,-174.0
1506,125,-125.0
1507,124,-124.0
1508,169,-169.0
1509,165,-165.0
1510,200,-200.0
1511,200,-200.0
1512,122,-122.0
1513,167,-167.0
1514,146,-146.0
1515,121,-121.0
1516,160,-160.0
1517,200,-200.0
1518,200,-200.0
1519,200,-200.0
1520,200,-200.0
1521,184,-184.0
1522,160,-160.0
1523,200,-200.0
1524,200,-200.0
1525,156,-156.0
1526,156,-156.0
1527,163,-163.0
1528,122,-122.0
1529,200,-200.0
1530,200,-200.0
1531,200,-200.0
1532,148,-148.0
1533,200,-200.0
1534,200,-200.0
1535,200,-200.0
1536,158,-158.0
1537,155,-155.0
1538,121,-121.0
1539,144,-144.0
1540,200,-200.0
1541,139,-139.0
1542,166,-166.0
1543,154,-154.0
1544,200,-200.0
1545,200,-200.0
1546,200,-200.0
1547,185,-185.0
1548,170,-170.0
1549,200,-200.0
1550,200,-200.0
1551,143,-143.0
1552,174,-174.0
1553,200,-200.0
1554,188,-188.0
1555,164,-164.0
1556,200,-200.0
1557,200,-200.0
1558,183,-183.0
1559,153,-153.0
1560,167,-167.0
1561,123,-123.0
1562,182,-182.0
1563,138,-138.0
1564,200,-200.0
1565,159,-159.0
1566,159,-159.0
1567,146,-146.0
1568,183,-183.0
1569,166,-166.0
1570,143,-143.0
1571,177,-177.0
1572,200,-200.0
1573,154,-154.0
1574,200,-200.0
1575,145,-145.0
1576,177,-177.0
1577,182,-182.0
1578,175,-175.0
1579,200,-200.0
1580,200,-200.0
1581,200,-200.0
1582,172,-172.0
1583,197,-197.0
1584,200,-200.0
1585,200,-200.0
1586,172,-172.0
1587,200,-200.0
1588,200,-200.0
1589,200,-200.0
1590,200,-200.0
1591,200,-200.0
1592,200,-200.0
1593,200,-200.0
1594,180,-180.0
1595,200,-200.0
1596,200,-200.0
1597,200,-200.0
1598,200,-200.0
1599,200,-200.0
1600,200,-200.0
1601,200,-200.0
1602,200,-200.0
1603,200,-200.0
1604,165,-165.0
1605,194,-194.0
1606,200,-200.0
1607,200,-200.0
1608,200,-200.0
1609,186,-186.0
1610,200,-200.0
1611,200,-200.0
1612,200,-200.0
1613,174,-174.0
1614,169,-169.0
1615,169,-169.0
1616,200,-200.0
1617,159,-159.0
1618,200,-200.0
1619,170,-170.0
1620,171,-171.0
1621,162,-162.0
1622,145,-145.0
1623,166,-166.0
1624,200,-200.0
1625,200,-200.0
1626,200,-200.0
1627,200,-200.0
1628,200,-200.0
1629,199,-199.0
1630,157,-157.0
1631,162,-162.0
1632,179,-179.0
1633,200,-200.0
1634,200,-200.0
1635,169,-169.0
1636,200,-200.0
1637,200,-200.0
1638,162,-162.0
1639,159,-159.0
1640,164,-164.0
1641,159,-159.0
1642,200,-200.0
1643,200,-200.0
1644,200,-200.0
1645,200,-200.0
1646,184,-184.0
1647,164,-164.0
1648,157,-157.0
1649,200,-200.0
1650,200,-200.0
1651,162,-162.0
1652,171,-171.0
1653,200,-200.0
1654,200,-200.0
1655,155,-155.0
1656,200,-200.0
1657,173,-173.0
1658,173,-173.0
1659,200,-200.0
1660,200,-200.0
1661,200,-200.0
1662,172,-172.0
1663,168,-168.0
1664,155,-155.0
1665,158,-158.0
1666,157,-157.0
1667,160,-160.0
1668,200,-200.0
1669,157,-157.0
1670,167,-167.0
1671,172,-172.0
1672,200,-200.0
1673,200,-200.0
1674,200,-200.0
1675,200,-200.0
1676,200,-200.0
1677,171,-171.0
1678,200,-200.0
1679,163,-163.0
1680,158,-158.0
1681,158,-158.0
1682,159,-159.0
1683,163,-163.0
1684,200,-200.0
1685,200,-200.0
1686,200,-200.0
1687,200,-200.0
1688,200,-200.0
1689,200,-200.0
1690,200,-200.0
1691,200,-200.0
1692,200,-200.0
1693,200,-200.0
1694,200,-200.0
1695,200,-200.0
1696,200,-200.0
1697,200,-200.0
1698,200,-200.0
1699,154,-154.0
1700,124,-124.0
1701,200,-200.0
1702,200,-200.0
1703,200,-200.0
1704,200,-200.0
1705,200,-200.0
1706,200,-200.0
1707,200,-200.0
1708,200,-200.0
1709,200,-200.0
1710,200,-200.0
1711,183,-183.0
1712,200,-200.0
1713,200,-200.0
1714,173,-173.0
1715,177,-177.0
1716,200,-200.0
1717,197,-197.0
1718,200,-200.0
1719,180,-180.0
1720,200,-200.0
1721,200,-200.0
1722,117,-117.0
1723,117,-117.0
1724,106,-106.0
1725,161,-161.0
1726,95,-95.0
1727,183,-183.0
1728,131,-131.0
1729,187,-187.0
1730,126,-126.0
1731,121,-121.0
1732,104,-104.0
1733,169,-169.0
1734,96,-96.0
1735,168,-168.0
1736,163,-163.0
1737,115,-115.0
1738,163,-163.0
1739,160,-160.0
1740,163,-163.0
1741,93,-93.0
1742,108,-108.0
1743,153,-153.0
1744,114,-114.0
1745,161,-161.0
1746,152,-152.0
1747,152,-152.0
1748,86,-86.0
1749,152,-152.0
1750,145,-145.0
1751,193,-193.0
1752,151,-151.0
1753,96,-96.0
1754,146,-146.0
1755,160,-160.0
1756,100,-100.0
1757,140,-140.0
1758,142,-142.0
1759,131,-131.0
1760,89,-89.0
1761,160,-160.0
1762,140,-140.0
1763,92,-92.0
1764,197,-197.0
1765,110,-110.0
1766,151,-151.0
1767,143,-143.0
1768,90,-90.0
1769,153,-153.0
1770,143,-143.0
1771,137,-137.0
1772,140,-140.0
1773,145,-145.0
1774,92,-92.0
1775,140,-140.0
1776,146,-146.0
1777,166,-166.0
1778,90,-90.0
1779,200,-200.0
1780,145,-145.0
1781,152,-152.0
1782,145,-145.0
1783,143,-143.0
1784,158,-158.0
1785,157,-157.0
1786,151,-151.0
1787,148,-148.0
1788,169,-169.0
1789,147,-147.0
1790,90,-90.0
1791,152,-152.0
1792,148,-148.0
1793,150,-150.0
1794,147,-147.0
1795,97,-97.0
1796,161,-161.0
1797,149,-149.0
1798,157,-157.0
1799,148,-148.0
1800,138,-138.0
1801,149,-149.0
1802,145,-145.0
1803,154,-154.0
1804,162,-162.0
1805,88,-88.0
1806,98,-98.0
1807,99,-99.0
1808,160,-160.0
1809,98,-98.0
1810,188,-188.0
1811,156,-156.0
1812,152,-152.0
1813,165,-165.0
1814,171,-171.0
1815,151,-151.0
1816,107,-107.0
1817,170,-170.0
1818,161,-161.0
1819,93,-93.0
1820,153,-153.0
1821,151,-151.0
1822,148,-148.0
1823,105,-105.0
1824,89,-89.0
1825,143,-143.0
1826,94,-94.0
1827,163,-163.0
1828,153,-153.0
1829,155,-155.0
1830,155,-155.0
1831,165,-165.0
1832,142,-142.0
1833,117,-117.0
1834,90,-90.0
1835,147,-147.0
1836,163,-163.0
1837,200,-200.0
1838,96,-96.0
1839,148,-148.0
1840,147,-147.0
1841,181,-181.0
1842,144,-144.0
1843,147,-147.0
1844,144,-144.0
1845,156,-156.0
1846,190,-190.0
1847,149,-149.0
1848,146,-146.0
1849,141,-141.0
1850,200,-200.0
