episodes,steps,rewards
0,116,-358.7299060562686
1,86,-380.13758245080317
2,102,-316.1492166767984
3,57,-87.8164819257247
4,65,-110.73771147858345
5,102,-202.22094964568453
6,94,-94.1078372076093
7,122,-283.1007274648796
8,87,-87.22911338507792
9,100,-95.0016570814518
10,113,-388.21496735107814
11,122,-204.80184230218407
12,112,-347.1384187543879
13,131,-281.29938156104356
14,103,-204.30699865123728
15,1000,87.65183967155575
16,1000,-257.03632103201085
17,1000,-114.87567114241162
18,1000,-207.9349224937211
19,1000,-73.3973936796289
20,376,-133.04101917921753
21,1000,-191.24810317818444
22,1000,-99.09654916659102
23,611,-278.4427471328946
24,907,-164.67692905137582
25,1000,-112.84221318421442
26,1000,-23.76598118223839
27,546,152.07817937709234
28,287,-46.07512605451197
29,673,258.91809334728447
30,1000,-103.1244874826034
31,1000,-56.16407249922211
32,1000,-24.93298047300997
33,1000,-101.03682402818445
34,1000,-60.002657815974295
35,1000,-82.17589603506215
36,1000,-216.15347790151722
37,936,118.92684532340392
38,958,126.35875103774913
39,847,178.02558661787805
40,472,231.88974330030305
41,1000,57.65776399352604
42,371,12.321236858734238
43,755,187.1272385145986
44,1000,-70.23760207772258
45,83,-3.0034118721078897
46,666,149.63467600355375
47,717,-947.1644194302636
48,322,285.73479450038974
49,366,-151.34486127324539
50,434,-350.37807289525296
51,1000,-66.01290174499455
52,1000,-68.13567144183052
53,1000,-86.65622117309226
54,1000,-116.99283062200377
55,193,-402.0314902384216
56,208,-90.38145845463302
57,152,-119.30611256367673
58,1000,-107.52800239509415
59,150,8.755454599630937
60,256,186.11614117728783
61,338,215.40989571447574
62,342,188.15589608952502
63,834,183.53284863333295
64,734,189.73985462304952
65,266,267.31680819774465
66,184,-134.75104563260618
67,141,-173.9037506802497
68,76,-113.66925974092973
69,109,32.51090745386318
70,61,-119.6019003738936
71,130,-398.5387533743072
72,234,-248.1715448326953
73,167,-144.94408573318515
74,782,194.50257422888785
75,357,-207.07006270923404
76,233,-157.20947890689868
77,874,161.84248593356608
78,1000,-93.60141747483345
79,923,167.02503167703702
80,875,179.225652642309
81,1000,29.520630328679882
82,469,223.05719201874194
83,266,239.10323799284774
84,706,200.3438883178079
85,648,217.23719279267212
86,388,229.09277261535132
87,464,235.59610943235185
88,244,289.9899987071542
89,100,34.0340995145074
90,883,175.40519333442563
91,371,223.186029767952
92,687,196.66068647687078
93,611,169.6269475041625
94,293,-48.10548650296634
95,421,191.1690525113036
96,637,192.80578953024025
97,216,233.69096029245424
98,338,235.563497493002
99,177,-24.387861101258437
100,561,177.31098395670492
101,217,-10.751960527870224
102,731,185.63877876602146
103,319,227.85187137343183
104,377,238.82866248001892
105,406,225.4014394859444
106,1000,-52.7006705614708
107,708,186.8064912536626
108,259,270.8223423006044
109,177,-40.380000867259696
110,316,42.824319836199464
111,719,155.36368615536196
112,725,203.77107045979443
113,289,229.44094158678465
114,700,162.26905860287408
115,490,200.43122227147109
116,408,215.05089120103798
117,380,249.5432979812444
118,651,164.87494494378748
119,321,235.32339385856164
120,373,239.07276977966848
121,388,232.9660193796444
122,561,222.2168133470529
123,633,226.2908081190594
124,422,210.343145544349
125,421,221.96537298243692
126,418,197.0706384331567
127,253,231.28914766038244
128,302,227.39308764580136
129,393,271.59659338690176
130,201,-336.744491877221
131,235,-167.9084377725185
132,195,-143.4895175856855
133,77,-131.39219942938928
134,120,-145.59280715337152
135,990,169.35908562365944
136,405,253.2937091950297
137,650,227.92144592621972
138,687,206.0269468725115
139,385,204.48226505233333
140,566,245.51109197619317
141,484,202.11251341340648
142,396,214.40675257127037
143,503,206.98378419141062
144,242,227.58184928649774
145,498,232.0356544630499
146,751,268.97172826881945
147,939,224.899689527275
148,752,185.2516557240441
149,364,209.06490467626804
150,393,172.5357865097077
151,127,-24.8172631799129
152,508,159.71349992640407
153,554,218.09477644464224
154,534,208.12282953247166
155,267,278.0500179848798
156,291,225.9315745507177
157,287,-168.8515675952784
158,402,252.28485922125805
159,343,271.18328915672146
160,349,275.9619774773338
161,313,258.06838976799975
162,552,236.36163002248816
163,442,222.05931032837717
164,315,247.52570623749358
165,392,224.53681778889978
166,328,242.6657002039347
167,295,216.54564289392
168,388,259.4560323270085
169,361,225.25361451797758
170,395,216.26866648804787
171,481,203.31935008034202
172,238,232.80031037722804
173,523,235.38411230634296
174,381,266.0521473604226
175,123,39.368483548623885
176,408,238.97664469974472
177,254,265.5386977050218
178,248,258.00454951611266
179,555,216.56715136001884
180,344,259.29079922487404
181,248,204.88538173078803
182,157,-161.9676125451375
183,100,34.29278377805423
184,297,193.45419483826876
185,270,-7.506146347466782
186,816,170.08087772918623
187,1000,-25.046650586245605
188,549,225.1760334686977
189,232,257.8434109611523
190,533,183.0594397061829
191,493,240.5576548750922
192,380,283.5089986536882
193,281,237.17906555629554
194,750,211.93122157783813
195,345,211.0886534752112
196,463,256.60212883150496
197,528,241.22159198758084
198,462,225.75431609017897
199,314,237.73096287996677
200,466,221.6853498277177
201,885,190.85888478910647
202,198,253.12828429804006
203,1000,-22.97208975116611
204,231,284.4532066038041
205,476,199.15909440444287
206,427,216.53023579090822
207,1000,71.42430156886935
208,262,248.33504561063782
209,792,177.50589354359676
210,128,-142.99470863558537
211,290,232.2222018192968
212,333,245.38190084678902
213,494,228.5217938817888
214,364,268.1492322595812
215,304,259.3675263136161
216,424,-32.609409781370076
217,334,220.5343555276533
218,426,231.65872242361627
219,416,259.9697648319685
220,226,248.56848312888528
221,520,253.23784898861624
222,483,-208.6579121297001
223,308,260.1720383832703
224,299,280.8297459094944
225,270,290.73910155982924
226,278,293.1126147643166
227,316,208.4106333181013
228,327,257.3411301421736
229,300,258.75935792575274
230,195,263.4803191855382
231,273,269.18142056757586
232,278,250.40438572404827
233,319,268.77349000991995
234,438,270.5063370789985
235,636,136.17833387207145
236,284,260.22961793948286
