episodes,steps,rewards
0,200,-200.0
1,200,-200.0
2,200,-200.0
3,200,-200.0
4,200,-200.0
5,200,-200.0
6,200,-200.0
7,200,-200.0
8,200,-200.0
9,200,-200.0
10,200,-200.0
11,200,-200.0
12,200,-200.0
13,200,-200.0
14,200,-200.0
15,200,-200.0
16,200,-200.0
17,200,-200.0
18,200,-200.0
19,200,-200.0
20,200,-200.0
21,200,-200.0
22,200,-200.0
23,200,-200.0
24,200,-200.0
25,200,-200.0
26,200,-200.0
27,200,-200.0
28,200,-200.0
29,200,-200.0
30,200,-200.0
31,200,-200.0
32,200,-200.0
33,200,-200.0
34,200,-200.0
35,200,-200.0
36,200,-200.0
37,200,-200.0
38,200,-200.0
39,200,-200.0
40,200,-200.0
41,200,-200.0
42,200,-200.0
43,200,-200.0
44,200,-200.0
45,200,-200.0
46,200,-200.0
47,200,-200.0
48,200,-200.0
49,200,-200.0
50,200,-200.0
51,200,-200.0
52,200,-200.0
53,200,-200.0
54,200,-200.0
55,200,-200.0
56,200,-200.0
57,200,-200.0
58,200,-200.0
59,200,-200.0
60,200,-200.0
61,200,-200.0
62,200,-200.0
63,200,-200.0
64,200,-200.0
65,200,-200.0
66,200,-200.0
67,200,-200.0
68,200,-200.0
69,200,-200.0
70,200,-200.0
71,200,-200.0
72,200,-200.0
73,200,-200.0
74,200,-200.0
75,200,-200.0
76,200,-200.0
77,200,-200.0
78,200,-200.0
79,200,-200.0
80,200,-200.0
81,200,-200.0
82,200,-200.0
83,200,-200.0
84,200,-200.0
85,200,-200.0
86,200,-200.0
87,200,-200.0
88,200,-200.0
89,200,-200.0
90,200,-200.0
91,200,-200.0
92,200,-200.0
93,200,-200.0
94,200,-200.0
95,200,-200.0
96,200,-200.0
97,200,-200.0
98,200,-200.0
99,200,-200.0
100,200,-200.0
101,200,-200.0
102,200,-200.0
103,200,-200.0
104,200,-200.0
105,200,-200.0
106,200,-200.0
107,200,-200.0
108,200,-200.0
109,200,-200.0
110,200,-200.0
111,200,-200.0
112,200,-200.0
113,200,-200.0
114,200,-200.0
115,200,-200.0
116,200,-200.0
117,200,-200.0
118,200,-200.0
119,200,-200.0
120,200,-200.0
121,200,-200.0
122,200,-200.0
123,200,-200.0
124,200,-200.0
125,200,-200.0
126,200,-200.0
127,200,-200.0
128,200,-200.0
129,200,-200.0
130,200,-200.0
131,200,-200.0
132,200,-200.0
133,200,-200.0
134,200,-200.0
135,200,-200.0
136,200,-200.0
137,200,-200.0
138,200,-200.0
139,200,-200.0
140,200,-200.0
141,200,-200.0
142,200,-200.0
143,200,-200.0
144,200,-200.0
145,200,-200.0
146,200,-200.0
147,200,-200.0
148,200,-200.0
149,200,-200.0
150,200,-200.0
151,200,-200.0
152,200,-200.0
153,200,-200.0
154,200,-200.0
155,200,-200.0
156,200,-200.0
157,200,-200.0
158,200,-200.0
159,200,-200.0
160,200,-200.0
161,200,-200.0
162,200,-200.0
163,200,-200.0
164,200,-200.0
165,200,-200.0
166,200,-200.0
167,200,-200.0
168,200,-200.0
169,200,-200.0
170,200,-200.0
171,200,-200.0
172,200,-200.0
173,200,-200.0
174,200,-200.0
175,200,-200.0
176,200,-200.0
177,200,-200.0
178,200,-200.0
179,200,-200.0
180,200,-200.0
181,200,-200.0
182,200,-200.0
183,200,-200.0
184,200,-200.0
185,200,-200.0
186,200,-200.0
187,200,-200.0
188,200,-200.0
189,200,-200.0
190,200,-200.0
191,200,-200.0
192,200,-200.0
193,200,-200.0
194,200,-200.0
195,200,-200.0
196,200,-200.0
197,200,-200.0
198,200,-200.0
199,200,-200.0
200,200,-200.0
201,200,-200.0
202,200,-200.0
203,200,-200.0
204,200,-200.0
205,200,-200.0
206,200,-200.0
207,200,-200.0
208,200,-200.0
209,200,-200.0
210,200,-200.0
211,200,-200.0
212,200,-200.0
213,200,-200.0
214,200,-200.0
215,200,-200.0
216,200,-200.0
217,200,-200.0
218,200,-200.0
219,200,-200.0
220,200,-200.0
221,200,-200.0
222,200,-200.0
223,200,-200.0
224,200,-200.0
225,200,-200.0
226,200,-200.0
227,200,-200.0
228,200,-200.0
229,200,-200.0
230,200,-200.0
231,200,-200.0
232,200,-200.0
233,200,-200.0
234,200,-200.0
235,200,-200.0
236,200,-200.0
237,200,-200.0
238,200,-200.0
239,200,-200.0
240,200,-200.0
241,200,-200.0
242,200,-200.0
243,200,-200.0
244,200,-200.0
245,200,-200.0
246,200,-200.0
247,200,-200.0
248,200,-200.0
249,200,-200.0
250,200,-200.0
251,200,-200.0
252,200,-200.0
253,200,-200.0
254,200,-200.0
255,200,-200.0
256,200,-200.0
257,200,-200.0
258,200,-200.0
259,200,-200.0
260,200,-200.0
261,200,-200.0
262,200,-200.0
263,200,-200.0
264,200,-200.0
265,200,-200.0
266,200,-200.0
267,200,-200.0
268,200,-200.0
269,200,-200.0
270,200,-200.0
271,200,-200.0
272,200,-200.0
273,200,-200.0
274,200,-200.0
275,200,-200.0
276,200,-200.0
277,200,-200.0
278,200,-200.0
279,200,-200.0
280,200,-200.0
281,200,-200.0
282,200,-200.0
283,200,-200.0
284,200,-200.0
285,200,-200.0
286,200,-200.0
287,200,-200.0
288,200,-200.0
289,200,-200.0
290,200,-200.0
291,200,-200.0
292,200,-200.0
293,200,-200.0
294,200,-200.0
295,200,-200.0
296,200,-200.0
297,200,-200.0
298,200,-200.0
299,200,-200.0
300,200,-200.0
301,200,-200.0
302,200,-200.0
303,200,-200.0
304,200,-200.0
305,200,-200.0
306,200,-200.0
307,200,-200.0
308,200,-200.0
309,200,-200.0
310,200,-200.0
311,200,-200.0
312,200,-200.0
313,200,-200.0
314,200,-200.0
315,200,-200.0
316,200,-200.0
317,200,-200.0
318,200,-200.0
319,200,-200.0
320,200,-200.0
321,200,-200.0
322,200,-200.0
323,200,-200.0
324,200,-200.0
325,200,-200.0
326,200,-200.0
327,200,-200.0
328,200,-200.0
329,200,-200.0
330,200,-200.0
331,200,-200.0
332,200,-200.0
333,200,-200.0
334,200,-200.0
335,200,-200.0
336,200,-200.0
337,200,-200.0
338,200,-200.0
339,200,-200.0
340,200,-200.0
341,200,-200.0
342,200,-200.0
343,200,-200.0
344,200,-200.0
345,200,-200.0
346,200,-200.0
347,200,-200.0
348,200,-200.0
349,200,-200.0
350,200,-200.0
351,200,-200.0
352,200,-200.0
353,200,-200.0
354,200,-200.0
355,200,-200.0
356,200,-200.0
357,200,-200.0
358,200,-200.0
359,200,-200.0
360,200,-200.0
361,200,-200.0
362,200,-200.0
363,200,-200.0
364,200,-200.0
365,200,-200.0
366,200,-200.0
367,200,-200.0
368,200,-200.0
369,200,-200.0
370,200,-200.0
371,200,-200.0
372,200,-200.0
373,200,-200.0
374,200,-200.0
375,200,-200.0
376,200,-200.0
377,200,-200.0
378,200,-200.0
379,200,-200.0
380,200,-200.0
381,200,-200.0
382,200,-200.0
383,200,-200.0
384,200,-200.0
385,200,-200.0
386,200,-200.0
387,200,-200.0
388,200,-200.0
389,200,-200.0
390,200,-200.0
391,200,-200.0
392,200,-200.0
393,200,-200.0
394,200,-200.0
395,200,-200.0
396,200,-200.0
397,200,-200.0
398,200,-200.0
399,200,-200.0
400,200,-200.0
401,200,-200.0
402,200,-200.0
403,200,-200.0
404,200,-200.0
405,200,-200.0
406,200,-200.0
407,200,-200.0
408,200,-200.0
409,200,-200.0
410,200,-200.0
411,200,-200.0
412,200,-200.0
413,200,-200.0
414,200,-200.0
415,200,-200.0
416,200,-200.0
417,200,-200.0
418,200,-200.0
419,200,-200.0
420,200,-200.0
421,200,-200.0
422,200,-200.0
423,200,-200.0
424,200,-200.0
425,200,-200.0
426,200,-200.0
427,126,-126.0
428,200,-200.0
429,143,-143.0
430,200,-200.0
431,200,-200.0
432,200,-200.0
433,166,-166.0
434,200,-200.0
435,183,-183.0
436,200,-200.0
437,200,-200.0
438,200,-200.0
439,154,-154.0
440,200,-200.0
441,200,-200.0
442,200,-200.0
443,200,-200.0
444,180,-180.0
445,200,-200.0
446,200,-200.0
447,130,-130.0
448,131,-131.0
449,159,-159.0
450,163,-163.0
451,118,-118.0
452,200,-200.0
453,200,-200.0
454,200,-200.0
455,200,-200.0
456,200,-200.0
457,197,-197.0
458,152,-152.0
459,145,-145.0
460,155,-155.0
461,200,-200.0
462,150,-150.0
463,200,-200.0
464,200,-200.0
465,200,-200.0
466,200,-200.0
467,131,-131.0
468,171,-171.0
469,162,-162.0
470,200,-200.0
471,200,-200.0
472,159,-159.0
473,200,-200.0
474,200,-200.0
475,200,-200.0
476,149,-149.0
477,144,-144.0
478,200,-200.0
479,200,-200.0
480,200,-200.0
481,164,-164.0
482,200,-200.0
483,200,-200.0
484,200,-200.0
485,196,-196.0
486,200,-200.0
487,200,-200.0
488,179,-179.0
489,200,-200.0
490,145,-145.0
491,200,-200.0
492,200,-200.0
493,200,-200.0
494,200,-200.0
495,192,-192.0
496,200,-200.0
497,200,-200.0
498,200,-200.0
499,166,-166.0
500,172,-172.0
501,200,-200.0
502,200,-200.0
503,200,-200.0
504,200,-200.0
505,162,-162.0
506,142,-142.0
507,200,-200.0
508,164,-164.0
509,200,-200.0
510,170,-170.0
511,155,-155.0
512,175,-175.0
513,200,-200.0
514,193,-193.0
515,200,-200.0
516,200,-200.0
517,143,-143.0
518,200,-200.0
519,194,-194.0
520,200,-200.0
521,200,-200.0
522,200,-200.0
523,127,-127.0
524,200,-200.0
525,200,-200.0
526,200,-200.0
527,176,-176.0
528,141,-141.0
529,169,-169.0
530,156,-156.0
531,200,-200.0
532,200,-200.0
533,200,-200.0
534,200,-200.0
535,193,-193.0
536,200,-200.0
537,188,-188.0
538,124,-124.0
539,95,-95.0
540,172,-172.0
541,156,-156.0
542,200,-200.0
543,171,-171.0
544,166,-166.0
545,130,-130.0
546,200,-200.0
547,200,-200.0
548,175,-175.0
549,173,-173.0
550,192,-192.0
551,200,-200.0
552,196,-196.0
553,151,-151.0
554,140,-140.0
555,114,-114.0
556,200,-200.0
557,200,-200.0
558,102,-102.0
559,112,-112.0
560,87,-87.0
561,200,-200.0
562,200,-200.0
563,162,-162.0
564,185,-185.0
565,200,-200.0
566,164,-164.0
567,143,-143.0
568,157,-157.0
569,162,-162.0
570,158,-158.0
571,176,-176.0
572,117,-117.0
573,150,-150.0
574,152,-152.0
575,115,-115.0
576,191,-191.0
577,93,-93.0
578,200,-200.0
579,174,-174.0
580,143,-143.0
581,200,-200.0
582,200,-200.0
583,97,-97.0
584,87,-87.0
585,108,-108.0
586,179,-179.0
587,164,-164.0
588,160,-160.0
589,88,-88.0
590,125,-125.0
591,200,-200.0
592,160,-160.0
593,144,-144.0
594,118,-118.0
595,95,-95.0
596,124,-124.0
597,123,-123.0
598,161,-161.0
599,171,-171.0
600,91,-91.0
601,200,-200.0
602,200,-200.0
603,113,-113.0
604,133,-133.0
605,117,-117.0
606,154,-154.0
607,91,-91.0
608,85,-85.0
609,160,-160.0
610,115,-115.0
611,147,-147.0
612,161,-161.0
613,157,-157.0
614,138,-138.0
615,200,-200.0
616,156,-156.0
617,176,-176.0
618,155,-155.0
619,86,-86.0
620,96,-96.0
621,177,-177.0
622,90,-90.0
623,151,-151.0
624,154,-154.0
625,190,-190.0
626,177,-177.0
627,148,-148.0
628,87,-87.0
629,151,-151.0
630,146,-146.0
631,151,-151.0
632,88,-88.0
633,141,-141.0
634,146,-146.0
635,145,-145.0
636,106,-106.0
637,150,-150.0
638,170,-170.0
639,168,-168.0
640,150,-150.0
641,138,-138.0
642,92,-92.0
643,198,-198.0
644,106,-106.0
645,157,-157.0
646,144,-144.0
647,87,-87.0
648,147,-147.0
649,141,-141.0
650,173,-173.0
651,85,-85.0
652,159,-159.0
653,200,-200.0
654,148,-148.0
655,142,-142.0
656,143,-143.0
657,92,-92.0
658,146,-146.0
659,151,-151.0
660,117,-117.0
661,91,-91.0
662,183,-183.0
663,106,-106.0
664,165,-165.0
665,122,-122.0
666,155,-155.0
667,144,-144.0
668,92,-92.0
669,142,-142.0
670,170,-170.0
671,90,-90.0
672,91,-91.0
673,145,-145.0
674,147,-147.0
675,155,-155.0
676,179,-179.0
677,85,-85.0
678,153,-153.0
679,150,-150.0
680,140,-140.0
681,94,-94.0
682,111,-111.0
683,148,-148.0
684,90,-90.0
685,145,-145.0
686,180,-180.0
687,148,-148.0
688,141,-141.0
689,143,-143.0
690,161,-161.0
691,144,-144.0
692,153,-153.0
693,152,-152.0
694,100,-100.0
695,93,-93.0
696,150,-150.0
697,115,-115.0
698,168,-168.0
699,144,-144.0
700,91,-91.0
