episodes,steps,rewards
0,200,-200.0
1,200,-200.0
2,200,-200.0
3,200,-200.0
4,200,-200.0
5,200,-200.0
6,200,-200.0
7,200,-200.0
8,200,-200.0
9,200,-200.0
10,200,-200.0
11,200,-200.0
12,200,-200.0
13,200,-200.0
14,200,-200.0
15,200,-200.0
16,200,-200.0
17,200,-200.0
18,200,-200.0
19,200,-200.0
20,200,-200.0
21,200,-200.0
22,200,-200.0
23,200,-200.0
24,200,-200.0
25,200,-200.0
26,200,-200.0
27,200,-200.0
28,200,-200.0
29,200,-200.0
30,200,-200.0
31,200,-200.0
32,200,-200.0
33,200,-200.0
34,200,-200.0
35,200,-200.0
36,200,-200.0
37,200,-200.0
38,200,-200.0
39,200,-200.0
40,200,-200.0
41,200,-200.0
42,200,-200.0
43,200,-200.0
44,200,-200.0
45,200,-200.0
46,200,-200.0
47,200,-200.0
48,200,-200.0
49,200,-200.0
50,200,-200.0
51,200,-200.0
52,200,-200.0
53,200,-200.0
54,200,-200.0
55,200,-200.0
56,200,-200.0
57,200,-200.0
58,200,-200.0
59,200,-200.0
60,200,-200.0
61,200,-200.0
62,200,-200.0
63,200,-200.0
64,200,-200.0
65,200,-200.0
66,200,-200.0
67,200,-200.0
68,200,-200.0
69,200,-200.0
70,200,-200.0
71,200,-200.0
72,200,-200.0
73,200,-200.0
74,200,-200.0
75,200,-200.0
76,200,-200.0
77,200,-200.0
78,200,-200.0
79,200,-200.0
80,200,-200.0
81,200,-200.0
82,200,-200.0
83,200,-200.0
84,200,-200.0
85,200,-200.0
86,200,-200.0
87,200,-200.0
88,200,-200.0
89,200,-200.0
90,200,-200.0
91,200,-200.0
92,200,-200.0
93,182,-182.0
94,200,-200.0
95,200,-200.0
96,200,-200.0
97,200,-200.0
98,200,-200.0
99,200,-200.0
100,200,-200.0
101,196,-196.0
102,192,-192.0
103,200,-200.0
104,200,-200.0
105,200,-200.0
106,200,-200.0
107,200,-200.0
108,200,-200.0
109,200,-200.0
110,128,-128.0
111,200,-200.0
112,200,-200.0
113,154,-154.0
114,159,-159.0
115,200,-200.0
116,138,-138.0
117,141,-141.0
118,139,-139.0
119,142,-142.0
120,126,-126.0
121,167,-167.0
122,120,-120.0
123,167,-167.0
124,200,-200.0
125,156,-156.0
126,164,-164.0
127,143,-143.0
128,178,-178.0
129,200,-200.0
130,170,-170.0
131,111,-111.0
132,112,-112.0
133,153,-153.0
134,153,-153.0
135,180,-180.0
136,194,-194.0
137,109,-109.0
138,200,-200.0
139,168,-168.0
140,181,-181.0
141,200,-200.0
142,177,-177.0
143,165,-165.0
144,158,-158.0
145,158,-158.0
146,138,-138.0
147,123,-123.0
148,182,-182.0
149,182,-182.0
150,200,-200.0
151,200,-200.0
152,200,-200.0
153,115,-115.0
154,178,-178.0
155,164,-164.0
156,161,-161.0
157,159,-159.0
158,157,-157.0
159,188,-188.0
160,195,-195.0
161,200,-200.0
162,200,-200.0
163,156,-156.0
164,151,-151.0
165,200,-200.0
166,147,-147.0
167,200,-200.0
168,199,-199.0
169,161,-161.0
170,175,-175.0
171,164,-164.0
172,101,-101.0
173,112,-112.0
174,186,-186.0
175,108,-108.0
176,138,-138.0
177,110,-110.0
178,162,-162.0
179,157,-157.0
180,156,-156.0
181,157,-157.0
182,108,-108.0
183,103,-103.0
184,155,-155.0
185,105,-105.0
186,196,-196.0
187,151,-151.0
188,146,-146.0
189,86,-86.0
190,160,-160.0
191,157,-157.0
192,200,-200.0
193,125,-125.0
194,138,-138.0
195,140,-140.0
196,200,-200.0
197,171,-171.0
198,161,-161.0
199,147,-147.0
200,163,-163.0
201,89,-89.0
202,144,-144.0
203,143,-143.0
204,148,-148.0
205,148,-148.0
206,95,-95.0
207,194,-194.0
208,164,-164.0
209,156,-156.0
210,97,-97.0
211,200,-200.0
212,161,-161.0
213,169,-169.0
214,151,-151.0
215,90,-90.0
216,153,-153.0
217,146,-146.0
218,165,-165.0
219,148,-148.0
220,157,-157.0
221,151,-151.0
222,143,-143.0
223,88,-88.0
224,155,-155.0
225,144,-144.0
226,165,-165.0
227,151,-151.0
228,169,-169.0
229,160,-160.0
230,120,-120.0
231,155,-155.0
232,94,-94.0
233,200,-200.0
234,165,-165.0
235,95,-95.0
236,179,-179.0
237,148,-148.0
238,88,-88.0
239,151,-151.0
240,97,-97.0
241,117,-117.0
242,146,-146.0
243,154,-154.0
244,145,-145.0
245,162,-162.0
246,146,-146.0
247,95,-95.0
248,96,-96.0
249,200,-200.0
250,151,-151.0
251,160,-160.0
252,84,-84.0
253,154,-154.0
254,140,-140.0
255,146,-146.0
256,147,-147.0
257,147,-147.0
258,99,-99.0
259,144,-144.0
260,154,-154.0
261,169,-169.0
262,165,-165.0
263,110,-110.0
264,116,-116.0
265,103,-103.0
266,149,-149.0
267,88,-88.0
268,155,-155.0
269,99,-99.0
270,97,-97.0
271,127,-127.0
272,105,-105.0
273,89,-89.0
274,145,-145.0
275,140,-140.0
276,89,-89.0
277,155,-155.0
278,92,-92.0
279,90,-90.0
280,199,-199.0
281,118,-118.0
282,90,-90.0
283,110,-110.0
284,114,-114.0
285,110,-110.0
286,200,-200.0
287,149,-149.0
288,156,-156.0
289,149,-149.0
290,147,-147.0
291,89,-89.0
292,154,-154.0
293,85,-85.0
294,88,-88.0
295,98,-98.0
296,124,-124.0
297,88,-88.0
298,172,-172.0
299,172,-172.0
300,155,-155.0
301,157,-157.0
302,86,-86.0
303,112,-112.0
304,87,-87.0
305,152,-152.0
306,148,-148.0
307,153,-153.0
308,145,-145.0
309,118,-118.0
310,148,-148.0
311,116,-116.0
312,200,-200.0
313,140,-140.0
314,155,-155.0
315,126,-126.0
316,108,-108.0
317,144,-144.0
318,148,-148.0
319,124,-124.0
320,117,-117.0
321,154,-154.0
322,121,-121.0
323,117,-117.0
324,120,-120.0
325,97,-97.0
326,111,-111.0
327,119,-119.0
328,122,-122.0
329,108,-108.0
330,106,-106.0
331,114,-114.0
332,147,-147.0
333,157,-157.0
334,115,-115.0
335,115,-115.0
336,122,-122.0
337,116,-116.0
338,86,-86.0
339,94,-94.0
340,154,-154.0
341,121,-121.0
342,116,-116.0
343,109,-109.0
344,123,-123.0
345,153,-153.0
346,138,-138.0
347,176,-176.0
348,120,-120.0
349,110,-110.0
350,168,-168.0
351,112,-112.0
352,86,-86.0
353,108,-108.0
354,140,-140.0
355,91,-91.0
356,115,-115.0
357,87,-87.0
358,134,-134.0
359,191,-191.0
360,157,-157.0
361,88,-88.0
362,110,-110.0
363,89,-89.0
364,106,-106.0
365,105,-105.0
366,110,-110.0
367,96,-96.0
368,108,-108.0
369,113,-113.0
370,114,-114.0
371,106,-106.0
372,150,-150.0
373,87,-87.0
374,107,-107.0
375,117,-117.0
376,86,-86.0
377,162,-162.0
378,103,-103.0
379,109,-109.0
380,110,-110.0
381,112,-112.0
382,150,-150.0
383,103,-103.0
384,116,-116.0
385,110,-110.0
386,106,-106.0
387,89,-89.0
388,168,-168.0
389,152,-152.0
390,92,-92.0
391,155,-155.0
392,85,-85.0
393,111,-111.0
394,107,-107.0
395,105,-105.0
396,87,-87.0
397,117,-117.0
398,104,-104.0
399,106,-106.0
400,105,-105.0
401,117,-117.0
402,105,-105.0
403,106,-106.0
404,93,-93.0
405,91,-91.0
406,166,-166.0
407,152,-152.0
408,101,-101.0
409,104,-104.0
410,96,-96.0
411,105,-105.0
412,147,-147.0
413,109,-109.0
414,153,-153.0
415,109,-109.0
416,158,-158.0
417,104,-104.0
418,89,-89.0
419,94,-94.0
420,89,-89.0
421,106,-106.0
422,108,-108.0
423,103,-103.0
424,121,-121.0
425,88,-88.0
426,91,-91.0
427,106,-106.0
428,85,-85.0
429,83,-83.0
430,88,-88.0
431,105,-105.0
432,106,-106.0
433,107,-107.0
434,147,-147.0
435,171,-171.0
436,111,-111.0
437,166,-166.0
438,141,-141.0
439,164,-164.0
440,159,-159.0
441,105,-105.0
442,85,-85.0
443,145,-145.0
444,106,-106.0
445,85,-85.0
446,87,-87.0
447,112,-112.0
448,118,-118.0
449,83,-83.0
450,106,-106.0
451,112,-112.0
452,109,-109.0
453,100,-100.0
454,105,-105.0
455,122,-122.0
456,112,-112.0
457,107,-107.0
458,106,-106.0
459,119,-119.0
460,119,-119.0
461,94,-94.0
462,118,-118.0
463,99,-99.0
464,145,-145.0
465,87,-87.0
466,107,-107.0
467,106,-106.0
468,109,-109.0
469,94,-94.0
470,96,-96.0
471,85,-85.0
472,93,-93.0
473,116,-116.0
474,88,-88.0
475,105,-105.0
476,99,-99.0
477,97,-97.0
478,152,-152.0
479,113,-113.0
480,154,-154.0
481,84,-84.0
482,148,-148.0
483,105,-105.0
484,142,-142.0
485,157,-157.0
486,137,-137.0
487,97,-97.0
488,157,-157.0
489,159,-159.0
490,93,-93.0
491,146,-146.0
492,142,-142.0
493,163,-163.0
494,85,-85.0
495,95,-95.0
496,151,-151.0
497,91,-91.0
498,149,-149.0
499,125,-125.0
500,145,-145.0
501,154,-154.0
502,84,-84.0
503,123,-123.0
504,91,-91.0
505,163,-163.0
506,102,-102.0
507,149,-149.0
508,89,-89.0
509,143,-143.0
510,120,-120.0
511,180,-180.0
512,123,-123.0
513,114,-114.0
514,146,-146.0
515,189,-189.0
516,165,-165.0
517,116,-116.0
518,116,-116.0
519,157,-157.0
520,123,-123.0
521,129,-129.0
522,106,-106.0
523,167,-167.0
524,124,-124.0
525,109,-109.0
526,116,-116.0
527,100,-100.0
528,98,-98.0
529,123,-123.0
530,164,-164.0
531,114,-114.0
532,127,-127.0
533,94,-94.0
534,88,-88.0
535,104,-104.0
536,92,-92.0
537,148,-148.0
538,91,-91.0
539,112,-112.0
540,125,-125.0
541,103,-103.0
542,159,-159.0
543,103,-103.0
544,162,-162.0
545,141,-141.0
546,113,-113.0
547,103,-103.0
548,168,-168.0
549,84,-84.0
550,150,-150.0
551,147,-147.0
552,114,-114.0
553,160,-160.0
554,93,-93.0
555,151,-151.0
556,84,-84.0
557,95,-95.0
558,153,-153.0
559,104,-104.0
560,115,-115.0
561,115,-115.0
562,104,-104.0
563,94,-94.0
564,158,-158.0
565,90,-90.0
566,105,-105.0
567,145,-145.0
568,134,-134.0
569,85,-85.0
570,108,-108.0
571,116,-116.0
572,150,-150.0
573,88,-88.0
574,117,-117.0
575,111,-111.0
576,117,-117.0
577,155,-155.0
578,118,-118.0
579,107,-107.0
580,111,-111.0
581,84,-84.0
582,106,-106.0
583,110,-110.0
584,114,-114.0
585,115,-115.0
586,109,-109.0
587,108,-108.0
588,93,-93.0
589,89,-89.0
590,102,-102.0
591,111,-111.0
592,84,-84.0
593,105,-105.0
594,85,-85.0
595,88,-88.0
596,136,-136.0
597,116,-116.0
598,119,-119.0
599,200,-200.0
600,98,-98.0
