{
    "model_info": "common12",
    "episodes": [
        24,
        14,
        16,
        21,
        25,
        19,
        12,
        12,
        16,
        22,
        10,
        16,
        10,
        11,
        14,
        11,
        17,
        10,
        14,
        11,
        11,
        10,
        11,
        11,
        8,
        8,
        9,
        8,
        9,
        10,
        10,
        14,
        10,
        9,
        9,
        8,
        10,
        9,
        10,
        11,
        9,
        10,
        10,
        9,
        10,
        9,
        10,
        10,
        9,
        9,
        9,
        10,
        11,
        10,
        9,
        9,
        9,
        10,
        9,
        10,
        10,
        9,
        16,
        10,
        9,
        11,
        10,
        14,
        13,
        12,
        11,
        12,
        10,
        16,
        13,
        15,
        15,
        15,
        10,
        36,
        9,
        12,
        14,
        9,
        9,
        10,
        18,
        10,
        18,
        8,
        14,
        11,
        8,
        21,
        11,
        22,
        9,
        13,
        16,
        11,
        13,
        15,
        21,
        32,
        10,
        10,
        9,
        10,
        10,
        10,
        9,
        14,
        12,
        10,
        10,
        10,
        10,
        12,
        9,
        9,
        10,
        9,
        10,
        8,
        10,
        9,
        10,
        11,
        17,
        10,
        11,
        9,
        8,
        10,
        10,
        10,
        10,
        9,
        8,
        13,
        10,
        10,
        13,
        9,
        17,
        10,
        16,
        12,
        27,
        14,
        16,
        14,
        15,
        13,
        15,
        18,
        21,
        14,
        22,
        25,
        18,
        29,
        27,
        24,
        38,
        33,
        35,
        59,
        26,
        45,
        16,
        29,
        27,
        27,
        27,
        15,
        19,
        18,
        12,
        21,
        17,
        22,
        12,
        17,
        16,
        15,
        17,
        19,
        19,
        39,
        27,
        50,
        54,
        74,
        38,
        71,
        90,
        53,
        76,
        79,
        77,
        92,
        80,
        50,
        80,
        57,
        38,
        21,
        44,
        30,
        152,
        53,
        77,
        48,
        51,
        53,
        82,
        72,
        140,
        69,
        82,
        184,
        251,
        129,
        126,
        192,
        83,
        83,
        125,
        67,
        41,
        124,
        133,
        126,
        135,
        111,
        112,
        176,
        144,
        130,
        125,
        22,
        142,
        107,
        59,
        128,
        110,
        43,
        124,
        25,
        44,
        107,
        15,
        23,
        67,
        27,
        43,
        101,
        116,
        137,
        132,
        128,
        122,
        138,
        169,
        116,
        141,
        168,
        159,
        167,
        167,
        181,
        175,
        172,
        209,
        150,
        169,
        189,
        162,
        191,
        195,
        208,
        155,
        194,
        173,
        206,
        178,
        162,
        177,
        168,
        156,
        210,
        148,
        196,
        191,
        54,
        183,
        56,
        62,
        343,
        101,
        254,
        86,
        154,
        396,
        252,
        138,
        309,
        115,
        168,
        271,
        185,
        343,
        243,
        293,
        247,
        277,
        292,
        251,
        274,
        269,
        360,
        351,
        294,
        265,
        106,
        243,
        300,
        302,
        378,
        331,
        351,
        327,
        334,
        353,
        119,
        146,
        500,
        35,
        301,
        74,
        214,
        93,
        63,
        146,
        49,
        75,
        143,
        63,
        54,
        61,
        43,
        85,
        83,
        255,
        69,
        500,
        406,
        89,
        492,
        452,
        286,
        407,
        65,
        332,
        354,
        383,
        383,
        364,
        342,
        500,
        470,
        500,
        500,
        500,
        500,
        500,
        500,
        500,
        500,
        379,
        236,
        320,
        368,
        354,
        375,
        422,
        500,
        500,
        500,
        500,
        500,
        500,
        500,
        500,
        500,
        269,
        243,
        125,
        196,
        166,
        145,
        48,
        155,
        68,
        150,
        169,
        92,
        124,
        296,
        338,
        500,
        500,
        500,
        276,
        500,
        500,
        187,
        500,
        412,
        325,
        492,
        500,
        312,
        500,
        500,
        500,
        120,
        500,
        500,
        117,
        500,
        137,
        285,
        407,
        471,
        500,
        304,
        290,
        500,
        399,
        409,
        316,
        500,
        215,
        275,
        231,
        366,
        108,
        227,
        136,
        330,
        106,
        87,
        218,
        217,
        216,
        457,
        28,
        265,
        420,
        192,
        500,
        500,
        500,
        360,
        500,
        500,
        500,
        500,
        500,
        500,
        500,
        500,
        500,
        500,
        500,
        500,
        500,
        330,
        414,
        500,
        243,
        216,
        235,
        500,
        228,
        376,
        232,
        243,
        500,
        205,
        241,
        477,
        500,
        408,
        360,
        436,
        500,
        373,
        351,
        339,
        500,
        490,
        481,
        500,
        500,
        383,
        500,
        235,
        427,
        500,
        314,
        369,
        342,
        443,
        414,
        500,
        343,
        350,
        465,
        326,
        500,
        500,
        500,
        500,
        500,
        282,
        500,
        500,
        500,
        500,
        500,
        500,
        500,
        500,
        500,
        500,
        500,
        500,
        500,
        221,
        500,
        500,
        500,
        500,
        500,
        500,
        485,
        500,
        243,
        408,
        500,
        251,
        500,
        500,
        410,
        500,
        500,
        500,
        500,
        500,
        186,
        500,
        500,
        311,
        212,
        500,
        500,
        257,
        467,
        500,
        500,
        500,
        500,
        500,
        500,
        500,
        500,
        500,
        500,
        500,
        500,
        500,
        500,
        500,
        112,
        500,
        500,
        195,
        500,
        500,
        500,
        500,
        500,
        500,
        500,
        500,
        500,
        500,
        124,
        500,
        500,
        500,
        500,
        500,
        500,
        500,
        500,
        500,
        500,
        500,
        500,
        500,
        500,
        500,
        500,
        500,
        500,
        500,
        500,
        35,
        500,
        18,
        500,
        500,
        19,
        500,
        500,
        500,
        500,
        500,
        23,
        500,
        500,
        500,
        500,
        500,
        500,
        500,
        500,
        500,
        500,
        500,
        500,
        500,
        500,
        500,
        75,
        500,
        500,
        500,
        500,
        500,
        500,
        268,
        500,
        500,
        500,
        500,
        500,
        500,
        500,
        500,
        500,
        500,
        19,
        30,
        170,
        182,
        171,
        17,
        191,
        174,
        191,
        239,
        16,
        305,
        270,
        368,
        500,
        500,
        500,
        500,
        500,
        500,
        500,
        500,
        66,
        500,
        500,
        500,
        500,
        500,
        500,
        500,
        500,
        500,
        500,
        500,
        500,
        500,
        500,
        500,
        289,
        500,
        500,
        500,
        500,
        86,
        500,
        208,
        500,
        500,
        500,
        500,
        500,
        500,
        73,
        164,
        175,
        500,
        280,
        255,
        400,
        500,
        500,
        500,
        500,
        92,
        500,
        458,
        500,
        17,
        500,
        500,
        500,
        500,
        500,
        500,
        500,
        500,
        92,
        500,
        23,
        500,
        500,
        500,
        500,
        500,
        500,
        500,
        103,
        500,
        500,
        500,
        500,
        98,
        500,
        500,
        500,
        500,
        500,
        500,
        500,
        193,
        500,
        500,
        500,
        500,
        500,
        500,
        500,
        500,
        500,
        122,
        500,
        205,
        500,
        500,
        389,
        500,
        500,
        500,
        500,
        500,
        500,
        500,
        500,
        500,
        500,
        500,
        500,
        500,
        500,
        500,
        500,
        500,
        500,
        500,
        500,
        500,
        500,
        500,
        500,
        500,
        500,
        500,
        500,
        500,
        500,
        500,
        500,
        500,
        500,
        500,
        500,
        500,
        500,
        500,
        500,
        500,
        500,
        500,
        500,
        500,
        500,
        500,
        500,
        500,
        500,
        500,
        500,
        500,
        500,
        500,
        500,
        500,
        500,
        500,
        500,
        500,
        500
    ],
    "durations": [
        1.420984,
        0.005004,
        0.004997,
        0.006,
        0.008001,
        0.004999,
        0.002999,
        0.004001,
        0.004999,
        0.006006,
        0.003,
        0.005,
        0.002998,
        0.003004,
        0.003999,
        0.003998,
        0.003999,
        0.002998,
        0.004,
        0.003001,
        0.003002,
        0.003,
        0.002996,
        0.002999,
        0.003,
        0.003003,
        0.004007,
        0.002,
        0.002,
        0.003,
        0.002999,
        0.003999,
        0.002999,
        0.002001,
        0.003,
        0.003,
        0.003002,
        0.002998,
        0.003,
        0.003001,
        0.002,
        0.001998,
        0.003001,
        0.002,
        0.001996,
        0.002,
        0.002998,
        0.003,
        0.003002,
        0.002998,
        0.002002,
        0.002999,
        0.003001,
        0.003005,
        0.002995,
        0.004005,
        0.004,
        0.002999,
        0.002999,
        0.002999,
        0.003005,
        0.002995,
        0.005,
        0.004005,
        0.001999,
        0.004,
        0.003,
        0.003998,
        0.004001,
        0.004,
        0.003,
        0.004002,
        0.002997,
        0.005002,
        0.003999,
        0.004,
        0.003999,
        0.005001,
        0.002996,
        0.009999,
        0.003002,
        0.002997,
        0.004,
        0.002999,
        0.001999,
        0.001999,
        0.003999,
        0.002002,
        0.004001,
        0.002,
        0.004001,
        0.002999,
        0.003001,
        0.005999,
        0.004002,
        0.006997,
        0.004001,
        0.003996,
        0.005001,
        0.003,
        0.004,
        0.004001,
        0.006006,
        0.008984,
        0.003,
        0.002999,
        0.002,
        0.001998,
        0.002001,
        0.001999,
        0.001998,
        0.005002,
        0.003001,
        0.002,
        0.001999,
        0.003002,
        0.002999,
        0.003,
        0.003001,
        0.002997,
        0.003003,
        0.004005,
        0.002993,
        0.003,
        0.003001,
        0.002999,
        0.003,
        0.003,
        0.005,
        0.003,
        0.004,
        0.002,
        0.001999,
        0.003003,
        0.002997,
        0.003,
        0.003001,
        0.003002,
        0.002,
        0.003002,
        0.002999,
        0.001999,
        0.003,
        0.002999,
        0.005,
        0.003001,
        0.003999,
        0.004004,
        0.006997,
        0.004003,
        0.004,
        0.003999,
        0.004001,
        0.004002,
        0.004,
        0.004997,
        0.006001,
        0.004001,
        0.005998,
        0.007003,
        0.004999,
        0.007999,
        0.008002,
        0.006998,
        0.009999,
        0.010002,
        0.009999,
        0.014999,
        0.007,
        0.012001,
        0.004,
        0.008001,
        0.007,
        0.008002,
        0.009012,
        0.003987,
        0.006002,
        0.005001,
        0.004,
        0.007998,
        0.005001,
        0.005998,
        0.003003,
        0.004,
        0.005,
        0.004,
        0.003998,
        0.006,
        0.005,
        0.010002,
        0.008002,
        0.013,
        0.013999,
        0.019,
        0.010003,
        0.019,
        0.022996,
        0.013985,
        0.019999,
        0.021001,
        0.020003,
        0.023998,
        0.021,
        0.013004,
        0.022999,
        0.015997,
        0.011,
        0.005999,
        0.013001,
        0.009002,
        0.038999,
        0.014002,
        0.019997,
        0.013001,
        0.014002,
        0.013999,
        0.022991,
        0.018985,
        0.034983,
        0.017999,
        0.020999,
        0.046971,
        0.065,
        0.033999,
        0.033002,
        0.049997,
        0.023001,
        0.022,
        0.031998,
        0.018,
        0.01098,
        0.03302,
        0.033981,
        0.032001,
        0.035,
        0.028999,
        0.029999,
        0.048003,
        0.036997,
        0.036002,
        0.031998,
        0.006001,
        0.037002,
        0.03,
        0.015998,
        0.033002,
        0.03,
        0.012003,
        0.032998,
        0.007,
        0.012001,
        0.029001,
        0.004996,
        0.006001,
        0.016998,
        0.008001,
        0.010999,
        0.026999,
        0.031,
        0.038005,
        0.038996,
        0.033,
        0.032017,
        0.034981,
        0.044999,
        0.031003,
        0.036,
        0.044982,
        0.041003,
        0.042981,
        0.043999,
        0.051019,
        0.046981,
        0.046,
        0.055,
        0.038999,
        0.047018,
        0.050984,
        0.041998,
        0.054,
        0.051002,
        0.055,
        0.043002,
        0.049998,
        0.046999,
        0.053999,
        0.048004,
        0.041999,
        0.047001,
        0.045,
        0.039998,
        0.05698,
        0.039001,
        0.051998,
        0.052003,
        0.01499,
        0.045982,
        0.016001,
        0.017998,
        0.09,
        0.028,
        0.066,
        0.022001,
        0.040999,
        0.106998,
        0.069002,
        0.036002,
        0.081986,
        0.029997,
        0.046001,
        0.071001,
        0.050013,
        0.092986,
        0.063001,
        0.076001,
        0.065,
        0.070999,
        0.079002,
        0.064999,
        0.071001,
        0.069001,
        0.094032,
        0.089998,
        0.075999,
        0.069,
        0.027002,
        0.061987,
        0.077,
        0.079001,
        0.099999,
        0.086999,
        0.094002,
        0.086001,
        0.088982,
        0.093999,
        0.034,
        0.038999,
        0.133001,
        0.010003,
        0.080999,
        0.02,
        0.062999,
        0.024998,
        0.018004,
        0.041997,
        0.014999,
        0.022002,
        0.042998,
        0.018001,
        0.017001,
        0.016998,
        0.011999,
        0.022001,
        0.022001,
        0.068998,
        0.020925,
        0.132999,
        0.108,
        0.025001,
        0.131001,
        0.120999,
        0.074998,
        0.105002,
        0.021002,
        0.08599,
        0.090999,
        0.100001,
        0.103999,
        0.095002,
        0.088,
        0.129999,
        0.121002,
        0.132997,
        0.136333,
        0.132001,
        0.135,
        0.131,
        0.132001,
        0.132015,
        0.132984,
        0.101999,
        0.060999,
        0.084195,
        0.098996,
        0.094001,
        0.099002,
        0.113,
        0.132996,
        0.137003,
        0.133998,
        0.137,
        0.129047,
        0.132984,
        0.13,
        0.130002,
        0.129999,
        0.068984,
        0.065002,
        0.031999,
        0.052,
        0.041999,
        0.037998,
        0.012984,
        0.040002,
        0.017983,
        0.038004,
        0.043996,
        0.023001,
        0.031999,
        0.077004,
        0.087996,
        0.129,
        0.13,
        0.132,
        0.072998,
        0.128002,
        0.13,
        0.048003,
        0.130999,
        0.105985,
        0.082998,
        0.129001,
        0.137003,
        0.086997,
        0.138001,
        0.134,
        0.137999,
        0.033,
        0.139,
        0.136001,
        0.031999,
        0.135001,
        0.037,
        0.08,
        0.116001,
        0.127999,
        0.139001,
        0.084999,
        0.108001,
        0.141999,
        0.112001,
        0.116999,
        0.086001,
        0.139001,
        0.064,
        0.081001,
        0.071998,
        0.103001,
        0.032003,
        0.106999,
        0.055,
        0.11,
        0.033999,
        0.033002,
        0.078999,
        0.075999,
        0.071,
        0.129001,
        0.008999,
        0.07,
        0.118002,
        0.057,
        0.148001,
        0.137999,
        0.132999,
        0.099004,
        0.144003,
        0.140999,
        0.137,
        0.141,
        0.139999,
        0.142001,
        0.142001,
        0.138998,
        0.148001,
        0.151999,
        0.142001,
        0.133999,
        0.130001,
        0.084,
        0.117,
        0.139001,
        0.065997,
        0.059998,
        0.064,
        0.137001,
        0.065001,
        0.102998,
        0.061,
        0.066,
        0.137,
        0.055,
        0.068001,
        0.143001,
        0.157,
        0.113,
        0.098999,
        0.121999,
        0.129997,
        0.103001,
        0.091001,
        0.094998,
        0.139,
        0.133003,
        0.124999,
        0.129998,
        0.135003,
        0.101,
        0.133002,
        0.060003,
        0.111999,
        0.138,
        0.090001,
        0.099999,
        0.089002,
        0.114999,
        0.107,
        0.131003,
        0.095998,
        0.094001,
        0.128002,
        0.086999,
        0.133,
        0.139999,
        0.137001,
        0.141,
        0.138,
        0.075002,
        0.133,
        0.138999,
        0.142,
        0.137,
        0.137001,
        0.136999,
        0.136,
        0.138,
        0.139999,
        0.136999,
        0.133002,
        0.160002,
        0.163998,
        0.061001,
        0.134999,
        0.140001,
        0.174999,
        0.18,
        0.143,
        0.131,
        0.126002,
        0.132998,
        0.084001,
        0.107988,
        0.135001,
        0.066001,
        0.161003,
        0.192002,
        0.137998,
        0.186001,
        0.202998,
        0.156,
        0.155003,
        0.138998,
        0.051998,
        0.138999,
        0.138001,
        0.083003,
        0.057998,
        0.136003,
        0.135,
        0.076004,
        0.130999,
        0.141984,
        0.148,
        0.142997,
        0.141997,
        0.148,
        0.143,
        0.151002,
        0.146996,
        0.137999,
        0.14,
        0.141001,
        0.142,
        0.141002,
        0.132986,
        0.141,
        0.034998,
        0.142,
        0.141988,
        0.051997,
        0.155002,
        0.145999,
        0.151999,
        0.145,
        0.138002,
        0.137,
        0.138002,
        0.140997,
        0.137002,
        0.143001,
        0.033,
        0.135989,
        0.134,
        0.134,
        0.134,
        0.136002,
        0.132998,
        0.133,
        0.135015,
        0.133986,
        0.134999,
        0.134016,
        0.133984,
        0.134,
        0.134001,
        0.134999,
        0.132016,
        0.133,
        0.133986,
        0.134014,
        0.134984,
        0.01201,
        0.133991,
        0.004999,
        0.133,
        0.134,
        0.005001,
        0.132001,
        0.134,
        0.133999,
        0.139999,
        0.141001,
        0.007997,
        0.133002,
        0.137,
        0.134015,
        0.133984,
        0.132015,
        0.132986,
        0.133998,
        0.135,
        0.134015,
        0.134001,
        0.133986,
        0.132999,
        0.133,
        0.134001,
        0.133,
        0.020015,
        0.135987,
        0.136,
        0.134016,
        0.134984,
        0.133999,
        0.134017,
        0.069984,
        0.133,
        0.136999,
        0.134017,
        0.133999,
        0.132983,
        0.132984,
        0.133001,
        0.138003,
        0.141003,
        0.140998,
        0.004999,
        0.009001,
        0.046001,
        0.049002,
        0.048,
        0.004999,
        0.054014,
        0.048002,
        0.049999,
        0.066015,
        0.004985,
        0.082997,
        0.070998,
        0.099002,
        0.131999,
        0.133002,
        0.133996,
        0.136985,
        0.136,
        0.134,
        0.134016,
        0.135983,
        0.018001,
        0.133,
        0.133998,
        0.132984,
        0.137046,
        0.135985,
        0.143976,
        0.152002,
        0.139,
        0.141,
        0.138015,
        0.137984,
        0.139002,
        0.145983,
        0.135016,
        0.136,
        0.075985,
        0.137998,
        0.137,
        0.135999,
        0.134016,
        0.023996,
        0.134,
        0.053002,
        0.132986,
        0.136999,
        0.136015,
        0.133985,
        0.135003,
        0.132997,
        0.019015,
        0.042984,
        0.044999,
        0.139016,
        0.073985,
        0.067001,
        0.106,
        0.139015,
        0.135,
        0.133986,
        0.133999,
        0.025002,
        0.133997,
        0.124002,
        0.132998,
        0.005003,
        0.132996,
        0.134011,
        0.135989,
        0.131999,
        0.133999,
        0.133008,
        0.136008,
        0.132983,
        0.026001,
        0.134003,
        0.005985,
        0.132014,
        0.137987,
        0.133998,
        0.134015,
        0.135987,
        0.135001,
        0.133009,
        0.026992,
        0.135014,
        0.131985,
        0.134999,
        0.134001,
        0.026,
        0.132999,
        0.133016,
        0.137,
        0.133,
        0.133986,
        0.135998,
        0.133002,
        0.049016,
        0.132984,
        0.132999,
        0.137,
        0.133002,
        0.132999,
        0.131984,
        0.136002,
        0.134013,
        0.133984,
        0.031,
        0.134001,
        0.055,
        0.133999,
        0.133663,
        0.102018,
        0.137,
        0.132998,
        0.133048,
        0.133,
        0.134003,
        0.135987,
        0.134016,
        0.132001,
        0.136003,
        0.133,
        0.132987,
        0.136019,
        0.134983,
        0.133014,
        0.133984,
        0.133,
        0.133998,
        0.132015,
        0.138984,
        0.133,
        0.136985,
        0.137998,
        0.135001,
        0.135,
        0.141,
        0.135,
        0.136001,
        0.135999,
        0.133016,
        0.136,
        0.133984,
        0.135001,
        0.135,
        0.135999,
        0.132001,
        0.139001,
        0.135,
        0.138997,
        0.136002,
        0.136998,
        0.134,
        0.137003,
        0.134,
        0.136999,
        0.132909,
        0.133,
        0.133004,
        0.136997,
        0.133002,
        0.132986,
        0.132996,
        0.133002,
        0.137016,
        0.133999,
        0.137001,
        0.133986,
        0.133988,
        0.138,
        0.137004,
        0.136992,
        0.134003,
        0.133996
    ]
}