episodes,steps,rewards
0,96,-134.27390460567074
1,64,-67.60203560068067
2,87,-296.02925016186293
3,64,-106.2430337547946
4,88,-131.69038295701966
5,73,-337.56773452052494
6,61,-149.27463844299376
7,76,-253.37392441453818
8,84,-137.167630631332
9,65,-91.82920236543066
10,87,-369.683730401613
11,76,-80.16627928344425
12,111,-219.22462313318408
13,153,-263.19096495074064
14,187,-587.721698904337
15,99,-271.998202030234
16,115,-223.09345252358102
17,173,-112.72276595023817
18,163,-139.5377575168729
19,450,-250.92835352168706
20,653,-269.50757243821323
21,1000,-243.35063540359198
22,1000,-223.3098084259084
23,458,-278.780964006972
24,1000,-179.26408029655215
25,1000,-153.41681285861725
26,225,-62.98204360334876
27,278,-93.61637757186195
28,162,-77.96795000237036
29,203,-101.32090350487432
30,158,-8.227866443958035
31,656,-34.545812673322885
32,999,-208.5722883714663
33,1000,-80.46725240410083
34,1000,-68.02302771073714
35,1000,17.639444466584088
36,1000,-45.21399324071276
37,1000,-43.381003001885844
38,261,-147.92124192790783
39,804,155.44788001488692
40,1000,-50.300486486534005
41,1000,-70.17757868216357
42,305,-255.9614457169957
43,269,-230.56570732979122
44,1000,-116.87833382329862
45,1000,-47.551764257744885
46,1000,8.666631114341735
47,1000,-62.25835979938421
48,1000,-26.907524120645313
49,1000,12.760750104027053
50,1000,25.176087337749514
51,1000,-10.797194583659312
52,1000,5.129511237725928
53,928,112.55968034295361
54,115,-29.62040238620152
55,95,-499.05972025117876
56,307,-844.8412118639116
57,202,-245.64123422232683
58,433,-210.32605326034724
59,57,-343.7755036118883
60,54,-369.99403592656273
61,51,-314.3495781634613
62,68,-171.265734734911
63,112,-166.94237671171487
64,67,-92.8839681635192
65,89,-153.24774046503592
66,187,-405.3811413738986
67,95,-579.6037318068209
68,115,-473.61914513072605
69,106,-894.8030261735394
70,154,-396.55992708963424
71,101,-197.5976545172463
72,176,-131.83071943721563
73,169,-323.75330041617127
74,548,-306.75623877755686
75,279,-393.7929192116122
76,600,-148.77025211585573
77,114,-98.72877042922998
78,157,-74.63781216776711
79,1000,-288.8006358309761
80,1000,-80.71517122312409
81,633,194.69197308933735
82,712,218.29367514815596
83,211,-73.96527956813188
84,693,-32.76050607639419
85,375,-48.773544913424715
86,1000,11.6968320365496
87,1000,-47.21577673305695
88,508,147.20418970647057
89,693,215.94558785995451
90,426,-238.62482317753995
91,876,-215.07566396672541
92,340,-77.07500543132241
93,1000,-26.981340762279856
94,1000,-4.118689103936158
95,1000,-58.72164079630194
96,841,179.93786680447744
97,765,-269.16759290164407
98,1000,-65.61941426188659
99,485,213.18501923406137
100,138,-238.53644311757384
101,530,-62.13124055868786
102,163,-164.33945753326103
103,1000,-17.902792152990436
104,1000,0.6942872659020467
105,1000,1.4380744021050802
106,954,138.15524309532898
107,892,178.11500394263476
108,689,223.33877788040786
109,676,168.41990629342325
110,594,204.12899210349212
111,629,271.6898727051158
112,434,245.59368264167142
113,99,-234.17286393481618
114,106,-212.77857020147718
115,548,-160.64468710711856
116,611,207.66189095423482
117,785,198.92285448366357
118,425,-33.88285662630288
119,524,193.2831736866849
120,391,185.16852865421308
121,437,-314.65837550870054
122,411,220.95484842871446
123,441,-101.4437746153314
124,926,112.41122625568937
125,713,147.89053609413835
126,380,215.76689894674183
127,624,212.07276781126677
128,467,249.71394755394522
129,468,-10.715886009131992
130,325,241.13940099192934
131,1000,-78.30100485834622
132,674,141.66752241720164
133,152,-162.44574893624642
134,389,-22.242604737888556
135,602,166.753456371376
136,383,255.95475433987284
137,624,209.11863726585253
138,549,211.5706174568241
139,605,219.25281157401275
140,108,-220.72382162391398
141,359,243.81675934511927
142,196,-254.4723435594066
143,378,230.3410593800146
144,420,214.26254181040264
145,509,163.51428242058034
146,382,-21.035422028980662
147,380,247.0758855150401
148,466,239.01110853896603
149,186,-38.16971502083294
150,471,204.50724501640553
151,540,205.70533346394546
152,1000,47.14261701151028
153,368,298.01528391650675
154,387,256.28924395482886
155,280,246.27656002959262
156,568,239.5294404185496
157,477,234.3278712554978
158,366,283.055517282851
159,458,236.97748908495032
160,328,266.4740989633018
161,289,298.88127831761653
162,282,226.33466034526964
163,317,298.561434639388
164,490,238.74606804902044
165,293,234.62480860342606
166,390,246.552407529821
167,357,266.6381755610606
168,265,269.4088484065784
169,339,250.34398831147575
170,344,280.7940845472233
171,828,239.30349619383898
172,828,245.62445274114873
173,246,245.61851095490366
174,329,235.41690255411658
175,140,-691.2593394462717
176,238,-76.36633108994043
177,93,-133.8006916719217
178,301,296.2087708796344
179,505,212.89797962182354
180,483,252.8517409508238
181,440,205.47402105922518
182,661,263.2418001604476
183,114,-134.46876076766387
184,232,279.5449155648289
185,452,233.81213285237786
186,301,243.55752044573154
187,283,255.77279508589265
188,309,299.54735638424063
189,202,51.085516849993326
190,297,247.82561305835196
191,245,280.3425601496244
192,282,256.5149926848786
193,407,241.86468926583711
194,108,-229.825465536396
195,119,-410.52690167071523
196,102,-324.6214703322305
197,228,237.14127221978106
198,284,211.6188352982795
199,180,19.542849646126754
200,278,261.28643820044124
201,1000,-17.168084187747162
202,390,216.73973437112198
203,100,-293.70529354905557
204,135,-216.8749788740357
205,462,267.92799933524316
206,370,226.99917766479626
207,425,245.65765619268362
208,561,-558.1792549113775
209,769,218.08554939386164
210,523,241.89898168039346
211,532,211.28978317063644
212,401,252.37256996588889
213,345,238.21945977396715
214,168,-101.14115250684976
215,313,256.31284241929086
216,481,222.38759529252968
217,485,209.13746564865923
218,317,246.25707610273497
219,409,229.40848132549806
220,299,-289.8952696320099
221,172,36.28882980423995
222,297,275.17507107548323
223,512,207.021830959831
224,673,210.5396538821676
225,538,189.6290191557187
226,305,-90.62725461324396
227,663,219.85537927453015
228,262,-380.24029802050853
229,151,-268.99433203004253
230,282,-300.02971795976345
231,363,-899.1502117103719
232,189,-219.06693946441308
233,769,-237.48756274736422
234,856,171.18091986416127
235,588,200.36022800526774
236,89,-120.58919685984635
237,1000,-134.1150566956471
238,583,191.3446471031537
239,234,272.33219961525833
240,360,286.43532182105093
241,272,247.16829095185653
242,417,-145.19081400354804
243,346,285.38774914854764
244,146,58.204867507091706
245,265,227.53233722748928
246,325,246.91220501026675
247,399,255.151300199569
248,179,53.45870576516285
249,323,-120.4519091294402
250,90,-295.0527111115034
251,818,-233.54463689273308
252,518,-113.6099228386956
253,785,200.82322920993528
254,149,34.173486808946706
255,1000,59.127952364541684
256,430,-145.22938511996813
257,456,242.92013033124843
258,811,209.34622396294617
259,209,-86.36536864094937
260,626,226.54016596598115
261,437,244.22866325425534
262,603,264.9862291339604
263,784,231.08205343136007
264,1000,-132.14500056607125
265,296,216.67844478584084
266,1000,42.16245252005574
267,391,246.8786394890788
268,450,231.80961466772482
269,579,247.23232827178785
270,369,31.704968807216147
271,377,251.08500545349003
272,395,230.3276497022394
273,379,250.0163164480345
274,328,256.73664253522804
275,466,248.2907703852892
276,269,241.49351597994183
277,660,208.21115532604483
278,374,235.23090400986214
279,139,-51.539414484794904
280,350,214.18731509141446
281,161,41.922132483949724
282,82,-18.381266231789198
283,113,52.60763539448436
284,101,-21.482939135171577
285,368,257.1914325651237
286,1000,43.38066932067
287,343,245.91186209977263
288,365,263.2022841142077
289,436,209.78634383278504
290,467,237.79670374073686
291,292,233.5452273842135
292,386,247.8384828335398
293,306,244.84377377126253
294,280,264.77095725459264
295,265,262.55105364640485
296,545,227.5721788370235
297,453,262.77408047531065
298,297,278.85940969781615
299,353,-26.735964891815925
300,458,268.96635662733866
301,406,247.0486668901928
302,331,238.5350699913404
303,313,265.0295861605704
304,431,-321.90942958621736
305,545,202.48318166284835
306,322,272.13735832144835
307,419,220.98406128525863
308,321,267.60743334081116
309,310,260.74487648235606
310,317,246.6612101637658
311,129,-93.12522746973507
312,430,269.6314018379714
313,528,244.72075648990443
314,738,259.29618149376387
315,473,261.3898107892793
316,177,11.08962013513053
317,382,249.88883259275934
318,409,191.95407449663546
319,393,270.1694319476683
320,240,264.27083506557585
321,370,-192.46988453865907
322,1000,-116.86480682246314
323,536,230.35600847076142
324,228,219.8665414076599
325,523,-403.2435225326598
326,383,173.06878788088062
327,357,243.169979577917
328,284,206.00730310441872
329,374,246.6592164129348
330,754,133.07941049907532
331,196,257.9082183954458
332,728,154.5981378059038
333,402,260.1897272665233
334,1000,135.68859080435763
335,376,251.71875349277877
336,213,307.1552873780354
337,387,235.14059144235932
338,345,204.8720336782403
339,287,243.10989582007372
340,328,274.2336062992639
341,289,269.5455961984827
342,316,294.68891961502266
343,263,289.3699932590456
344,214,278.6286239089884
345,256,286.662937457809
346,232,251.56548266101757
347,306,267.8859591445854
348,329,297.11713725052175
349,224,255.08611553200112
350,268,279.7176258331184
351,334,249.46739389635684
352,273,274.7457560823524
353,230,248.55109929332852
354,354,292.5653928641318
355,259,285.9063409601582
356,358,253.90209237383849
357,266,264.40988084967154
358,225,-191.23007234897696
359,174,252.18485938689142
360,86,-335.2886884508969
361,86,-182.36450332158915
362,191,243.9751594100947
363,267,278.4678555246935
364,166,-25.88049952479534
365,208,-46.95382978287864
366,1000,29.896708124629797
367,124,-137.29943325663595
368,254,212.95216648915303
369,146,-213.60245769144035
370,249,265.80001622117544
371,280,243.2095444208028
372,273,299.6709750321364
373,303,288.3895714109689
374,316,287.9026075835339
375,322,261.63540765881385
376,282,283.99822186188544
377,281,296.16384134127713
378,137,-461.47816924785764
379,222,289.4642276424537
380,432,209.3936444090424
381,302,222.10827779079662
382,266,256.0153423700215
383,388,263.91870089815313
384,461,243.2062322908488
385,494,177.26479479693774
386,172,240.19598016781882
387,219,31.60985929632099
388,375,283.762335121992
389,108,31.21142089376849
390,172,21.387412409343227
391,181,42.46882054835672
392,274,240.20645585200032
393,279,276.8292807316976
394,447,260.63784750082857
395,185,20.332507278522286
396,280,266.0904020915004
397,234,266.76914875982743
398,241,37.03388240995872
399,325,-199.02632270081273
400,273,300.23550403349475
401,172,44.36556916857401
402,263,300.33947102019033
403,477,-125.7095036534393
404,238,283.52483738955334
405,357,270.31811033724296
406,283,283.96240360266574
407,149,34.950986895167034
408,225,283.2645501501778
409,340,232.97986699618212
410,240,180.3386871674142
411,504,203.34555362946276
412,383,227.02626313019138
413,341,228.79809294532978
414,306,-78.2671529673521
415,386,-181.64982900883035
416,365,-170.8651189425919
417,321,200.4717950913204
418,771,141.02788402202398
419,362,280.685467065549
420,397,225.9291679852994
421,370,256.5599086697965
422,313,226.51689497720037
423,324,-80.08792367153237
424,284,270.31570023770905
425,694,161.48402389043778
426,239,-17.603517201864406
427,351,188.80562804268254
428,554,253.26404610780122
429,216,277.7217946725406
430,278,272.0381749415093
431,326,234.09093892092906
432,332,250.8024322008537
433,241,-243.9651321798403
434,148,-1.1533014022278536
435,330,229.47915009417892
436,337,-157.08968300257052
437,478,277.1402124883325
438,233,-287.68706772346246
439,358,210.32886016291297
440,834,-233.1982175829845
441,843,174.13950171437676
442,123,-47.74594666117234
443,845,147.78161971065936
444,576,201.68984327336162
445,316,241.2934938009783
446,332,203.0167613400804
447,292,213.57858292085263
448,350,217.48181117129445
449,86,-464.96263667154767
450,719,99.20961444222274
451,153,-686.611420214517
452,523,124.3756968576981
453,1000,-37.126893498091036
454,638,196.7385053259843
455,1000,-22.50675092800814
456,1000,66.08400484498819
457,625,160.04054535768364
458,589,201.5843135090372
459,94,-296.54189420366833
460,712,202.19916605324346
461,1000,-423.5842199047085
462,504,236.71520925879494
463,654,-193.76459902434155
464,747,183.74797706601132
465,609,185.08408460759853
466,590,-22.761216662150616
467,196,24.34721530624161
468,474,-18.585952648104197
469,1000,17.980394467188727
470,889,-141.55340777658097
471,410,-257.8606395759961
472,83,-116.88051669869537
473,95,-35.46567437638592
474,506,-19.172988315557745
475,440,-314.8159711962226
476,191,-341.81229663427325
477,150,-303.6261537950716
478,154,-217.72567257710256
479,152,-181.55085464440816
480,263,-220.44649254866664
481,1000,-62.40791652015973
482,1000,-168.85648412699598
483,1000,-229.1741121683214
484,734,182.79554717698232
485,1000,8.944100834063507
486,123,-104.43226637348428
487,543,-308.31255911095275
488,765,-234.6011684405879
489,1000,-41.41733032745315
490,1000,-47.85460471180899
491,1000,-21.730882187359157
492,1000,-41.729317592285
493,159,-199.4625245249888
494,952,-208.5997538875423
495,1000,-59.08658892131405
496,1000,-64.45608131331471
497,620,-172.29062917069461
498,1000,-13.234100816250445
499,1000,-87.70177032040858
500,163,-130.43469932642788
501,1000,-53.1969715130013
502,1000,-71.00598481946622
503,201,-125.02622248585034
504,1000,-25.376532544617767
505,593,155.17451466257535
506,674,230.1229526689299
507,171,-118.45217330143345
508,802,-119.04036485422334
509,166,-25.066315862929656
510,610,-100.3217969468609
511,1000,-8.545526299380672
512,1000,-29.573361424546338
513,772,172.75418659306888
514,674,213.7160879404247
515,1000,81.67412474079677
516,706,173.77227077286335
517,777,156.35081268867802
518,462,217.8874218011568
519,461,233.9517156384917
520,95,-329.0708779370132
521,874,174.89537551627677
522,297,206.30470541789742
523,488,-793.2851759216811
524,158,-713.1375398028096
525,630,-316.17595910167273
526,1000,35.22092179679517
527,510,231.34599621861136
528,512,-16.604412339102012
529,341,198.43019192330556
530,1000,31.556052742630932
531,328,-203.20038384246806
532,1000,-210.11213545448487
533,1000,-168.87352964675384
534,817,112.83304190728022
535,107,-193.6389781134627
536,358,213.1519018886267
537,525,-560.1363149067861
538,313,-363.92963726828856
539,596,-92.66450014734828
540,1000,-50.3663066264265
541,922,80.9227885917092
542,1000,5.430672993187105
543,1000,-188.90760496464517
544,171,-326.4782301907505
545,525,-456.92609736173324
546,634,-355.1737353890219
547,185,-62.26321203763059
548,470,-350.5175551370735
549,175,-504.63956018608263
550,327,-188.91697959169858
551,186,-99.53090232566267
552,231,-137.7470751776623
553,334,272.15464458996064
554,558,220.1591572090582
555,990,163.0306600289353
556,454,-17.327371216405595
557,118,-130.44795624553396
558,174,-35.45866411406949
559,501,203.3216688451031
560,299,-48.676118879381775
561,552,151.4256938264049
562,397,-91.36717236222513
563,560,-57.628537059796905
564,263,-200.44668785779413
565,1000,-207.17137428387892
566,986,-262.40812936854456
567,1000,-48.647495728930096
568,752,162.6052798810329
569,722,188.27750732846246
570,109,-97.99728074213158
571,1000,-61.181797227898855
572,1000,-60.54412369574947
573,1000,-103.53059502683516
574,103,-559.7653550898681
575,223,-325.56260066584633
576,670,-282.1273509381523
577,858,193.69803306124717
578,486,226.29059399359554
579,758,228.71600099777748
580,465,226.47018369573755
581,592,204.7414048708415
582,597,232.3019035822097
583,403,9.620330595055862
584,144,-1433.0675545643549
585,160,-133.62168715328937
586,1000,-166.39487846710682
587,454,-130.72772217315384
588,184,-52.03281688773822
589,612,161.89538687465983
590,206,-304.69759498690894
591,127,-575.9372931235366
592,117,-194.3858465960111
593,259,242.30767563282632
594,719,160.10504830046352
595,731,-149.28853351004534
596,542,210.02666341552788
597,1000,113.80528317903749
598,1000,-30.419602561987503
599,411,188.40437216091894
600,1000,-20.935855915730098
601,729,185.00728756969062
602,615,-186.35332619517123
603,942,153.2714273016461
604,505,204.73120551274775
605,127,-361.45226112182377
606,772,171.56946940571626
607,322,-268.6349478919151
608,427,218.31913180274483
609,109,-222.42036594856967
610,978,166.20111518965314
611,431,255.5644950814729
612,580,246.41685630906133
613,378,225.96552207292018
614,85,-744.7446434643484
615,443,233.78567957654718
616,333,-226.41364051856988
617,499,198.64748540004442
618,556,184.3510073671813
619,198,-89.93072332308437
620,510,219.24138965168606
621,216,-168.5827450799585
622,327,-55.400038916878145
623,240,-90.85591670356249
624,407,-169.8837821949303
625,393,244.42704653101435
626,229,-72.46725150407568
627,1000,-39.816657142963166
628,385,252.27828048897413
629,500,263.6899982862334
630,275,242.29016977783294
631,715,229.76530476831115
632,348,-18.330114013129275
633,326,280.55832938340143
634,500,234.92073507518182
635,634,197.524333741852
636,367,243.24516114894223
637,1000,-39.02094239376024
638,335,249.0375484705665
639,150,-46.46853384369854
640,401,244.74084940271678
641,462,210.9683427133818
642,425,260.0081778246795
643,674,-118.34219848468396
644,384,249.81921239486505
645,755,145.81232141400878
646,418,273.0832392235849
647,747,-139.05145140706395
648,625,208.77101869769143
649,467,220.9049450499166
650,222,-100.80044708235678
651,993,126.27152736190583
652,524,215.55476121798694
653,395,279.8750595838642
654,556,243.21028215406034
655,561,224.1104397599545
656,650,172.20181828931067
657,531,241.99482910097888
658,449,289.1399813611537
659,438,233.63012377770596
660,541,224.59340768683694
661,531,235.36825870754268
662,377,226.95471400130978
663,489,209.89432666565935
664,389,282.29465362171663
665,247,244.79589639882528
666,295,228.85063312611524
667,441,253.93779025419062
668,274,269.47192715850025
669,284,41.668127604958386
670,364,209.80096788311042
671,662,240.30250916417282
672,346,246.5905944498419
673,414,266.98964707506207
674,392,277.37390046870337
675,371,248.71045216954224
676,308,295.94132896328676
677,190,-385.47976373611493
678,336,233.55737497571894
679,373,277.8873575342514
680,382,262.76755018038807
681,302,286.7318691810101
682,176,-264.3747859262231
683,275,299.6826249560414
684,439,227.37856271600108
685,327,256.02498677986273
686,249,290.51095452417974
687,227,44.49241409090865
688,186,24.591091263141806
689,360,254.40173221723208
690,318,236.48853737897605
691,745,222.08642558300195
692,297,257.68434478263777
693,304,282.32841277452235
694,328,267.3063461510376
695,378,232.2760832448852
696,485,274.5743033908008
697,343,298.79418550540197
698,324,251.13474103654283
699,332,242.70946201845433
700,596,230.7710469466128
701,443,253.42963075058066
702,382,287.8687386371739
703,457,231.0052670990187
704,637,148.9537369638757
705,571,238.64744752952473
706,395,272.6332877807676
707,93,-176.43473306076294
708,259,228.39164963908775
709,310,237.0236951870391
710,255,251.02242936653013
711,168,-79.94408069088433
712,381,265.1496856011385
713,145,-14.22156425643287
714,159,-170.79699185805651
715,91,-41.84568928260977
716,466,243.3484239938514
717,492,212.48505521500635
718,204,-18.70947659222037
719,106,-299.1482160543285
720,363,267.18872675793455
721,444,241.2666457946741
722,536,217.62652464321866
723,374,267.0204143996752
724,378,272.214719843606
725,525,210.20206632558205
726,99,-186.12142942172312
727,585,227.43849634410824
728,430,247.83396312496507
729,368,256.9019023256991
730,376,252.12998942989316
731,285,258.75098358625087
732,306,274.74625756081394
733,294,268.3033950225019
734,1000,32.88901927631754
735,297,242.54387410555788
736,302,30.738392816716924
737,609,157.81892127380377
738,406,244.8423665222822
739,497,239.0025122746917
740,593,239.81264506754272
741,430,252.82751597149195
742,1000,-57.261526276392715
743,325,266.8586789820547
744,404,227.63074139068289
745,609,168.94631106856843
746,514,281.9785942349926
747,682,181.84316555446998
748,102,-170.98063166717773
749,667,177.7356717363241
750,347,274.3858922469629
