episodes,steps,rewards
0,71,-326.5988721653089
1,66,-167.77999997596214
2,102,-255.3860453968542
3,116,-208.65674531519753
4,83,-138.20100562402095
5,84,-150.4465835665058
6,105,-285.4536093906967
7,80,-72.86701537136202
8,109,-252.5384160862451
9,71,-279.0689947708603
10,128,-373.4088038685853
11,91,-65.17167554607461
12,138,-341.32413189439336
13,416,-333.87868089653176
14,232,-525.1786429854856
15,370,-247.95057413543142
16,152,-190.53053610265607
17,162,-40.90831782248861
18,800,137.93323776458118
19,1000,-46.0304510084059
20,478,-239.1560465814053
21,1000,-26.505229636094608
22,1000,-46.229603165875155
23,1000,-38.07709249815675
24,1000,-68.65033388861353
25,952,-235.819739967815
26,1000,-69.07786650373882
27,1000,-68.04235176175916
28,1000,-97.38423519163638
29,1000,-3.8386790990519266
30,1000,-41.08599276607364
31,1000,-1.0905196926223415
32,1000,-12.040130154354491
33,1000,-60.748229750583874
34,1000,-49.66214771449484
35,1000,-10.65783310853401
36,593,187.91150575347422
37,802,145.23300454734132
38,841,-169.96048303017352
39,1000,3.7702799184487326
40,489,226.87171630106343
41,146,-139.4949539767697
42,550,-40.376427539271944
43,546,142.42318633974884
44,1000,-6.2679027237563
45,1000,13.618700606667034
46,746,136.96041011320796
47,723,198.8457845104586
48,1000,24.619205272957284
49,1000,-5.720008265700071
50,1000,28.15740233407194
51,697,209.74762914262433
52,622,-91.68591784792694
53,737,203.6541618210366
54,718,187.6325345395733
55,609,198.9721419244413
56,562,186.9401452871183
57,480,202.17792943433727
58,400,244.59002942776448
59,738,201.01587525161017
60,539,188.1411792538464
61,390,283.20055462996226
62,383,220.53048711915002
63,553,207.4739167957154
64,1000,69.56134481883564
65,510,245.75652209079666
66,481,197.21032670856948
67,410,236.58076436313604
68,435,210.2712194541049
69,142,10.204077626955751
70,533,207.56654613135197
71,750,198.07784339641034
72,717,179.87366641587568
73,1000,-24.96984698501116
74,492,212.71539171043105
75,1000,71.26716311946589
76,370,224.71105297201663
77,336,255.878927948968
78,774,153.60769929355476
79,552,238.16517114319257
80,312,223.4994586229518
81,357,-4.0981111609870595
82,374,255.65909616846275
83,417,250.0213036982397
84,510,228.23413043086123
85,485,227.15614552834072
86,460,268.85667650498846
87,273,291.45690781929864
88,1000,62.16022657377027
89,394,262.6953004988022
90,355,276.4728606632831
91,573,202.08415977744573
92,630,270.4878984271793
93,374,242.36283804417013
94,920,204.43329225251415
95,461,257.2170327267162
96,335,278.71505105411734
97,372,-33.659508025383616
98,521,221.42629809215515
99,723,274.107877963759
100,314,291.4527950157452
101,380,279.8523758492371
102,213,255.3281784000902
103,243,267.4042360297531
104,256,229.58931439121835
105,390,226.20129056497376
106,332,264.65725771367505
107,226,18.067383288295844
108,296,225.76012400561848
109,284,266.98617701104723
110,359,218.2710787037641
111,272,236.66923296236735
112,779,172.15726050305906
113,97,-61.681399947950766
114,106,54.05711536394364
115,325,263.8615651174007
116,123,-33.6893438564597
117,389,213.136671118279
118,491,233.11190983811014
119,392,225.5724491231108
120,420,214.83723957234972
121,199,19.662688992398074
122,406,213.44409854954114
123,316,58.70383284848549
124,317,257.4924860192872
125,350,239.83637203193226
126,286,229.49901909398648
127,533,248.1048806741889
128,287,239.7869840034518
129,676,266.51102975213564
130,409,300.8685033150971
131,163,38.03501658002287
132,411,-10.177260968257997
133,707,160.93493546562445
134,314,278.9500981376299
135,406,264.95669964654263
136,659,274.3326620671197
137,423,223.23634565426119
138,451,268.9349255349267
139,178,7.348425671735001
140,1000,-67.95148567435707
141,423,-94.70292415333043
142,795,158.54878598264276
143,391,20.173561860065874
144,238,239.48171424926613
145,1000,41.888290011807754
146,152,13.388012586824061
147,576,240.58522942139388
148,451,263.5950733173785
149,383,231.0033874270775
150,178,51.39319197021095
151,327,239.75708655744504
152,381,239.58056784696663
153,407,239.77713650887
154,340,235.7071358464287
155,711,230.3130557274061
156,485,182.7026624385387
157,725,200.18843584879124
158,291,248.7967339095834
159,394,241.5445729065606
160,261,273.4429204098019
161,398,223.3726451144075
162,239,270.73495719884806
163,354,233.56173209926143
164,540,242.7720125290051
165,535,222.80185123513252
166,249,277.9971522196669
167,400,289.6780530814338
168,245,40.25876114319689
169,345,277.43785746899357
170,258,285.76852718865297
171,287,284.02298506412376
172,445,207.9039139761139
173,273,248.65160679282386
174,394,223.9939927369997
175,423,233.58156358955142
176,293,234.66649500764152
177,144,57.88705582342979
178,598,272.7627028587682
179,389,252.43229803244205
180,260,291.82530464900776
181,344,289.70947657656
182,251,235.8394445456253
