episodes,steps,rewards
0,200,-200.0
1,200,-200.0
2,200,-200.0
3,200,-200.0
4,200,-200.0
5,200,-200.0
6,200,-200.0
7,200,-200.0
8,200,-200.0
9,200,-200.0
10,200,-200.0
11,200,-200.0
12,200,-200.0
13,200,-200.0
14,200,-200.0
15,200,-200.0
16,200,-200.0
17,200,-200.0
18,200,-200.0
19,200,-200.0
20,177,-177.0
21,200,-200.0
22,200,-200.0
23,200,-200.0
24,200,-200.0
25,200,-200.0
26,200,-200.0
27,200,-200.0
28,200,-200.0
29,200,-200.0
30,177,-177.0
31,200,-200.0
32,187,-187.0
33,200,-200.0
34,200,-200.0
35,200,-200.0
36,146,-146.0
37,200,-200.0
38,200,-200.0
39,176,-176.0
40,200,-200.0
41,200,-200.0
42,200,-200.0
43,200,-200.0
44,200,-200.0
45,200,-200.0
46,200,-200.0
47,107,-107.0
48,200,-200.0
49,200,-200.0
50,200,-200.0
51,200,-200.0
52,200,-200.0
53,200,-200.0
54,200,-200.0
55,200,-200.0
56,164,-164.0
57,106,-106.0
58,148,-148.0
59,133,-133.0
60,200,-200.0
61,154,-154.0
62,200,-200.0
63,164,-164.0
64,200,-200.0
65,152,-152.0
66,179,-179.0
67,104,-104.0
68,177,-177.0
69,134,-134.0
70,200,-200.0
71,200,-200.0
72,200,-200.0
73,167,-167.0
74,114,-114.0
75,200,-200.0
76,141,-141.0
77,191,-191.0
78,200,-200.0
79,137,-137.0
80,136,-136.0
81,142,-142.0
82,200,-200.0
83,109,-109.0
84,200,-200.0
85,159,-159.0
86,127,-127.0
87,145,-145.0
88,200,-200.0
89,200,-200.0
90,85,-85.0
91,200,-200.0
92,179,-179.0
93,151,-151.0
94,163,-163.0
95,109,-109.0
96,148,-148.0
97,110,-110.0
98,148,-148.0
99,125,-125.0
100,200,-200.0
101,200,-200.0
102,200,-200.0
103,166,-166.0
104,110,-110.0
105,150,-150.0
106,200,-200.0
107,200,-200.0
108,110,-110.0
109,173,-173.0
110,174,-174.0
111,197,-197.0
112,200,-200.0
113,161,-161.0
114,182,-182.0
115,200,-200.0
116,99,-99.0
117,200,-200.0
118,169,-169.0
119,200,-200.0
120,167,-167.0
121,170,-170.0
122,178,-178.0
123,200,-200.0
124,175,-175.0
125,159,-159.0
126,166,-166.0
127,200,-200.0
128,200,-200.0
129,104,-104.0
130,141,-141.0
131,171,-171.0
132,200,-200.0
133,162,-162.0
134,174,-174.0
135,200,-200.0
136,147,-147.0
137,141,-141.0
138,154,-154.0
139,184,-184.0
140,119,-119.0
141,165,-165.0
142,104,-104.0
143,106,-106.0
144,159,-159.0
145,122,-122.0
146,157,-157.0
147,161,-161.0
148,149,-149.0
149,167,-167.0
150,147,-147.0
151,88,-88.0
152,121,-121.0
153,89,-89.0
154,88,-88.0
155,150,-150.0
156,144,-144.0
157,171,-171.0
158,119,-119.0
159,118,-118.0
160,148,-148.0
161,111,-111.0
162,145,-145.0
163,84,-84.0
164,140,-140.0
165,90,-90.0
166,141,-141.0
167,116,-116.0
168,85,-85.0
169,146,-146.0
170,143,-143.0
171,147,-147.0
172,127,-127.0
173,150,-150.0
174,105,-105.0
175,116,-116.0
176,133,-133.0
177,155,-155.0
178,169,-169.0
179,148,-148.0
180,162,-162.0
181,92,-92.0
182,163,-163.0
183,157,-157.0
184,89,-89.0
185,144,-144.0
186,133,-133.0
187,156,-156.0
188,94,-94.0
189,87,-87.0
190,150,-150.0
191,155,-155.0
192,84,-84.0
193,142,-142.0
194,151,-151.0
195,98,-98.0
196,150,-150.0
197,151,-151.0
198,187,-187.0
199,100,-100.0
200,110,-110.0
201,144,-144.0
202,143,-143.0
203,91,-91.0
204,171,-171.0
205,148,-148.0
206,141,-141.0
207,108,-108.0
208,142,-142.0
209,133,-133.0
210,163,-163.0
211,142,-142.0
212,141,-141.0
213,153,-153.0
214,100,-100.0
215,143,-143.0
216,145,-145.0
217,93,-93.0
218,88,-88.0
219,149,-149.0
220,138,-138.0
221,150,-150.0
222,166,-166.0
223,108,-108.0
224,151,-151.0
225,106,-106.0
226,173,-173.0
227,155,-155.0
228,97,-97.0
229,138,-138.0
230,164,-164.0
231,136,-136.0
232,136,-136.0
233,132,-132.0
234,150,-150.0
235,150,-150.0
236,159,-159.0
237,135,-135.0
238,106,-106.0
239,109,-109.0
240,190,-190.0
241,145,-145.0
242,144,-144.0
243,146,-146.0
244,146,-146.0
245,138,-138.0
246,96,-96.0
247,84,-84.0
248,153,-153.0
249,146,-146.0
250,154,-154.0
