episodes,steps,rewards
0,122,-186.5811443675763
1,64,-77.06773355836287
2,97,-127.3466422398916
3,107,-276.5849564942323
4,112,-16.26725209094255
5,82,-114.70342106937629
6,64,-57.39864345272262
7,97,-357.2954487241749
8,129,-352.0683667448915
9,80,-139.92544286532842
10,114,-323.90521365353914
11,126,-286.1883694217886
12,101,-222.7235045742965
13,122,-419.5965460210132
14,150,-98.3932658475264
15,1000,2.092279652586323
16,564,-358.3378429574882
17,1000,-220.89669031169979
18,1000,-108.63125620353748
19,1000,-82.46670615703458
20,1000,-144.25572510585542
21,1000,-130.1164442911711
22,118,-133.35715671632983
23,173,-204.7354444741335
24,278,-111.85901439861227
25,119,-158.03344711898896
26,130,-71.38903338132246
27,170,-136.5006446093672
28,1000,-58.40433294577467
29,1000,-75.39021391295508
30,1000,-178.03594749673672
31,1000,-138.59573537088548
32,1000,-131.67913313307895
33,1000,-126.60769472434713
34,69,-91.14662978569332
35,410,-137.83563638255458
36,1000,-126.84266762635073
37,730,-307.5118718654418
38,628,-77.21658190987463
39,1000,-5.0330373253649086
40,316,-108.95832004077907
41,1000,-112.88451032208572
42,1000,-124.57501545313598
43,1000,-155.1855048865933
44,733,-327.41988324754163
45,134,-140.72493760235415
46,1000,-96.55418373489852
47,301,216.7012772413991
48,1000,-141.43556324154895
49,829,-247.01238601749756
50,1000,-73.72284767133793
