episodes,steps,rewards
0,70,-97.11815601086201
1,125,-51.588863551194265
2,91,-88.5399804759549
3,120,-137.69386747284528
4,79,-127.88231418710178
5,94,-203.87329657403518
6,78,-94.08453452675425
7,63,-111.82056837187194
8,78,-203.77308445190016
9,153,-302.06138205973434
10,62,-77.97472247513113
11,88,-57.75452878247529
12,113,-251.68208915984786
13,159,-169.40775585861945
14,174,-69.4983306407531
15,93,-397.6489085771954
16,111,-24.174491696645518
17,255,-175.4265905204212
18,195,-118.41944575465556
19,154,-103.68398505483736
20,273,-79.301483639522
21,152,-172.50521480199592
22,192,-101.33740287547045
23,134,-267.08112520846373
24,265,-123.3316222184958
25,103,-168.0166180162774
26,108,-123.96845310856088
27,1000,-161.96433711467813
28,420,-162.22840160505933
29,1000,-119.18539283755358
30,1000,-97.51495137943974
31,1000,-99.30924803437307
32,1000,-76.3159864967876
33,1000,-44.33006379865426
34,1000,-45.00590799438066
35,1000,-49.81065504899112
36,1000,-15.786722964824108
37,1000,-91.1630684139556
38,1000,-58.85658726742151
39,1000,-30.070717033081014
40,1000,-59.55513532891648
41,1000,-110.89398436517162
42,1000,-77.01226060635796
43,140,-73.2852033635156
44,1000,-112.5962740640218
45,1000,-98.03337586262892
46,1000,-23.602166518822187
47,243,7.815977676518514
48,193,-55.75963944454806
49,1000,-56.677943056595645
50,1000,-101.14507735647263
51,1000,-111.22652138415037
52,1000,-119.78918673700208
53,1000,-68.76110080212274
54,1000,-92.29886276770607
55,1000,-113.28177434477651
56,200,-207.53123537315398
57,1000,-54.05999221696778
58,1000,-68.1648487459708
59,1000,-63.288801637144964
60,1000,-20.629719014310346
61,1000,-43.559627512050746
62,1000,-62.885485110813725
63,500,-349.3051275814499
64,933,-210.6660056848666
65,1000,-76.93323355841174
66,228,-169.1131175757891
67,224,-94.92309414437517
68,1000,-107.79437865712738
69,1000,-32.154774383302914
70,1000,-98.33347297731225
71,1000,-86.30195551896945
72,1000,-84.22553832109944
73,1000,-64.03883236101109
74,1000,-79.73859237670978
75,1000,-19.106458133786308
76,437,-76.06931848702268
77,1000,-17.983169662229834
78,1000,-38.22263545891293
79,727,-187.86485024199507
80,1000,-73.36902603218624
81,1000,-67.09346843134009
82,1000,-24.496129234883085
83,1000,-82.8907871567117
84,1000,-54.38341637504385
85,182,-84.6644669014106
86,1000,-87.95074559484745
87,1000,-12.80882789153122
88,1000,-32.379178747951364
89,1000,-14.963298060472287
90,1000,-53.71844165480145
91,1000,-6.732962760090672
92,526,-128.28949850048366
93,1000,-16.019709309031366
94,1000,-35.858661820020124
95,1000,-48.53655197031131
96,1000,-69.08164725541018
97,1000,-51.017064019972885
98,1000,-40.101836960980734
99,189,-126.51936640416545
100,1000,-18.494998252467113
101,1000,-59.76347232696425
102,1000,-69.42006492774638
103,1000,-58.991279977135484
104,1000,-82.37516753322144
105,1000,-69.04294640349269
106,133,-41.83583558952925
107,1000,-43.20491745761528
108,1000,-4.6303745504883915
109,1000,-88.86446895079015
110,1000,-28.04539330167375
111,1000,-0.721795186913057
112,1000,-24.923803639877125
113,1000,-7.809633541448517
114,1000,4.285928544274182
115,1000,-87.20931795410262
116,1000,-30.695615421216832
117,1000,-63.9374035663865
118,1000,3.732880827321588
119,1000,-43.27554789168918
120,1000,-134.98667222585618
121,1000,-34.817497874116015
122,1000,-75.53481130746681
123,1000,-48.41629094080323
124,1000,-42.65913589917497
125,1000,-40.50374197629308
126,1000,-64.82172289655888
127,1000,-26.794109762782544
128,1000,-57.02061737811108
129,1000,-16.045810398998555
130,1000,-20.68206187051853
131,1000,-61.61032660009555
132,1000,-51.47693002733185
133,1000,-66.67956569925167
134,1000,-29.51438992373016
135,1000,-42.11740928033347
136,1000,-31.04323923848399
137,1000,-46.053239528986246
138,1000,-26.54990899530505
139,1000,-51.11947852498867
140,1000,-9.415607700264466
141,1000,-37.20583464162912
142,1000,-52.95332621028745
143,1000,5.985968564418485
144,1000,-18.31041915061572
145,1000,-42.92681235325677
146,1000,-26.868097874722217
147,1000,-35.122545785885286
148,1000,-16.69008944242831
149,1000,-6.629244149361029
150,1000,-34.2932283786417
151,1000,-24.24042019031122
152,1000,-62.458863377291394
153,1000,-29.187935426204053
154,1000,-10.113405379120607
155,1000,-6.00926188389891
156,1000,-56.11834604797073
157,1000,-39.63460341901939
158,1000,-24.350971475653967
159,1000,-57.357793066797335
160,1000,-29.840083488165597
161,1000,-45.24081648279545
162,1000,18.48558585843093
163,1000,-62.92261557367287
164,1000,-26.386040621610537
165,1000,3.352844649025987
166,1000,-59.035042931048984
167,1000,-49.44966179120049
168,1000,-32.01905016168469
169,1000,-24.182176809468977
170,1000,-2.497164587024044
171,641,-178.86277752596646
172,1000,-25.56533248322529
173,1000,-38.03073807786061
174,1000,-16.05288825981627
175,1000,-46.66144452370665
176,1000,5.524326328147745
177,1000,-27.6897399041091
178,1000,-12.258709278665947
179,1000,-58.162939681607426
180,1000,-56.2020435511204
181,1000,-20.012021646261793
182,1000,-3.2437279806664785
183,1000,-6.035339092060658
184,1000,13.59213660963686
185,1000,-21.55778545914307
186,1000,-64.30619886477615
187,1000,-72.96362350978048
188,1000,-21.08560388844688
189,1000,-181.9672750906429
190,1000,-10.926316704650077
191,1000,-43.850475429609915
192,1000,-36.04783275515414
193,1000,-0.9329698180162171
194,1000,-68.45494909197362
195,1000,-60.64946501449399
196,1000,-49.08123175976806
197,1000,-64.37771529901396
198,1000,-20.516760704977486
199,1000,-43.60649730802357
200,1000,15.27503815969686
201,1000,6.560479659443616
202,1000,3.580050291064219
203,1000,-54.78765436300467
204,1000,-54.41911978903019
205,1000,-21.47948067646208
206,1000,-52.59990303158208
207,1000,-5.162565937537695
208,890,-235.1592481036577
209,1000,-42.91536537005773
210,1000,-59.93430197425125
211,1000,-7.925704078825181
212,1000,-6.581554212774208
213,1000,-2.9443826201462255
214,1000,-43.586395728802835
215,1000,-20.29555390813626
216,1000,-56.21319473349014
217,1000,-4.049414786227867
218,1000,-38.29725439586419
219,1000,-35.21544543043659
220,1000,-18.574834817419575
221,1000,15.260962133873521
222,1000,2.44030410870125
223,1000,-14.91326170049334
224,1000,-8.944428871844492
225,1000,26.855525719418466
226,1000,-25.026087152169467
227,1000,-32.8194523176508
228,1000,9.330258774450138
229,1000,-18.995358769413162
230,1000,15.530531721309867
231,1000,-5.859782581813196
232,1000,-22.79351143055745
233,1000,-57.33725866417879
234,1000,-10.779642970338323
235,1000,-9.259776684444125
236,1000,-50.305799842104356
237,1000,-18.43268155229359
238,479,-24.555160186817332
239,1000,-6.225490298663944
240,1000,-7.318169669283542
241,1000,-11.373776654624178
242,1000,-52.063423353354274
243,1000,-16.40626048444561
244,1000,-20.525056214252807
245,1000,-51.535121095160704
246,1000,-44.441768039147156
247,1000,-11.441434899774274
248,1000,6.55799458504105
249,1000,-37.51692838227484
250,1000,-34.768722630180626
251,1000,-31.198860589570092
252,1000,-20.152595071606314
253,1000,-3.009215943680328
254,1000,-12.575336319169114
255,1000,-9.84224878132046
256,1000,-46.5580984858033
257,1000,3.901225365878811
258,1000,24.369837391506657
259,1000,-44.83501269082956
260,1000,14.6625889274293
261,1000,-21.71380483853712
262,1000,-38.1467277560352
263,1000,7.031473839239827
264,1000,28.993643412819825
265,1000,-18.072767060219693
266,1000,-31.14081371792665
267,1000,-1.1359992699177028
268,1000,-20.437334430786
269,1000,-24.135419370964254
270,1000,-62.50475930619458
271,143,-136.79453974282796
272,1000,2.8952813393921746
273,1000,-52.05825832101445
274,1000,14.231669339829352
275,1000,-3.497060333354704
276,1000,-28.97984830847407
277,1000,-6.9841798642364035
278,855,67.30506610446321
279,1000,-8.61124831124308
280,1000,-91.64601963473643
281,1000,13.66457861143897
282,1000,-20.21929060565315
283,1000,-13.779383707971254
284,1000,6.160517173503221
285,1000,-20.529037468385845
286,1000,-86.45352922315465
287,933,-158.08816271530316
288,238,-13.142652783955683
289,1000,-31.67919131304212
290,1000,18.817504940898868
291,1000,27.001270181222417
292,1000,-27.528585198317437
293,1000,-12.327465666100377
294,1000,-14.602841389577483
295,1000,22.915717077401467
296,1000,18.88061138166804
297,743,204.69848107288104
298,677,209.5967892591246
299,810,151.91925549209444
300,257,269.16040675794846
301,608,197.58548218514352
302,405,216.20782559290507
303,1000,-37.34951839611052
304,1000,-21.804799542873
305,1000,-25.49343799730669
306,1000,-31.249497188495706
307,261,245.38630079380738
308,206,257.5221527607995
309,544,202.17646636369483
310,1000,-13.774018604680043
311,283,316.34055577330656
312,308,-92.40017117922949
313,1000,-16.452391082269983
314,352,268.5283969350339
315,301,286.2614652709895
316,451,236.1716099528554
317,218,305.7842901372887
318,1000,-22.610156732427544
319,289,254.10041982165728
320,428,251.94400222226335
321,219,45.3031004486063
322,405,261.32817514021303
323,159,50.850203481943765
324,528,186.32677344037458
325,641,255.49927685919837
326,256,14.074095767192148
327,581,200.25504637596595
328,532,225.87032815239593
329,281,214.5724948906989
330,401,264.12276243975793
331,334,257.9627092363364
332,485,197.9758300524233
333,680,-127.3647234819876
334,317,232.10218521753123
335,267,285.30323328909674
336,1000,33.6383374498726
337,725,206.97114184618346
338,820,152.87967904967007
339,505,228.32390328971664
340,407,249.34121855806387
341,266,8.229350463493432
342,877,151.0398504655429
343,339,257.73021973512084
344,376,243.27117357818318
345,298,-6.293843649575194
346,268,245.05972200032485
347,274,294.95335567641087
348,706,197.95305742581135
349,259,-39.027996335104774
350,232,256.67588918200886
351,280,220.2874136920806
352,274,266.2978624567655
353,299,259.2839158170755
354,379,270.1333213697129
355,297,5.677642282785001
356,265,275.29942333242985
357,652,204.54900230147572
358,322,271.7435824472097
359,809,143.89153988557044
360,449,213.08372270968377
361,470,179.71184764965517
362,278,234.60571551670856
363,352,-47.14932229250438
364,245,238.62854664388877
365,1000,-38.41912387705719
366,231,262.4320504811103
367,276,290.76542656460947
368,274,174.7600397830935
369,290,196.41462506274502
370,575,230.771439680426
371,289,275.9720401207368
372,287,263.1964356015544
373,283,265.06830947295475
374,362,254.8045563547843
375,282,242.32727606365927
376,289,272.92250104800627
377,472,242.075626437437
378,454,217.40748485713814
379,375,220.97854071110964
380,334,-66.82113689475321
381,143,-3.3172606699559566
382,448,-24.256975035155975
383,272,258.5003633431468
384,238,237.59451814173053
385,256,204.75847906572344
386,224,247.60967857801313
387,239,252.7060344556498
388,271,241.3930536362547
389,374,232.19476842610453
390,296,37.45453521074052
391,245,266.96731479336427
392,192,16.86785688783533
393,248,-40.039620440571085
394,326,256.2379084624931
395,407,211.4389680642382
396,727,200.85748380137568
397,343,-280.2852057451912
398,346,-353.3682297011165
399,248,250.11705278072262
400,235,287.87953512297224
401,132,3.53478113149572
402,411,-40.366260652946124
403,709,175.5533794517482
404,202,292.802878172971
405,274,265.37588051208434
406,393,206.84806774131397
407,276,264.34515409164555
408,394,204.54020846489948
409,722,147.914075998901
410,235,279.9097883487367
411,317,264.06846259936776
412,192,275.27116103835397
413,217,243.60541769039938
414,598,167.22697374765494
415,394,228.44648253717418
416,427,258.87222593937986
417,235,269.593757997368
418,303,-11.9172652602212
419,242,282.21461339973746
420,368,213.8109505269567
421,256,283.8932976421736
422,285,281.74614028703513
423,285,239.6980640480373
424,398,178.74415879729037
425,404,289.4205439546599
426,339,259.3113704543525
427,383,261.8713694549035
428,321,273.9248445657948
429,511,156.8391537684972
430,400,159.7787259882383
431,321,247.54215033651852
432,314,287.4988530545862
433,391,266.19417932936165
434,1000,-108.88503730380164
435,322,265.69607785922454
436,408,262.46617808314113
437,516,233.93218390491867
438,574,264.81891352122665
439,515,-207.8432598930637
440,292,272.99264414124906
441,206,250.28232755746706
442,257,293.0388442826988
443,234,273.79517382793097
444,219,270.7620335528899
445,326,276.84119987825466
446,191,267.9779166446737
447,208,245.3651292259938
448,225,304.1881548987885
449,278,269.7947140556264
450,200,250.6258177677638
