episodes,steps,rewards
0,200,-200.0
1,200,-200.0
2,200,-200.0
3,200,-200.0
4,200,-200.0
5,200,-200.0
6,200,-200.0
7,200,-200.0
8,200,-200.0
9,200,-200.0
10,185,-185.0
11,200,-200.0
12,200,-200.0
13,200,-200.0
14,200,-200.0
15,200,-200.0
16,200,-200.0
17,200,-200.0
18,200,-200.0
19,190,-190.0
20,200,-200.0
21,200,-200.0
22,200,-200.0
23,200,-200.0
24,200,-200.0
25,162,-162.0
26,200,-200.0
27,200,-200.0
28,200,-200.0
29,200,-200.0
30,200,-200.0
31,200,-200.0
32,200,-200.0
33,200,-200.0
34,200,-200.0
35,200,-200.0
36,200,-200.0
37,200,-200.0
38,200,-200.0
39,200,-200.0
40,200,-200.0
41,200,-200.0
42,200,-200.0
43,200,-200.0
44,200,-200.0
45,200,-200.0
46,200,-200.0
47,200,-200.0
48,200,-200.0
49,200,-200.0
50,200,-200.0
51,200,-200.0
52,200,-200.0
53,200,-200.0
54,200,-200.0
55,200,-200.0
56,200,-200.0
57,158,-158.0
58,200,-200.0
59,196,-196.0
60,200,-200.0
61,200,-200.0
62,200,-200.0
63,200,-200.0
64,200,-200.0
65,196,-196.0
66,200,-200.0
67,115,-115.0
68,179,-179.0
69,146,-146.0
70,179,-179.0
71,200,-200.0
72,200,-200.0
73,200,-200.0
74,101,-101.0
75,163,-163.0
76,93,-93.0
77,171,-171.0
78,200,-200.0
79,166,-166.0
80,200,-200.0
81,86,-86.0
82,195,-195.0
83,199,-199.0
84,200,-200.0
85,177,-177.0
86,200,-200.0
87,102,-102.0
88,198,-198.0
89,183,-183.0
90,154,-154.0
91,200,-200.0
92,188,-188.0
93,84,-84.0
94,200,-200.0
95,200,-200.0
96,200,-200.0
97,160,-160.0
98,200,-200.0
99,119,-119.0
100,192,-192.0
101,197,-197.0
102,119,-119.0
103,190,-190.0
104,193,-193.0
105,158,-158.0
106,200,-200.0
107,192,-192.0
108,128,-128.0
109,159,-159.0
110,175,-175.0
111,169,-169.0
112,200,-200.0
113,200,-200.0
114,200,-200.0
115,200,-200.0
116,150,-150.0
117,200,-200.0
118,180,-180.0
119,200,-200.0
120,187,-187.0
121,178,-178.0
122,153,-153.0
123,186,-186.0
124,87,-87.0
125,152,-152.0
126,114,-114.0
127,120,-120.0
128,106,-106.0
129,162,-162.0
130,147,-147.0
131,124,-124.0
132,168,-168.0
133,91,-91.0
134,168,-168.0
135,92,-92.0
136,165,-165.0
137,93,-93.0
138,171,-171.0
139,112,-112.0
140,174,-174.0
141,128,-128.0
142,170,-170.0
143,167,-167.0
144,173,-173.0
145,165,-165.0
146,155,-155.0
147,106,-106.0
148,119,-119.0
149,108,-108.0
150,131,-131.0
151,174,-174.0
152,190,-190.0
153,127,-127.0
154,130,-130.0
155,113,-113.0
156,144,-144.0
157,120,-120.0
158,140,-140.0
159,157,-157.0
160,107,-107.0
161,178,-178.0
162,89,-89.0
163,106,-106.0
164,115,-115.0
165,151,-151.0
166,124,-124.0
167,154,-154.0
168,116,-116.0
169,156,-156.0
170,152,-152.0
171,114,-114.0
172,140,-140.0
173,116,-116.0
174,157,-157.0
175,166,-166.0
176,109,-109.0
177,147,-147.0
178,121,-121.0
179,152,-152.0
180,156,-156.0
181,148,-148.0
182,110,-110.0
183,149,-149.0
184,147,-147.0
185,88,-88.0
186,146,-146.0
187,149,-149.0
188,144,-144.0
189,83,-83.0
190,86,-86.0
191,90,-90.0
192,152,-152.0
193,161,-161.0
194,143,-143.0
195,151,-151.0
196,161,-161.0
197,155,-155.0
198,139,-139.0
199,148,-148.0
200,139,-139.0
201,176,-176.0
202,155,-155.0
203,148,-148.0
204,165,-165.0
205,137,-137.0
206,175,-175.0
207,147,-147.0
208,157,-157.0
209,154,-154.0
210,146,-146.0
211,153,-153.0
212,195,-195.0
213,158,-158.0
214,138,-138.0
215,98,-98.0
216,162,-162.0
217,148,-148.0
218,135,-135.0
219,148,-148.0
220,175,-175.0
221,154,-154.0
222,94,-94.0
223,132,-132.0
224,95,-95.0
225,102,-102.0
226,158,-158.0
227,161,-161.0
228,87,-87.0
229,141,-141.0
230,175,-175.0
231,175,-175.0
232,157,-157.0
233,99,-99.0
234,142,-142.0
235,166,-166.0
236,163,-163.0
237,87,-87.0
238,146,-146.0
239,158,-158.0
240,159,-159.0
241,98,-98.0
242,172,-172.0
243,151,-151.0
244,156,-156.0
245,150,-150.0
246,85,-85.0
247,182,-182.0
248,149,-149.0
249,182,-182.0
250,149,-149.0
251,155,-155.0
252,155,-155.0
253,200,-200.0
254,91,-91.0
255,151,-151.0
256,110,-110.0
257,167,-167.0
258,111,-111.0
259,87,-87.0
260,107,-107.0
261,92,-92.0
262,145,-145.0
263,106,-106.0
264,180,-180.0
265,168,-168.0
266,151,-151.0
267,87,-87.0
268,87,-87.0
269,141,-141.0
270,154,-154.0
271,104,-104.0
272,85,-85.0
273,137,-137.0
274,85,-85.0
275,156,-156.0
276,87,-87.0
277,108,-108.0
278,152,-152.0
279,164,-164.0
280,158,-158.0
281,87,-87.0
282,165,-165.0
283,151,-151.0
284,86,-86.0
285,138,-138.0
286,86,-86.0
287,95,-95.0
288,169,-169.0
289,155,-155.0
290,94,-94.0
291,93,-93.0
292,100,-100.0
293,161,-161.0
294,135,-135.0
295,156,-156.0
296,142,-142.0
297,89,-89.0
298,85,-85.0
299,127,-127.0
300,93,-93.0
301,85,-85.0
302,155,-155.0
303,158,-158.0
304,113,-113.0
305,91,-91.0
306,102,-102.0
307,87,-87.0
308,138,-138.0
309,86,-86.0
310,90,-90.0
311,125,-125.0
312,157,-157.0
313,142,-142.0
314,96,-96.0
315,158,-158.0
316,135,-135.0
317,144,-144.0
318,138,-138.0
319,150,-150.0
320,88,-88.0
321,87,-87.0
322,153,-153.0
323,131,-131.0
324,85,-85.0
325,144,-144.0
326,87,-87.0
327,115,-115.0
328,200,-200.0
329,169,-169.0
330,91,-91.0
331,145,-145.0
332,148,-148.0
333,146,-146.0
334,154,-154.0
335,90,-90.0
336,171,-171.0
337,133,-133.0
338,100,-100.0
339,142,-142.0
340,147,-147.0
341,154,-154.0
342,85,-85.0
343,104,-104.0
344,112,-112.0
345,153,-153.0
346,169,-169.0
347,148,-148.0
348,139,-139.0
349,200,-200.0
350,146,-146.0
351,142,-142.0
352,142,-142.0
353,200,-200.0
354,165,-165.0
355,147,-147.0
356,148,-148.0
357,139,-139.0
358,175,-175.0
359,173,-173.0
360,102,-102.0
361,155,-155.0
362,91,-91.0
363,168,-168.0
364,134,-134.0
365,165,-165.0
366,137,-137.0
367,159,-159.0
368,149,-149.0
369,168,-168.0
370,150,-150.0
371,181,-181.0
372,186,-186.0
373,131,-131.0
374,108,-108.0
375,136,-136.0
376,137,-137.0
377,106,-106.0
378,89,-89.0
379,132,-132.0
380,83,-83.0
381,137,-137.0
382,84,-84.0
383,174,-174.0
384,121,-121.0
385,145,-145.0
386,147,-147.0
387,86,-86.0
388,131,-131.0
389,175,-175.0
390,120,-120.0
391,131,-131.0
392,175,-175.0
393,155,-155.0
394,98,-98.0
395,156,-156.0
396,200,-200.0
397,146,-146.0
398,84,-84.0
399,146,-146.0
400,94,-94.0
401,142,-142.0
402,129,-129.0
403,84,-84.0
404,108,-108.0
405,96,-96.0
406,160,-160.0
407,112,-112.0
408,90,-90.0
409,167,-167.0
410,131,-131.0
411,108,-108.0
412,150,-150.0
413,107,-107.0
414,104,-104.0
415,107,-107.0
416,161,-161.0
417,108,-108.0
418,168,-168.0
419,92,-92.0
420,88,-88.0
421,92,-92.0
422,107,-107.0
423,158,-158.0
424,147,-147.0
425,189,-189.0
426,102,-102.0
427,91,-91.0
428,104,-104.0
429,152,-152.0
430,110,-110.0
431,104,-104.0
432,107,-107.0
433,106,-106.0
434,85,-85.0
435,104,-104.0
436,108,-108.0
437,138,-138.0
438,106,-106.0
439,105,-105.0
440,106,-106.0
441,86,-86.0
442,105,-105.0
443,89,-89.0
444,177,-177.0
445,105,-105.0
446,106,-106.0
447,85,-85.0
448,139,-139.0
449,93,-93.0
450,130,-130.0
451,96,-96.0
452,106,-106.0
453,119,-119.0
454,137,-137.0
455,134,-134.0
456,138,-138.0
457,105,-105.0
458,158,-158.0
459,124,-124.0
460,141,-141.0
461,86,-86.0
462,105,-105.0
463,106,-106.0
464,107,-107.0
465,150,-150.0
466,133,-133.0
467,153,-153.0
468,173,-173.0
469,169,-169.0
470,110,-110.0
471,135,-135.0
472,124,-124.0
473,112,-112.0
474,175,-175.0
475,108,-108.0
476,111,-111.0
477,104,-104.0
478,89,-89.0
479,111,-111.0
480,109,-109.0
481,88,-88.0
482,111,-111.0
483,93,-93.0
484,107,-107.0
485,149,-149.0
486,171,-171.0
487,141,-141.0
488,103,-103.0
489,136,-136.0
490,107,-107.0
491,138,-138.0
492,86,-86.0
493,85,-85.0
494,155,-155.0
495,87,-87.0
496,86,-86.0
497,160,-160.0
498,94,-94.0
499,146,-146.0
500,83,-83.0
501,143,-143.0
502,86,-86.0
503,145,-145.0
504,142,-142.0
505,86,-86.0
506,141,-141.0
507,134,-134.0
508,116,-116.0
509,109,-109.0
510,147,-147.0
511,110,-110.0
512,85,-85.0
513,160,-160.0
514,111,-111.0
515,107,-107.0
516,111,-111.0
517,114,-114.0
518,93,-93.0
519,166,-166.0
520,156,-156.0
521,146,-146.0
522,161,-161.0
523,110,-110.0
524,87,-87.0
525,155,-155.0
526,99,-99.0
527,84,-84.0
528,98,-98.0
529,138,-138.0
530,109,-109.0
531,150,-150.0
532,145,-145.0
533,101,-101.0
534,143,-143.0
535,95,-95.0
536,144,-144.0
537,84,-84.0
538,142,-142.0
539,145,-145.0
540,141,-141.0
541,84,-84.0
542,109,-109.0
543,101,-101.0
544,153,-153.0
545,136,-136.0
546,161,-161.0
547,149,-149.0
548,88,-88.0
549,110,-110.0
550,156,-156.0
551,147,-147.0
552,140,-140.0
553,85,-85.0
554,97,-97.0
555,139,-139.0
556,87,-87.0
557,105,-105.0
558,107,-107.0
559,92,-92.0
560,161,-161.0
561,89,-89.0
562,109,-109.0
563,90,-90.0
564,140,-140.0
565,137,-137.0
566,140,-140.0
567,85,-85.0
568,139,-139.0
569,102,-102.0
570,95,-95.0
571,106,-106.0
572,136,-136.0
573,136,-136.0
574,138,-138.0
575,140,-140.0
576,139,-139.0
577,160,-160.0
578,136,-136.0
579,135,-135.0
580,139,-139.0
581,138,-138.0
582,139,-139.0
583,141,-141.0
584,141,-141.0
585,137,-137.0
586,104,-104.0
587,139,-139.0
588,140,-140.0
589,139,-139.0
590,167,-167.0
591,138,-138.0
592,188,-188.0
593,189,-189.0
594,92,-92.0
595,138,-138.0
596,136,-136.0
597,92,-92.0
598,140,-140.0
599,91,-91.0
600,104,-104.0
601,92,-92.0
602,86,-86.0
603,87,-87.0
604,88,-88.0
605,135,-135.0
606,137,-137.0
607,92,-92.0
608,107,-107.0
609,132,-132.0
610,106,-106.0
611,88,-88.0
612,137,-137.0
613,97,-97.0
614,90,-90.0
615,137,-137.0
616,107,-107.0
617,103,-103.0
618,146,-146.0
619,83,-83.0
620,85,-85.0
621,137,-137.0
622,141,-141.0
623,87,-87.0
624,137,-137.0
625,93,-93.0
626,139,-139.0
627,94,-94.0
628,90,-90.0
629,83,-83.0
630,108,-108.0
631,139,-139.0
632,152,-152.0
633,147,-147.0
634,138,-138.0
635,87,-87.0
636,110,-110.0
637,86,-86.0
638,183,-183.0
639,141,-141.0
640,138,-138.0
641,88,-88.0
642,138,-138.0
643,135,-135.0
644,106,-106.0
645,200,-200.0
646,139,-139.0
647,114,-114.0
648,108,-108.0
649,105,-105.0
650,87,-87.0
651,140,-140.0
652,98,-98.0
653,164,-164.0
654,105,-105.0
655,176,-176.0
656,85,-85.0
657,134,-134.0
658,136,-136.0
659,86,-86.0
660,92,-92.0
661,125,-125.0
662,177,-177.0
663,94,-94.0
664,159,-159.0
665,110,-110.0
666,137,-137.0
667,138,-138.0
668,86,-86.0
669,104,-104.0
670,87,-87.0
671,107,-107.0
672,137,-137.0
673,112,-112.0
674,143,-143.0
675,88,-88.0
676,140,-140.0
677,180,-180.0
678,137,-137.0
679,125,-125.0
680,110,-110.0
681,84,-84.0
682,139,-139.0
683,138,-138.0
684,169,-169.0
685,140,-140.0
686,136,-136.0
687,138,-138.0
688,84,-84.0
689,84,-84.0
690,106,-106.0
691,168,-168.0
692,124,-124.0
693,137,-137.0
694,90,-90.0
695,133,-133.0
696,86,-86.0
697,134,-134.0
698,110,-110.0
699,99,-99.0
700,133,-133.0
701,137,-137.0
702,87,-87.0
703,138,-138.0
704,115,-115.0
705,109,-109.0
706,87,-87.0
707,107,-107.0
708,83,-83.0
709,138,-138.0
710,150,-150.0
711,140,-140.0
712,113,-113.0
713,137,-137.0
714,114,-114.0
715,99,-99.0
716,108,-108.0
717,93,-93.0
718,110,-110.0
719,109,-109.0
720,96,-96.0
721,110,-110.0
722,91,-91.0
723,86,-86.0
724,100,-100.0
725,168,-168.0
726,86,-86.0
727,168,-168.0
728,107,-107.0
729,114,-114.0
730,141,-141.0
731,173,-173.0
732,136,-136.0
733,114,-114.0
734,99,-99.0
735,141,-141.0
736,138,-138.0
737,86,-86.0
738,96,-96.0
739,135,-135.0
740,141,-141.0
741,141,-141.0
742,135,-135.0
743,147,-147.0
744,92,-92.0
745,145,-145.0
746,136,-136.0
747,142,-142.0
748,180,-180.0
749,122,-122.0
750,144,-144.0
751,130,-130.0
752,129,-129.0
753,136,-136.0
754,91,-91.0
755,146,-146.0
756,85,-85.0
757,140,-140.0
758,97,-97.0
759,134,-134.0
760,96,-96.0
761,187,-187.0
762,182,-182.0
763,139,-139.0
764,97,-97.0
765,97,-97.0
766,132,-132.0
767,142,-142.0
768,143,-143.0
769,139,-139.0
770,142,-142.0
771,83,-83.0
772,148,-148.0
773,90,-90.0
774,94,-94.0
775,88,-88.0
776,192,-192.0
777,135,-135.0
778,88,-88.0
779,87,-87.0
780,200,-200.0
781,143,-143.0
782,162,-162.0
783,145,-145.0
784,89,-89.0
785,88,-88.0
786,85,-85.0
787,166,-166.0
788,144,-144.0
789,155,-155.0
790,85,-85.0
791,91,-91.0
792,141,-141.0
793,87,-87.0
794,135,-135.0
795,144,-144.0
796,87,-87.0
797,139,-139.0
798,90,-90.0
799,147,-147.0
800,140,-140.0
801,151,-151.0
802,91,-91.0
803,138,-138.0
804,138,-138.0
805,97,-97.0
806,141,-141.0
807,148,-148.0
808,140,-140.0
809,113,-113.0
810,114,-114.0
811,89,-89.0
812,149,-149.0
813,84,-84.0
814,142,-142.0
815,95,-95.0
816,143,-143.0
817,139,-139.0
818,91,-91.0
819,159,-159.0
820,141,-141.0
821,139,-139.0
822,99,-99.0
823,87,-87.0
824,142,-142.0
825,138,-138.0
826,138,-138.0
827,85,-85.0
828,138,-138.0
829,138,-138.0
830,90,-90.0
831,152,-152.0
832,89,-89.0
833,115,-115.0
834,138,-138.0
835,136,-136.0
836,136,-136.0
837,137,-137.0
838,139,-139.0
839,85,-85.0
840,135,-135.0
841,132,-132.0
842,115,-115.0
843,115,-115.0
844,160,-160.0
845,141,-141.0
846,163,-163.0
847,110,-110.0
848,88,-88.0
849,91,-91.0
850,87,-87.0
851,97,-97.0
852,155,-155.0
853,136,-136.0
854,137,-137.0
855,144,-144.0
856,135,-135.0
857,89,-89.0
858,88,-88.0
859,142,-142.0
860,97,-97.0
861,160,-160.0
862,116,-116.0
863,139,-139.0
864,146,-146.0
865,155,-155.0
866,145,-145.0
867,83,-83.0
868,87,-87.0
869,145,-145.0
870,83,-83.0
871,147,-147.0
872,137,-137.0
873,148,-148.0
874,154,-154.0
875,88,-88.0
876,145,-145.0
877,146,-146.0
878,137,-137.0
879,98,-98.0
880,96,-96.0
881,146,-146.0
882,91,-91.0
883,139,-139.0
884,144,-144.0
885,89,-89.0
886,85,-85.0
887,99,-99.0
888,85,-85.0
889,144,-144.0
890,154,-154.0
891,107,-107.0
892,87,-87.0
893,89,-89.0
894,88,-88.0
895,142,-142.0
896,102,-102.0
897,86,-86.0
898,144,-144.0
899,148,-148.0
900,143,-143.0
901,141,-141.0
902,97,-97.0
903,143,-143.0
904,91,-91.0
905,91,-91.0
906,147,-147.0
907,154,-154.0
908,155,-155.0
909,152,-152.0
910,95,-95.0
911,95,-95.0
912,143,-143.0
913,144,-144.0
914,144,-144.0
915,145,-145.0
916,145,-145.0
917,93,-93.0
918,140,-140.0
919,148,-148.0
920,151,-151.0
921,92,-92.0
922,145,-145.0
923,147,-147.0
924,83,-83.0
925,138,-138.0
926,143,-143.0
927,144,-144.0
928,142,-142.0
929,146,-146.0
930,83,-83.0
931,140,-140.0
932,142,-142.0
933,142,-142.0
934,141,-141.0
935,159,-159.0
936,142,-142.0
937,105,-105.0
938,145,-145.0
939,109,-109.0
940,154,-154.0
941,146,-146.0
942,89,-89.0
943,145,-145.0
944,104,-104.0
945,159,-159.0
946,95,-95.0
947,145,-145.0
948,138,-138.0
949,141,-141.0
950,142,-142.0
951,83,-83.0
952,139,-139.0
953,140,-140.0
954,107,-107.0
955,88,-88.0
956,144,-144.0
957,95,-95.0
958,85,-85.0
959,154,-154.0
960,99,-99.0
961,145,-145.0
962,86,-86.0
963,158,-158.0
964,140,-140.0
965,143,-143.0
966,138,-138.0
967,170,-170.0
968,148,-148.0
969,170,-170.0
970,168,-168.0
971,98,-98.0
972,151,-151.0
973,142,-142.0
974,148,-148.0
975,83,-83.0
976,180,-180.0
977,151,-151.0
978,151,-151.0
979,148,-148.0
980,125,-125.0
981,92,-92.0
982,200,-200.0
983,93,-93.0
984,91,-91.0
985,172,-172.0
986,86,-86.0
987,88,-88.0
988,148,-148.0
989,90,-90.0
990,86,-86.0
991,167,-167.0
992,147,-147.0
993,142,-142.0
994,154,-154.0
995,151,-151.0
996,102,-102.0
997,154,-154.0
998,86,-86.0
999,96,-96.0
1000,86,-86.0
1001,154,-154.0
1002,94,-94.0
1003,200,-200.0
1004,147,-147.0
1005,98,-98.0
1006,97,-97.0
1007,90,-90.0
1008,148,-148.0
1009,150,-150.0
1010,147,-147.0
1011,87,-87.0
1012,147,-147.0
1013,94,-94.0
1014,151,-151.0
1015,141,-141.0
1016,142,-142.0
1017,83,-83.0
1018,143,-143.0
1019,146,-146.0
1020,108,-108.0
1021,138,-138.0
1022,88,-88.0
1023,144,-144.0
1024,149,-149.0
1025,150,-150.0
1026,87,-87.0
1027,142,-142.0
1028,89,-89.0
1029,87,-87.0
1030,150,-150.0
1031,142,-142.0
1032,144,-144.0
1033,84,-84.0
1034,89,-89.0
1035,150,-150.0
1036,84,-84.0
1037,86,-86.0
1038,85,-85.0
1039,85,-85.0
1040,144,-144.0
1041,157,-157.0
1042,153,-153.0
1043,149,-149.0
1044,90,-90.0
1045,144,-144.0
1046,148,-148.0
1047,141,-141.0
1048,143,-143.0
1049,141,-141.0
1050,150,-150.0
1051,156,-156.0
1052,139,-139.0
1053,143,-143.0
1054,191,-191.0
1055,142,-142.0
1056,138,-138.0
1057,86,-86.0
1058,140,-140.0
1059,140,-140.0
1060,140,-140.0
1061,89,-89.0
1062,138,-138.0
1063,91,-91.0
1064,165,-165.0
1065,144,-144.0
1066,137,-137.0
1067,87,-87.0
1068,87,-87.0
1069,200,-200.0
1070,150,-150.0
1071,146,-146.0
1072,140,-140.0
1073,149,-149.0
1074,91,-91.0
1075,89,-89.0
1076,141,-141.0
1077,83,-83.0
1078,148,-148.0
1079,146,-146.0
1080,151,-151.0
1081,89,-89.0
1082,84,-84.0
1083,147,-147.0
1084,83,-83.0
1085,87,-87.0
1086,85,-85.0
1087,146,-146.0
1088,85,-85.0
1089,150,-150.0
1090,153,-153.0
1091,200,-200.0
1092,141,-141.0
1093,143,-143.0
1094,139,-139.0
1095,85,-85.0
1096,89,-89.0
1097,86,-86.0
1098,150,-150.0
1099,169,-169.0
1100,147,-147.0
1101,140,-140.0
1102,92,-92.0
1103,149,-149.0
1104,150,-150.0
1105,142,-142.0
1106,146,-146.0
1107,88,-88.0
1108,176,-176.0
1109,141,-141.0
1110,90,-90.0
1111,142,-142.0
1112,161,-161.0
1113,145,-145.0
1114,149,-149.0
1115,141,-141.0
1116,146,-146.0
1117,146,-146.0
1118,153,-153.0
1119,90,-90.0
1120,200,-200.0
1121,143,-143.0
1122,145,-145.0
1123,180,-180.0
1124,84,-84.0
1125,141,-141.0
1126,86,-86.0
1127,138,-138.0
1128,142,-142.0
1129,138,-138.0
1130,140,-140.0
1131,135,-135.0
1132,92,-92.0
1133,139,-139.0
1134,140,-140.0
1135,92,-92.0
1136,144,-144.0
1137,89,-89.0
1138,92,-92.0
1139,145,-145.0
1140,97,-97.0
1141,149,-149.0
1142,145,-145.0
1143,142,-142.0
1144,88,-88.0
1145,200,-200.0
1146,147,-147.0
1147,148,-148.0
1148,91,-91.0
1149,84,-84.0
1150,200,-200.0
1151,143,-143.0
1152,92,-92.0
1153,143,-143.0
1154,141,-141.0
1155,143,-143.0
1156,85,-85.0
1157,141,-141.0
1158,147,-147.0
1159,140,-140.0
1160,84,-84.0
1161,141,-141.0
1162,200,-200.0
1163,200,-200.0
1164,160,-160.0
1165,168,-168.0
1166,100,-100.0
1167,154,-154.0
1168,200,-200.0
1169,141,-141.0
1170,94,-94.0
1171,200,-200.0
1172,200,-200.0
1173,142,-142.0
1174,145,-145.0
1175,142,-142.0
1176,97,-97.0
1177,147,-147.0
1178,137,-137.0
1179,139,-139.0
1180,139,-139.0
1181,137,-137.0
1182,136,-136.0
1183,90,-90.0
1184,144,-144.0
1185,137,-137.0
1186,134,-134.0
1187,140,-140.0
1188,86,-86.0
1189,154,-154.0
1190,141,-141.0
1191,200,-200.0
1192,147,-147.0
1193,140,-140.0
1194,135,-135.0
1195,143,-143.0
1196,136,-136.0
1197,139,-139.0
1198,166,-166.0
1199,90,-90.0
1200,200,-200.0
1201,143,-143.0
1202,139,-139.0
1203,140,-140.0
1204,89,-89.0
1205,146,-146.0
1206,178,-178.0
1207,200,-200.0
1208,100,-100.0
1209,152,-152.0
1210,163,-163.0
1211,147,-147.0
1212,155,-155.0
1213,93,-93.0
1214,139,-139.0
1215,136,-136.0
1216,140,-140.0
1217,134,-134.0
1218,105,-105.0
1219,151,-151.0
1220,90,-90.0
1221,157,-157.0
1222,134,-134.0
1223,92,-92.0
1224,142,-142.0
1225,96,-96.0
1226,106,-106.0
1227,136,-136.0
1228,146,-146.0
1229,149,-149.0
1230,162,-162.0
1231,138,-138.0
1232,187,-187.0
1233,138,-138.0
1234,153,-153.0
1235,87,-87.0
1236,144,-144.0
1237,88,-88.0
1238,95,-95.0
1239,92,-92.0
1240,149,-149.0
1241,91,-91.0
1242,155,-155.0
1243,144,-144.0
1244,103,-103.0
1245,146,-146.0
1246,111,-111.0
1247,149,-149.0
1248,167,-167.0
1249,149,-149.0
1250,146,-146.0
1251,103,-103.0
1252,151,-151.0
1253,92,-92.0
1254,152,-152.0
1255,160,-160.0
1256,108,-108.0
1257,133,-133.0
1258,141,-141.0
1259,85,-85.0
1260,143,-143.0
1261,94,-94.0
1262,166,-166.0
1263,165,-165.0
1264,143,-143.0
1265,89,-89.0
1266,138,-138.0
1267,99,-99.0
1268,87,-87.0
1269,165,-165.0
1270,144,-144.0
1271,92,-92.0
1272,150,-150.0
1273,90,-90.0
1274,85,-85.0
1275,134,-134.0
1276,88,-88.0
1277,118,-118.0
1278,92,-92.0
1279,143,-143.0
1280,140,-140.0
1281,148,-148.0
1282,145,-145.0
1283,148,-148.0
1284,130,-130.0
1285,145,-145.0
1286,178,-178.0
1287,94,-94.0
1288,96,-96.0
1289,93,-93.0
1290,150,-150.0
1291,97,-97.0
1292,156,-156.0
1293,157,-157.0
1294,152,-152.0
1295,103,-103.0
1296,171,-171.0
1297,143,-143.0
1298,196,-196.0
1299,167,-167.0
1300,142,-142.0
1301,146,-146.0
1302,88,-88.0
1303,142,-142.0
1304,92,-92.0
1305,145,-145.0
1306,97,-97.0
1307,170,-170.0
1308,146,-146.0
1309,99,-99.0
1310,165,-165.0
1311,92,-92.0
1312,139,-139.0
1313,200,-200.0
1314,163,-163.0
1315,142,-142.0
1316,110,-110.0
1317,139,-139.0
1318,141,-141.0
1319,147,-147.0
1320,146,-146.0
1321,144,-144.0
1322,150,-150.0
1323,141,-141.0
1324,143,-143.0
1325,90,-90.0
1326,97,-97.0
1327,165,-165.0
1328,146,-146.0
1329,89,-89.0
1330,90,-90.0
1331,145,-145.0
1332,149,-149.0
1333,200,-200.0
1334,200,-200.0
1335,96,-96.0
1336,151,-151.0
1337,135,-135.0
1338,137,-137.0
1339,152,-152.0
1340,132,-132.0
1341,151,-151.0
1342,145,-145.0
1343,91,-91.0
1344,144,-144.0
1345,163,-163.0
1346,143,-143.0
1347,170,-170.0
1348,102,-102.0
1349,143,-143.0
1350,200,-200.0
1351,136,-136.0
1352,115,-115.0
1353,145,-145.0
1354,163,-163.0
1355,140,-140.0
1356,109,-109.0
1357,89,-89.0
1358,162,-162.0
1359,158,-158.0
1360,93,-93.0
1361,159,-159.0
1362,90,-90.0
1363,140,-140.0
1364,95,-95.0
1365,153,-153.0
1366,131,-131.0
1367,97,-97.0
1368,158,-158.0
1369,88,-88.0
1370,97,-97.0
1371,118,-118.0
1372,146,-146.0
1373,88,-88.0
1374,145,-145.0
1375,95,-95.0
1376,147,-147.0
1377,146,-146.0
1378,141,-141.0
1379,141,-141.0
1380,144,-144.0
1381,146,-146.0
1382,151,-151.0
1383,143,-143.0
1384,86,-86.0
1385,140,-140.0
1386,138,-138.0
1387,139,-139.0
1388,152,-152.0
1389,96,-96.0
1390,139,-139.0
1391,146,-146.0
1392,91,-91.0
1393,94,-94.0
1394,168,-168.0
1395,98,-98.0
1396,133,-133.0
1397,151,-151.0
1398,171,-171.0
1399,87,-87.0
1400,143,-143.0
1401,145,-145.0
1402,140,-140.0
1403,133,-133.0
1404,135,-135.0
1405,142,-142.0
1406,176,-176.0
1407,150,-150.0
1408,95,-95.0
1409,143,-143.0
1410,158,-158.0
1411,84,-84.0
1412,127,-127.0
1413,88,-88.0
1414,87,-87.0
1415,88,-88.0
1416,143,-143.0
1417,145,-145.0
1418,102,-102.0
1419,157,-157.0
1420,88,-88.0
1421,86,-86.0
1422,146,-146.0
1423,144,-144.0
1424,137,-137.0
1425,142,-142.0
1426,89,-89.0
1427,89,-89.0
1428,169,-169.0
1429,138,-138.0
1430,192,-192.0
1431,140,-140.0
1432,129,-129.0
1433,138,-138.0
1434,86,-86.0
1435,152,-152.0
1436,140,-140.0
1437,90,-90.0
1438,104,-104.0
1439,138,-138.0
1440,143,-143.0
1441,144,-144.0
1442,146,-146.0
1443,142,-142.0
1444,139,-139.0
1445,87,-87.0
1446,157,-157.0
1447,145,-145.0
1448,88,-88.0
1449,149,-149.0
1450,141,-141.0
1451,131,-131.0
1452,145,-145.0
1453,139,-139.0
1454,91,-91.0
1455,133,-133.0
1456,147,-147.0
1457,86,-86.0
1458,145,-145.0
1459,99,-99.0
1460,125,-125.0
1461,145,-145.0
1462,99,-99.0
1463,136,-136.0
1464,89,-89.0
1465,86,-86.0
1466,139,-139.0
1467,139,-139.0
1468,93,-93.0
1469,139,-139.0
1470,93,-93.0
1471,146,-146.0
1472,154,-154.0
1473,89,-89.0
1474,185,-185.0
1475,86,-86.0
1476,145,-145.0
1477,143,-143.0
1478,102,-102.0
1479,86,-86.0
1480,90,-90.0
1481,147,-147.0
1482,135,-135.0
1483,85,-85.0
1484,154,-154.0
1485,145,-145.0
1486,140,-140.0
1487,143,-143.0
1488,104,-104.0
1489,133,-133.0
1490,138,-138.0
1491,139,-139.0
1492,152,-152.0
1493,99,-99.0
1494,143,-143.0
1495,90,-90.0
1496,142,-142.0
1497,146,-146.0
1498,152,-152.0
1499,193,-193.0
1500,140,-140.0
1501,146,-146.0
1502,187,-187.0
1503,143,-143.0
1504,87,-87.0
1505,142,-142.0
1506,95,-95.0
1507,142,-142.0
1508,148,-148.0
1509,131,-131.0
1510,92,-92.0
1511,119,-119.0
1512,147,-147.0
1513,94,-94.0
1514,142,-142.0
1515,93,-93.0
1516,97,-97.0
1517,147,-147.0
1518,145,-145.0
1519,95,-95.0
1520,89,-89.0
1521,91,-91.0
1522,148,-148.0
1523,151,-151.0
1524,101,-101.0
1525,91,-91.0
1526,143,-143.0
1527,181,-181.0
1528,137,-137.0
1529,86,-86.0
1530,87,-87.0
1531,93,-93.0
1532,127,-127.0
1533,111,-111.0
1534,141,-141.0
1535,147,-147.0
1536,187,-187.0
1537,125,-125.0
1538,96,-96.0
1539,135,-135.0
1540,142,-142.0
1541,92,-92.0
1542,132,-132.0
1543,142,-142.0
1544,123,-123.0
1545,91,-91.0
1546,90,-90.0
1547,144,-144.0
1548,143,-143.0
1549,102,-102.0
1550,177,-177.0
1551,148,-148.0
1552,93,-93.0
1553,88,-88.0
1554,139,-139.0
1555,87,-87.0
1556,132,-132.0
1557,143,-143.0
1558,139,-139.0
1559,110,-110.0
1560,134,-134.0
1561,138,-138.0
1562,169,-169.0
1563,87,-87.0
1564,167,-167.0
1565,134,-134.0
1566,129,-129.0
1567,162,-162.0
1568,126,-126.0
1569,109,-109.0
1570,110,-110.0
1571,148,-148.0
1572,96,-96.0
1573,98,-98.0
1574,106,-106.0
1575,139,-139.0
1576,144,-144.0
1577,143,-143.0
1578,91,-91.0
1579,96,-96.0
1580,185,-185.0
1581,144,-144.0
1582,142,-142.0
1583,87,-87.0
1584,110,-110.0
1585,145,-145.0
1586,90,-90.0
1587,109,-109.0
1588,186,-186.0
1589,141,-141.0
1590,88,-88.0
1591,140,-140.0
1592,138,-138.0
1593,144,-144.0
1594,138,-138.0
1595,145,-145.0
1596,132,-132.0
1597,136,-136.0
1598,133,-133.0
1599,135,-135.0
1600,84,-84.0
1601,144,-144.0
1602,144,-144.0
1603,166,-166.0
1604,138,-138.0
1605,89,-89.0
1606,153,-153.0
1607,144,-144.0
1608,87,-87.0
1609,87,-87.0
1610,84,-84.0
1611,97,-97.0
1612,101,-101.0
1613,146,-146.0
1614,176,-176.0
1615,150,-150.0
1616,162,-162.0
1617,154,-154.0
1618,162,-162.0
1619,159,-159.0
1620,185,-185.0
1621,155,-155.0
1622,171,-171.0
1623,161,-161.0
1624,109,-109.0
1625,164,-164.0
1626,148,-148.0
1627,182,-182.0
1628,146,-146.0
1629,93,-93.0
1630,147,-147.0
1631,145,-145.0
1632,178,-178.0
1633,152,-152.0
1634,86,-86.0
1635,134,-134.0
1636,137,-137.0
1637,152,-152.0
1638,197,-197.0
1639,151,-151.0
1640,91,-91.0
1641,138,-138.0
1642,159,-159.0
1643,106,-106.0
1644,143,-143.0
1645,143,-143.0
1646,136,-136.0
1647,142,-142.0
1648,137,-137.0
1649,86,-86.0
1650,137,-137.0
1651,135,-135.0
1652,111,-111.0
1653,149,-149.0
1654,200,-200.0
1655,144,-144.0
1656,140,-140.0
1657,136,-136.0
1658,156,-156.0
1659,137,-137.0
1660,152,-152.0
1661,137,-137.0
1662,164,-164.0
1663,142,-142.0
1664,147,-147.0
1665,200,-200.0
1666,150,-150.0
1667,149,-149.0
1668,112,-112.0
1669,102,-102.0
1670,172,-172.0
1671,140,-140.0
1672,108,-108.0
1673,113,-113.0
1674,140,-140.0
1675,143,-143.0
1676,145,-145.0
1677,142,-142.0
1678,150,-150.0
1679,143,-143.0
1680,135,-135.0
1681,138,-138.0
1682,148,-148.0
1683,140,-140.0
1684,136,-136.0
1685,141,-141.0
1686,140,-140.0
1687,161,-161.0
1688,139,-139.0
1689,133,-133.0
1690,141,-141.0
1691,115,-115.0
1692,133,-133.0
1693,133,-133.0
1694,135,-135.0
1695,139,-139.0
1696,135,-135.0
1697,138,-138.0
1698,169,-169.0
1699,143,-143.0
1700,136,-136.0
1701,152,-152.0
1702,115,-115.0
1703,150,-150.0
1704,136,-136.0
1705,145,-145.0
1706,137,-137.0
1707,141,-141.0
1708,137,-137.0
1709,157,-157.0
1710,142,-142.0
1711,200,-200.0
1712,97,-97.0
1713,111,-111.0
1714,166,-166.0
1715,158,-158.0
1716,114,-114.0
1717,110,-110.0
1718,110,-110.0
1719,107,-107.0
1720,120,-120.0
1721,177,-177.0
1722,109,-109.0
1723,154,-154.0
1724,105,-105.0
1725,98,-98.0
1726,152,-152.0
1727,163,-163.0
1728,115,-115.0
1729,164,-164.0
1730,150,-150.0
1731,169,-169.0
1732,147,-147.0
1733,89,-89.0
1734,83,-83.0
1735,110,-110.0
1736,200,-200.0
1737,154,-154.0
1738,200,-200.0
1739,85,-85.0
1740,155,-155.0
1741,162,-162.0
1742,164,-164.0
1743,93,-93.0
1744,151,-151.0
1745,147,-147.0
1746,147,-147.0
1747,146,-146.0
1748,158,-158.0
1749,90,-90.0
1750,90,-90.0
1751,168,-168.0
1752,94,-94.0
1753,99,-99.0
1754,163,-163.0
1755,169,-169.0
1756,145,-145.0
1757,98,-98.0
1758,146,-146.0
1759,146,-146.0
1760,140,-140.0
1761,159,-159.0
1762,200,-200.0
1763,162,-162.0
1764,168,-168.0
1765,147,-147.0
1766,188,-188.0
1767,107,-107.0
1768,98,-98.0
1769,95,-95.0
1770,163,-163.0
1771,156,-156.0
1772,91,-91.0
1773,182,-182.0
1774,156,-156.0
1775,149,-149.0
1776,200,-200.0
1777,157,-157.0
1778,97,-97.0
1779,200,-200.0
1780,173,-173.0
1781,173,-173.0
1782,87,-87.0
1783,156,-156.0
1784,179,-179.0
1785,153,-153.0
1786,113,-113.0
1787,103,-103.0
1788,108,-108.0
1789,151,-151.0
1790,170,-170.0
1791,113,-113.0
1792,168,-168.0
1793,149,-149.0
1794,160,-160.0
1795,150,-150.0
1796,166,-166.0
1797,93,-93.0
1798,189,-189.0
1799,148,-148.0
1800,166,-166.0
1801,90,-90.0
1802,162,-162.0
1803,168,-168.0
1804,151,-151.0
1805,177,-177.0
1806,163,-163.0
1807,154,-154.0
1808,96,-96.0
1809,92,-92.0
1810,200,-200.0
1811,182,-182.0
1812,145,-145.0
1813,168,-168.0
1814,200,-200.0
1815,163,-163.0
1816,107,-107.0
1817,156,-156.0
1818,162,-162.0
1819,156,-156.0
1820,150,-150.0
1821,142,-142.0
1822,148,-148.0
1823,152,-152.0
1824,153,-153.0
1825,191,-191.0
1826,142,-142.0
1827,151,-151.0
1828,149,-149.0
1829,145,-145.0
1830,142,-142.0
1831,139,-139.0
1832,200,-200.0
1833,143,-143.0
1834,157,-157.0
1835,163,-163.0
1836,144,-144.0
1837,200,-200.0
1838,138,-138.0
1839,148,-148.0
1840,166,-166.0
1841,200,-200.0
1842,153,-153.0
1843,200,-200.0
1844,157,-157.0
1845,168,-168.0
1846,96,-96.0
1847,150,-150.0
1848,164,-164.0
1849,200,-200.0
1850,151,-151.0
1851,175,-175.0
1852,200,-200.0
1853,152,-152.0
1854,169,-169.0
1855,112,-112.0
1856,151,-151.0
1857,137,-137.0
1858,90,-90.0
1859,184,-184.0
1860,200,-200.0
1861,163,-163.0
1862,118,-118.0
1863,141,-141.0
1864,151,-151.0
1865,158,-158.0
1866,166,-166.0
1867,140,-140.0
1868,156,-156.0
1869,200,-200.0
1870,149,-149.0
1871,151,-151.0
1872,145,-145.0
1873,166,-166.0
1874,142,-142.0
1875,106,-106.0
1876,144,-144.0
1877,166,-166.0
1878,166,-166.0
1879,154,-154.0
1880,146,-146.0
1881,139,-139.0
1882,149,-149.0
1883,100,-100.0
1884,180,-180.0
1885,145,-145.0
1886,200,-200.0
1887,142,-142.0
1888,200,-200.0
1889,143,-143.0
1890,99,-99.0
1891,148,-148.0
1892,154,-154.0
1893,150,-150.0
1894,147,-147.0
1895,200,-200.0
1896,148,-148.0
1897,153,-153.0
1898,157,-157.0
1899,166,-166.0
1900,149,-149.0
1901,142,-142.0
1902,142,-142.0
1903,149,-149.0
1904,140,-140.0
1905,147,-147.0
1906,147,-147.0
1907,87,-87.0
1908,163,-163.0
1909,93,-93.0
1910,187,-187.0
1911,96,-96.0
1912,153,-153.0
1913,92,-92.0
1914,147,-147.0
1915,153,-153.0
1916,176,-176.0
1917,164,-164.0
1918,142,-142.0
1919,158,-158.0
1920,200,-200.0
1921,151,-151.0
1922,140,-140.0
1923,145,-145.0
1924,162,-162.0
1925,151,-151.0
1926,90,-90.0
1927,150,-150.0
1928,159,-159.0
1929,85,-85.0
1930,158,-158.0
1931,146,-146.0
1932,152,-152.0
1933,88,-88.0
1934,93,-93.0
1935,144,-144.0
1936,88,-88.0
1937,152,-152.0
1938,148,-148.0
1939,165,-165.0
1940,137,-137.0
1941,200,-200.0
1942,145,-145.0
1943,163,-163.0
1944,100,-100.0
1945,167,-167.0
1946,100,-100.0
1947,200,-200.0
1948,99,-99.0
1949,143,-143.0
1950,86,-86.0
1951,148,-148.0
1952,193,-193.0
1953,152,-152.0
1954,89,-89.0
1955,182,-182.0
1956,147,-147.0
1957,97,-97.0
1958,90,-90.0
1959,148,-148.0
1960,137,-137.0
1961,137,-137.0
1962,144,-144.0
1963,158,-158.0
1964,143,-143.0
1965,153,-153.0
1966,148,-148.0
1967,141,-141.0
1968,155,-155.0
1969,150,-150.0
1970,90,-90.0
1971,147,-147.0
1972,151,-151.0
1973,146,-146.0
1974,157,-157.0
1975,158,-158.0
1976,148,-148.0
1977,149,-149.0
1978,102,-102.0
1979,158,-158.0
1980,200,-200.0
1981,150,-150.0
1982,161,-161.0
1983,146,-146.0
1984,91,-91.0
1985,155,-155.0
1986,150,-150.0
1987,153,-153.0
1988,84,-84.0
1989,155,-155.0
1990,151,-151.0
1991,91,-91.0
1992,171,-171.0
1993,150,-150.0
1994,175,-175.0
1995,143,-143.0
1996,145,-145.0
1997,154,-154.0
1998,144,-144.0
1999,142,-142.0
2000,200,-200.0
2001,146,-146.0
2002,86,-86.0
2003,101,-101.0
2004,153,-153.0
2005,163,-163.0
2006,200,-200.0
2007,84,-84.0
2008,183,-183.0
2009,107,-107.0
2010,155,-155.0
2011,104,-104.0
2012,160,-160.0
2013,99,-99.0
2014,86,-86.0
2015,88,-88.0
2016,175,-175.0
2017,200,-200.0
2018,182,-182.0
2019,149,-149.0
2020,172,-172.0
2021,83,-83.0
2022,85,-85.0
2023,200,-200.0
2024,135,-135.0
2025,146,-146.0
2026,85,-85.0
2027,200,-200.0
2028,91,-91.0
2029,151,-151.0
2030,161,-161.0
2031,156,-156.0
2032,200,-200.0
2033,200,-200.0
2034,157,-157.0
2035,153,-153.0
2036,160,-160.0
2037,92,-92.0
2038,162,-162.0
2039,166,-166.0
2040,200,-200.0
2041,96,-96.0
2042,200,-200.0
2043,144,-144.0
2044,171,-171.0
2045,90,-90.0
2046,200,-200.0
2047,168,-168.0
2048,98,-98.0
2049,120,-120.0
2050,200,-200.0
2051,139,-139.0
2052,89,-89.0
2053,139,-139.0
2054,149,-149.0
2055,151,-151.0
2056,86,-86.0
2057,84,-84.0
2058,180,-180.0
2059,151,-151.0
2060,200,-200.0
2061,169,-169.0
2062,98,-98.0
2063,182,-182.0
2064,169,-169.0
2065,185,-185.0
2066,155,-155.0
2067,99,-99.0
2068,190,-190.0
2069,142,-142.0
2070,170,-170.0
2071,86,-86.0
2072,200,-200.0
2073,153,-153.0
2074,93,-93.0
2075,115,-115.0
2076,111,-111.0
2077,143,-143.0
2078,94,-94.0
2079,174,-174.0
2080,200,-200.0
2081,158,-158.0
2082,148,-148.0
2083,150,-150.0
2084,85,-85.0
2085,145,-145.0
2086,156,-156.0
2087,170,-170.0
2088,165,-165.0
2089,100,-100.0
2090,141,-141.0
2091,98,-98.0
2092,200,-200.0
2093,144,-144.0
2094,200,-200.0
2095,162,-162.0
2096,150,-150.0
2097,106,-106.0
2098,136,-136.0
2099,167,-167.0
2100,200,-200.0
2101,188,-188.0
2102,160,-160.0
2103,87,-87.0
2104,144,-144.0
2105,89,-89.0
2106,133,-133.0
2107,152,-152.0
2108,136,-136.0
2109,154,-154.0
2110,196,-196.0
2111,177,-177.0
2112,149,-149.0
2113,176,-176.0
2114,91,-91.0
2115,158,-158.0
2116,150,-150.0
2117,149,-149.0
2118,162,-162.0
2119,87,-87.0
2120,164,-164.0
2121,156,-156.0
2122,175,-175.0
2123,200,-200.0
2124,200,-200.0
2125,164,-164.0
2126,164,-164.0
2127,158,-158.0
2128,109,-109.0
2129,155,-155.0
2130,96,-96.0
2131,104,-104.0
2132,161,-161.0
2133,159,-159.0
2134,169,-169.0
2135,164,-164.0
2136,110,-110.0
2137,101,-101.0
2138,200,-200.0
2139,159,-159.0
2140,158,-158.0
2141,94,-94.0
2142,156,-156.0
2143,168,-168.0
2144,102,-102.0
2145,158,-158.0
2146,153,-153.0
2147,97,-97.0
2148,153,-153.0
2149,148,-148.0
2150,143,-143.0
2151,161,-161.0
2152,140,-140.0
2153,152,-152.0
2154,149,-149.0
2155,164,-164.0
2156,153,-153.0
2157,148,-148.0
2158,110,-110.0
2159,118,-118.0
2160,176,-176.0
2161,151,-151.0
2162,147,-147.0
2163,150,-150.0
2164,158,-158.0
2165,146,-146.0
2166,148,-148.0
2167,146,-146.0
2168,140,-140.0
2169,149,-149.0
2170,152,-152.0
2171,152,-152.0
2172,192,-192.0
2173,180,-180.0
2174,107,-107.0
2175,154,-154.0
2176,164,-164.0
2177,145,-145.0
2178,156,-156.0
2179,151,-151.0
2180,173,-173.0
2181,170,-170.0
2182,121,-121.0
2183,153,-153.0
2184,156,-156.0
2185,200,-200.0
2186,149,-149.0
2187,166,-166.0
2188,148,-148.0
2189,200,-200.0
2190,157,-157.0
2191,200,-200.0
2192,200,-200.0
2193,158,-158.0
2194,148,-148.0
2195,189,-189.0
2196,200,-200.0
2197,147,-147.0
2198,144,-144.0
2199,142,-142.0
2200,200,-200.0
2201,144,-144.0
2202,147,-147.0
2203,200,-200.0
2204,200,-200.0
2205,148,-148.0
2206,200,-200.0
2207,163,-163.0
2208,200,-200.0
2209,141,-141.0
2210,200,-200.0
2211,156,-156.0
2212,162,-162.0
2213,155,-155.0
2214,184,-184.0
2215,153,-153.0
2216,164,-164.0
2217,200,-200.0
2218,150,-150.0
2219,151,-151.0
2220,154,-154.0
2221,140,-140.0
2222,154,-154.0
2223,160,-160.0
2224,164,-164.0
2225,155,-155.0
2226,153,-153.0
2227,200,-200.0
2228,157,-157.0
2229,171,-171.0
2230,169,-169.0
2231,189,-189.0
2232,186,-186.0
2233,150,-150.0
2234,146,-146.0
2235,154,-154.0
2236,135,-135.0
2237,137,-137.0
2238,147,-147.0
2239,143,-143.0
2240,125,-125.0
2241,177,-177.0
2242,158,-158.0
2243,167,-167.0
2244,171,-171.0
2245,153,-153.0
2246,174,-174.0
2247,143,-143.0
2248,159,-159.0
2249,154,-154.0
2250,149,-149.0
2251,116,-116.0
2252,145,-145.0
2253,182,-182.0
2254,113,-113.0
2255,150,-150.0
2256,142,-142.0
2257,118,-118.0
2258,136,-136.0
2259,157,-157.0
2260,143,-143.0
2261,128,-128.0
2262,169,-169.0
2263,119,-119.0
2264,154,-154.0
2265,150,-150.0
2266,154,-154.0
2267,162,-162.0
2268,153,-153.0
2269,178,-178.0
2270,162,-162.0
2271,152,-152.0
2272,131,-131.0
2273,162,-162.0
2274,193,-193.0
2275,155,-155.0
2276,182,-182.0
2277,116,-116.0
2278,127,-127.0
2279,162,-162.0
2280,141,-141.0
2281,161,-161.0
2282,123,-123.0
2283,104,-104.0
2284,154,-154.0
2285,191,-191.0
2286,146,-146.0
2287,200,-200.0
2288,152,-152.0
2289,168,-168.0
2290,169,-169.0
2291,91,-91.0
2292,151,-151.0
2293,172,-172.0
2294,169,-169.0
2295,172,-172.0
2296,173,-173.0
2297,172,-172.0
2298,144,-144.0
2299,91,-91.0
2300,147,-147.0
2301,180,-180.0
2302,119,-119.0
2303,121,-121.0
2304,144,-144.0
2305,150,-150.0
2306,162,-162.0
2307,85,-85.0
2308,140,-140.0
2309,165,-165.0
2310,90,-90.0
2311,161,-161.0
2312,104,-104.0
2313,153,-153.0
2314,153,-153.0
2315,156,-156.0
2316,141,-141.0
2317,148,-148.0
2318,168,-168.0
2319,174,-174.0
2320,163,-163.0
2321,169,-169.0
2322,103,-103.0
2323,175,-175.0
2324,170,-170.0
2325,155,-155.0
2326,159,-159.0
2327,172,-172.0
2328,151,-151.0
2329,163,-163.0
2330,170,-170.0
2331,102,-102.0
2332,167,-167.0
2333,156,-156.0
2334,155,-155.0
2335,170,-170.0
2336,179,-179.0
2337,172,-172.0
2338,151,-151.0
2339,147,-147.0
2340,158,-158.0
2341,138,-138.0
2342,92,-92.0
2343,156,-156.0
2344,97,-97.0
2345,147,-147.0
2346,150,-150.0
2347,93,-93.0
2348,157,-157.0
2349,159,-159.0
2350,159,-159.0
2351,90,-90.0
2352,154,-154.0
2353,179,-179.0
2354,200,-200.0
2355,200,-200.0
2356,160,-160.0
2357,164,-164.0
2358,89,-89.0
2359,162,-162.0
2360,153,-153.0
2361,86,-86.0
2362,186,-186.0
2363,162,-162.0
2364,153,-153.0
2365,176,-176.0
2366,91,-91.0
2367,113,-113.0
2368,166,-166.0
2369,163,-163.0
2370,152,-152.0
2371,166,-166.0
2372,163,-163.0
2373,87,-87.0
2374,154,-154.0
2375,157,-157.0
2376,165,-165.0
2377,153,-153.0
2378,163,-163.0
2379,149,-149.0
2380,149,-149.0
2381,154,-154.0
2382,174,-174.0
2383,90,-90.0
2384,146,-146.0
2385,100,-100.0
2386,154,-154.0
2387,148,-148.0
2388,170,-170.0
2389,170,-170.0
2390,155,-155.0
2391,146,-146.0
2392,86,-86.0
2393,150,-150.0
2394,86,-86.0
2395,164,-164.0
2396,90,-90.0
2397,115,-115.0
2398,94,-94.0
2399,174,-174.0
2400,148,-148.0
2401,200,-200.0
2402,147,-147.0
2403,157,-157.0
2404,154,-154.0
2405,151,-151.0
2406,161,-161.0
2407,178,-178.0
2408,155,-155.0
2409,193,-193.0
2410,148,-148.0
2411,150,-150.0
2412,91,-91.0
2413,159,-159.0
2414,141,-141.0
2415,93,-93.0
2416,163,-163.0
2417,89,-89.0
2418,162,-162.0
2419,169,-169.0
2420,89,-89.0
2421,185,-185.0
2422,163,-163.0
2423,184,-184.0
2424,87,-87.0
2425,143,-143.0
2426,144,-144.0
2427,98,-98.0
2428,164,-164.0
2429,153,-153.0
2430,141,-141.0
2431,144,-144.0
2432,138,-138.0
2433,95,-95.0
2434,145,-145.0
2435,144,-144.0
2436,145,-145.0
2437,173,-173.0
2438,146,-146.0
2439,138,-138.0
2440,99,-99.0
2441,149,-149.0
2442,169,-169.0
2443,150,-150.0
2444,142,-142.0
2445,144,-144.0
2446,137,-137.0
2447,159,-159.0
2448,142,-142.0
2449,169,-169.0
2450,168,-168.0
2451,161,-161.0
2452,158,-158.0
2453,93,-93.0
2454,171,-171.0
2455,185,-185.0
2456,187,-187.0
2457,138,-138.0
2458,175,-175.0
2459,99,-99.0
2460,140,-140.0
2461,150,-150.0
2462,146,-146.0
2463,137,-137.0
2464,151,-151.0
2465,145,-145.0
2466,165,-165.0
2467,194,-194.0
2468,159,-159.0
2469,137,-137.0
2470,136,-136.0
2471,139,-139.0
2472,137,-137.0
2473,140,-140.0
2474,133,-133.0
2475,99,-99.0
2476,88,-88.0
2477,139,-139.0
2478,135,-135.0
2479,96,-96.0
2480,102,-102.0
2481,136,-136.0
2482,140,-140.0
2483,143,-143.0
2484,174,-174.0
2485,142,-142.0
2486,99,-99.0
2487,133,-133.0
2488,96,-96.0
2489,147,-147.0
2490,130,-130.0
2491,88,-88.0
2492,176,-176.0
2493,84,-84.0
2494,142,-142.0
2495,167,-167.0
2496,143,-143.0
2497,146,-146.0
2498,88,-88.0
2499,87,-87.0
2500,160,-160.0
2501,143,-143.0
2502,102,-102.0
2503,143,-143.0
2504,85,-85.0
2505,140,-140.0
2506,144,-144.0
2507,85,-85.0
2508,88,-88.0
2509,87,-87.0
2510,141,-141.0
2511,168,-168.0
2512,193,-193.0
2513,86,-86.0
2514,147,-147.0
2515,85,-85.0
2516,153,-153.0
2517,85,-85.0
2518,97,-97.0
2519,138,-138.0
2520,120,-120.0
2521,100,-100.0
2522,100,-100.0
2523,92,-92.0
2524,158,-158.0
2525,125,-125.0
2526,160,-160.0
2527,150,-150.0
2528,142,-142.0
2529,146,-146.0
2530,148,-148.0
2531,157,-157.0
2532,86,-86.0
2533,144,-144.0
2534,154,-154.0
2535,159,-159.0
2536,88,-88.0
2537,85,-85.0
2538,151,-151.0
2539,147,-147.0
2540,146,-146.0
2541,85,-85.0
2542,147,-147.0
2543,155,-155.0
2544,110,-110.0
2545,115,-115.0
2546,86,-86.0
2547,89,-89.0
2548,152,-152.0
2549,164,-164.0
2550,94,-94.0
