episodes,steps,rewards
0,200,-200.0
1,200,-200.0
2,200,-200.0
3,200,-200.0
4,200,-200.0
5,200,-200.0
6,200,-200.0
7,200,-200.0
8,200,-200.0
9,200,-200.0
10,200,-200.0
11,200,-200.0
12,200,-200.0
13,200,-200.0
14,196,-196.0
15,200,-200.0
16,200,-200.0
17,200,-200.0
18,200,-200.0
19,200,-200.0
20,200,-200.0
21,200,-200.0
22,200,-200.0
23,200,-200.0
24,200,-200.0
25,200,-200.0
26,200,-200.0
27,200,-200.0
28,200,-200.0
29,200,-200.0
30,200,-200.0
31,200,-200.0
32,200,-200.0
33,200,-200.0
34,200,-200.0
35,200,-200.0
36,200,-200.0
37,200,-200.0
38,200,-200.0
39,200,-200.0
40,200,-200.0
41,200,-200.0
42,200,-200.0
43,200,-200.0
44,200,-200.0
45,120,-120.0
46,200,-200.0
47,150,-150.0
48,200,-200.0
49,131,-131.0
50,200,-200.0
51,200,-200.0
52,200,-200.0
53,200,-200.0
54,200,-200.0
55,200,-200.0
56,200,-200.0
57,200,-200.0
58,200,-200.0
59,200,-200.0
60,200,-200.0
61,200,-200.0
62,200,-200.0
63,200,-200.0
64,200,-200.0
65,200,-200.0
66,200,-200.0
67,200,-200.0
68,200,-200.0
69,200,-200.0
70,200,-200.0
71,200,-200.0
72,200,-200.0
73,200,-200.0
74,200,-200.0
75,200,-200.0
76,200,-200.0
77,200,-200.0
78,200,-200.0
79,200,-200.0
80,200,-200.0
81,200,-200.0
82,200,-200.0
83,200,-200.0
84,200,-200.0
85,200,-200.0
86,200,-200.0
87,200,-200.0
88,200,-200.0
89,200,-200.0
90,200,-200.0
91,200,-200.0
92,200,-200.0
93,200,-200.0
94,200,-200.0
95,200,-200.0
96,200,-200.0
97,200,-200.0
98,200,-200.0
99,200,-200.0
100,200,-200.0
101,200,-200.0
102,200,-200.0
103,200,-200.0
104,200,-200.0
105,200,-200.0
106,200,-200.0
107,200,-200.0
108,200,-200.0
109,200,-200.0
110,200,-200.0
111,200,-200.0
112,200,-200.0
113,200,-200.0
114,200,-200.0
115,200,-200.0
116,200,-200.0
117,200,-200.0
118,200,-200.0
119,200,-200.0
120,200,-200.0
121,200,-200.0
122,200,-200.0
123,130,-130.0
124,200,-200.0
125,200,-200.0
126,200,-200.0
127,200,-200.0
128,200,-200.0
129,200,-200.0
130,200,-200.0
131,200,-200.0
132,200,-200.0
133,200,-200.0
134,200,-200.0
135,200,-200.0
136,200,-200.0
137,200,-200.0
138,200,-200.0
139,200,-200.0
140,200,-200.0
141,200,-200.0
142,200,-200.0
143,200,-200.0
144,200,-200.0
145,200,-200.0
146,200,-200.0
147,139,-139.0
148,200,-200.0
149,200,-200.0
150,200,-200.0
151,200,-200.0
152,200,-200.0
153,200,-200.0
154,200,-200.0
155,200,-200.0
156,200,-200.0
157,200,-200.0
158,200,-200.0
159,200,-200.0
160,200,-200.0
161,200,-200.0
162,200,-200.0
163,200,-200.0
164,200,-200.0
165,200,-200.0
166,200,-200.0
167,200,-200.0
168,200,-200.0
169,200,-200.0
170,200,-200.0
171,200,-200.0
172,200,-200.0
173,200,-200.0
174,200,-200.0
175,200,-200.0
176,200,-200.0
177,200,-200.0
178,200,-200.0
179,200,-200.0
180,200,-200.0
181,200,-200.0
182,200,-200.0
183,200,-200.0
184,200,-200.0
185,200,-200.0
186,200,-200.0
187,200,-200.0
188,200,-200.0
189,200,-200.0
190,200,-200.0
191,200,-200.0
192,200,-200.0
193,200,-200.0
194,200,-200.0
195,200,-200.0
196,200,-200.0
197,200,-200.0
198,200,-200.0
199,200,-200.0
200,200,-200.0
201,200,-200.0
202,200,-200.0
203,200,-200.0
204,200,-200.0
205,159,-159.0
206,127,-127.0
207,200,-200.0
208,200,-200.0
209,200,-200.0
210,200,-200.0
211,200,-200.0
212,200,-200.0
213,200,-200.0
214,200,-200.0
215,200,-200.0
216,200,-200.0
217,200,-200.0
218,200,-200.0
219,200,-200.0
220,200,-200.0
221,200,-200.0
222,173,-173.0
223,162,-162.0
224,159,-159.0
225,167,-167.0
226,155,-155.0
227,161,-161.0
228,200,-200.0
229,200,-200.0
230,200,-200.0
231,200,-200.0
232,145,-145.0
233,200,-200.0
234,200,-200.0
235,200,-200.0
236,143,-143.0
237,140,-140.0
238,149,-149.0
239,161,-161.0
240,150,-150.0
241,153,-153.0
242,161,-161.0
243,147,-147.0
244,136,-136.0
245,142,-142.0
246,200,-200.0
247,152,-152.0
248,180,-180.0
249,131,-131.0
250,136,-136.0
251,133,-133.0
252,144,-144.0
253,138,-138.0
254,147,-147.0
255,142,-142.0
256,142,-142.0
257,165,-165.0
258,91,-91.0
259,137,-137.0
260,156,-156.0
261,141,-141.0
262,138,-138.0
263,141,-141.0
264,144,-144.0
265,138,-138.0
266,143,-143.0
267,147,-147.0
268,142,-142.0
269,144,-144.0
270,146,-146.0
271,164,-164.0
272,149,-149.0
273,149,-149.0
274,146,-146.0
275,200,-200.0
276,194,-194.0
277,144,-144.0
278,150,-150.0
279,144,-144.0
280,143,-143.0
281,146,-146.0
282,200,-200.0
283,200,-200.0
284,200,-200.0
285,200,-200.0
286,143,-143.0
287,200,-200.0
288,200,-200.0
289,200,-200.0
290,190,-190.0
291,200,-200.0
292,200,-200.0
293,188,-188.0
294,200,-200.0
295,141,-141.0
296,200,-200.0
297,144,-144.0
298,145,-145.0
299,200,-200.0
300,141,-141.0
301,155,-155.0
302,145,-145.0
303,200,-200.0
304,200,-200.0
305,200,-200.0
306,200,-200.0
307,199,-199.0
308,200,-200.0
309,200,-200.0
310,143,-143.0
311,200,-200.0
312,156,-156.0
313,200,-200.0
314,200,-200.0
315,147,-147.0
316,151,-151.0
317,146,-146.0
318,142,-142.0
319,142,-142.0
320,144,-144.0
321,149,-149.0
322,146,-146.0
323,145,-145.0
324,147,-147.0
325,153,-153.0
326,150,-150.0
327,154,-154.0
328,148,-148.0
329,149,-149.0
330,200,-200.0
331,200,-200.0
332,149,-149.0
333,151,-151.0
334,154,-154.0
335,150,-150.0
336,200,-200.0
337,100,-100.0
338,101,-101.0
339,171,-171.0
340,200,-200.0
341,178,-178.0
342,161,-161.0
343,151,-151.0
344,200,-200.0
345,200,-200.0
346,200,-200.0
347,165,-165.0
348,200,-200.0
349,200,-200.0
350,200,-200.0
351,200,-200.0
352,200,-200.0
353,200,-200.0
354,200,-200.0
355,200,-200.0
356,180,-180.0
357,200,-200.0
358,200,-200.0
359,200,-200.0
360,200,-200.0
361,200,-200.0
362,200,-200.0
363,200,-200.0
364,200,-200.0
365,95,-95.0
366,200,-200.0
367,200,-200.0
368,200,-200.0
369,200,-200.0
370,200,-200.0
371,200,-200.0
372,200,-200.0
373,200,-200.0
374,200,-200.0
375,200,-200.0
376,200,-200.0
377,200,-200.0
378,200,-200.0
379,168,-168.0
380,163,-163.0
381,200,-200.0
382,200,-200.0
383,200,-200.0
384,200,-200.0
385,200,-200.0
386,200,-200.0
387,200,-200.0
388,200,-200.0
389,200,-200.0
390,200,-200.0
391,94,-94.0
392,88,-88.0
393,144,-144.0
394,165,-165.0
395,200,-200.0
396,98,-98.0
397,163,-163.0
398,168,-168.0
399,200,-200.0
400,200,-200.0
401,200,-200.0
402,200,-200.0
403,167,-167.0
404,200,-200.0
405,200,-200.0
406,181,-181.0
407,174,-174.0
408,200,-200.0
409,174,-174.0
410,200,-200.0
411,160,-160.0
412,126,-126.0
413,200,-200.0
414,165,-165.0
415,170,-170.0
416,167,-167.0
417,168,-168.0
418,164,-164.0
419,161,-161.0
420,162,-162.0
421,159,-159.0
422,166,-166.0
423,200,-200.0
424,200,-200.0
425,173,-173.0
426,200,-200.0
427,187,-187.0
428,200,-200.0
429,200,-200.0
430,200,-200.0
431,172,-172.0
432,163,-163.0
433,200,-200.0
434,172,-172.0
435,200,-200.0
436,200,-200.0
437,200,-200.0
438,200,-200.0
439,200,-200.0
440,200,-200.0
441,200,-200.0
442,200,-200.0
443,200,-200.0
444,200,-200.0
445,200,-200.0
446,200,-200.0
447,200,-200.0
448,200,-200.0
449,169,-169.0
450,152,-152.0
451,153,-153.0
452,101,-101.0
453,200,-200.0
454,200,-200.0
455,200,-200.0
456,200,-200.0
457,200,-200.0
458,167,-167.0
459,164,-164.0
460,157,-157.0
461,200,-200.0
462,200,-200.0
463,187,-187.0
464,200,-200.0
465,161,-161.0
466,180,-180.0
467,174,-174.0
468,176,-176.0
469,164,-164.0
470,162,-162.0
471,162,-162.0
472,104,-104.0
473,184,-184.0
474,100,-100.0
475,102,-102.0
476,94,-94.0
477,200,-200.0
478,113,-113.0
479,127,-127.0
480,200,-200.0
481,177,-177.0
482,190,-190.0
483,162,-162.0
484,90,-90.0
485,176,-176.0
486,153,-153.0
487,90,-90.0
488,88,-88.0
489,103,-103.0
490,160,-160.0
491,165,-165.0
492,94,-94.0
493,200,-200.0
494,162,-162.0
495,200,-200.0
496,156,-156.0
497,200,-200.0
498,175,-175.0
499,159,-159.0
500,155,-155.0
501,200,-200.0
502,173,-173.0
503,155,-155.0
504,151,-151.0
505,162,-162.0
506,158,-158.0
507,154,-154.0
508,106,-106.0
509,157,-157.0
510,106,-106.0
511,147,-147.0
512,153,-153.0
513,184,-184.0
514,163,-163.0
515,155,-155.0
516,181,-181.0
517,106,-106.0
518,142,-142.0
519,153,-153.0
520,145,-145.0
521,150,-150.0
522,195,-195.0
523,108,-108.0
524,162,-162.0
525,191,-191.0
526,95,-95.0
527,172,-172.0
528,168,-168.0
529,97,-97.0
530,150,-150.0
531,175,-175.0
532,94,-94.0
533,163,-163.0
534,159,-159.0
535,163,-163.0
536,176,-176.0
537,163,-163.0
538,151,-151.0
539,154,-154.0
540,151,-151.0
541,90,-90.0
542,89,-89.0
543,87,-87.0
544,105,-105.0
545,172,-172.0
546,98,-98.0
547,106,-106.0
548,200,-200.0
549,169,-169.0
550,153,-153.0
551,151,-151.0
552,156,-156.0
553,153,-153.0
554,114,-114.0
555,90,-90.0
556,160,-160.0
557,160,-160.0
558,174,-174.0
559,96,-96.0
560,200,-200.0
561,200,-200.0
562,153,-153.0
563,98,-98.0
564,155,-155.0
565,159,-159.0
566,158,-158.0
567,151,-151.0
568,153,-153.0
569,155,-155.0
570,151,-151.0
571,154,-154.0
572,103,-103.0
573,169,-169.0
574,120,-120.0
575,153,-153.0
576,169,-169.0
577,89,-89.0
578,89,-89.0
579,170,-170.0
580,187,-187.0
581,90,-90.0
582,158,-158.0
583,152,-152.0
584,110,-110.0
585,147,-147.0
586,160,-160.0
587,162,-162.0
588,121,-121.0
589,164,-164.0
590,159,-159.0
591,164,-164.0
592,149,-149.0
593,150,-150.0
594,166,-166.0
595,123,-123.0
596,94,-94.0
597,200,-200.0
598,150,-150.0
599,162,-162.0
600,167,-167.0
601,159,-159.0
602,158,-158.0
603,200,-200.0
604,95,-95.0
605,159,-159.0
606,148,-148.0
607,159,-159.0
608,168,-168.0
609,147,-147.0
610,95,-95.0
611,93,-93.0
612,150,-150.0
613,157,-157.0
614,98,-98.0
615,93,-93.0
616,161,-161.0
617,151,-151.0
618,107,-107.0
619,96,-96.0
620,119,-119.0
621,144,-144.0
622,152,-152.0
623,97,-97.0
624,91,-91.0
625,188,-188.0
626,200,-200.0
627,185,-185.0
628,89,-89.0
629,95,-95.0
630,149,-149.0
631,200,-200.0
632,96,-96.0
633,172,-172.0
634,112,-112.0
635,97,-97.0
636,154,-154.0
637,157,-157.0
638,157,-157.0
639,92,-92.0
640,101,-101.0
641,161,-161.0
642,160,-160.0
643,94,-94.0
644,157,-157.0
645,93,-93.0
646,145,-145.0
647,161,-161.0
648,163,-163.0
649,88,-88.0
650,150,-150.0
651,155,-155.0
652,160,-160.0
653,171,-171.0
654,161,-161.0
655,191,-191.0
656,96,-96.0
657,96,-96.0
658,176,-176.0
659,91,-91.0
660,161,-161.0
661,173,-173.0
662,91,-91.0
663,149,-149.0
664,92,-92.0
665,116,-116.0
666,88,-88.0
667,158,-158.0
668,156,-156.0
669,167,-167.0
670,166,-166.0
671,105,-105.0
672,101,-101.0
673,158,-158.0
674,164,-164.0
675,171,-171.0
676,169,-169.0
677,114,-114.0
678,92,-92.0
679,168,-168.0
680,93,-93.0
681,165,-165.0
682,91,-91.0
683,158,-158.0
684,154,-154.0
685,169,-169.0
686,93,-93.0
687,146,-146.0
688,158,-158.0
689,157,-157.0
690,200,-200.0
691,159,-159.0
692,159,-159.0
693,151,-151.0
694,157,-157.0
695,149,-149.0
696,93,-93.0
697,151,-151.0
698,104,-104.0
699,153,-153.0
700,155,-155.0
701,88,-88.0
702,175,-175.0
703,116,-116.0
704,147,-147.0
705,164,-164.0
706,157,-157.0
707,104,-104.0
708,165,-165.0
709,90,-90.0
710,150,-150.0
711,94,-94.0
712,165,-165.0
713,131,-131.0
714,96,-96.0
715,153,-153.0
716,173,-173.0
717,161,-161.0
718,110,-110.0
719,101,-101.0
720,153,-153.0
721,156,-156.0
722,92,-92.0
723,135,-135.0
724,154,-154.0
725,154,-154.0
726,154,-154.0
727,158,-158.0
728,95,-95.0
729,94,-94.0
730,200,-200.0
731,160,-160.0
732,154,-154.0
733,160,-160.0
734,163,-163.0
735,89,-89.0
736,101,-101.0
737,160,-160.0
738,96,-96.0
739,153,-153.0
740,151,-151.0
741,152,-152.0
742,200,-200.0
743,101,-101.0
744,162,-162.0
745,159,-159.0
746,159,-159.0
747,97,-97.0
748,153,-153.0
749,90,-90.0
750,200,-200.0
751,155,-155.0
752,185,-185.0
753,200,-200.0
754,95,-95.0
755,155,-155.0
756,105,-105.0
757,200,-200.0
758,161,-161.0
759,158,-158.0
760,89,-89.0
761,151,-151.0
762,121,-121.0
763,156,-156.0
764,179,-179.0
765,156,-156.0
766,155,-155.0
767,96,-96.0
768,156,-156.0
769,164,-164.0
770,200,-200.0
771,154,-154.0
772,152,-152.0
773,146,-146.0
774,162,-162.0
775,94,-94.0
776,170,-170.0
777,93,-93.0
778,94,-94.0
779,186,-186.0
780,187,-187.0
781,105,-105.0
782,169,-169.0
783,163,-163.0
784,159,-159.0
785,152,-152.0
786,94,-94.0
787,89,-89.0
788,152,-152.0
789,100,-100.0
790,92,-92.0
791,149,-149.0
792,88,-88.0
793,90,-90.0
794,164,-164.0
795,187,-187.0
796,156,-156.0
797,160,-160.0
798,104,-104.0
799,156,-156.0
800,156,-156.0
801,162,-162.0
802,92,-92.0
803,90,-90.0
804,156,-156.0
805,153,-153.0
806,88,-88.0
807,91,-91.0
808,94,-94.0
809,154,-154.0
810,155,-155.0
811,89,-89.0
812,148,-148.0
813,86,-86.0
814,155,-155.0
815,154,-154.0
816,161,-161.0
817,93,-93.0
818,96,-96.0
819,153,-153.0
820,197,-197.0
821,92,-92.0
822,152,-152.0
823,104,-104.0
824,88,-88.0
825,160,-160.0
826,150,-150.0
827,144,-144.0
828,149,-149.0
829,150,-150.0
830,153,-153.0
831,148,-148.0
832,88,-88.0
833,153,-153.0
834,96,-96.0
835,180,-180.0
836,177,-177.0
837,185,-185.0
838,153,-153.0
839,148,-148.0
840,109,-109.0
841,146,-146.0
842,94,-94.0
843,145,-145.0
844,143,-143.0
845,89,-89.0
846,95,-95.0
847,88,-88.0
848,155,-155.0
849,93,-93.0
850,156,-156.0
851,148,-148.0
852,172,-172.0
853,189,-189.0
854,143,-143.0
855,85,-85.0
856,143,-143.0
857,145,-145.0
858,150,-150.0
859,110,-110.0
860,86,-86.0
861,92,-92.0
862,169,-169.0
863,149,-149.0
864,147,-147.0
865,148,-148.0
866,88,-88.0
867,172,-172.0
868,92,-92.0
869,145,-145.0
870,143,-143.0
871,148,-148.0
872,98,-98.0
873,153,-153.0
874,147,-147.0
875,144,-144.0
876,99,-99.0
877,147,-147.0
878,143,-143.0
879,162,-162.0
880,143,-143.0
881,163,-163.0
882,141,-141.0
883,142,-142.0
884,173,-173.0
885,148,-148.0
886,147,-147.0
887,141,-141.0
888,140,-140.0
889,96,-96.0
890,99,-99.0
891,115,-115.0
892,139,-139.0
893,145,-145.0
894,107,-107.0
895,139,-139.0
896,140,-140.0
897,144,-144.0
898,146,-146.0
899,146,-146.0
900,200,-200.0
901,157,-157.0
902,163,-163.0
903,144,-144.0
904,140,-140.0
905,144,-144.0
906,144,-144.0
907,144,-144.0
908,144,-144.0
909,101,-101.0
910,150,-150.0
911,147,-147.0
912,147,-147.0
913,116,-116.0
914,140,-140.0
915,139,-139.0
916,176,-176.0
917,160,-160.0
918,198,-198.0
919,140,-140.0
920,200,-200.0
921,147,-147.0
922,104,-104.0
923,138,-138.0
924,91,-91.0
925,148,-148.0
926,140,-140.0
927,144,-144.0
928,153,-153.0
929,97,-97.0
930,144,-144.0
931,90,-90.0
932,105,-105.0
933,87,-87.0
934,150,-150.0
935,146,-146.0
936,141,-141.0
937,138,-138.0
938,146,-146.0
939,148,-148.0
940,93,-93.0
941,162,-162.0
942,138,-138.0
943,137,-137.0
944,151,-151.0
945,145,-145.0
946,152,-152.0
947,161,-161.0
948,200,-200.0
949,144,-144.0
950,200,-200.0
951,200,-200.0
952,162,-162.0
953,170,-170.0
954,152,-152.0
955,141,-141.0
956,152,-152.0
957,109,-109.0
958,144,-144.0
959,200,-200.0
960,148,-148.0
961,141,-141.0
962,143,-143.0
963,156,-156.0
964,142,-142.0
965,103,-103.0
966,166,-166.0
967,200,-200.0
968,144,-144.0
969,192,-192.0
970,151,-151.0
971,145,-145.0
972,200,-200.0
973,86,-86.0
974,89,-89.0
975,200,-200.0
976,200,-200.0
977,200,-200.0
978,143,-143.0
979,143,-143.0
980,146,-146.0
981,147,-147.0
982,162,-162.0
983,159,-159.0
984,145,-145.0
985,200,-200.0
986,200,-200.0
987,200,-200.0
988,154,-154.0
989,149,-149.0
990,152,-152.0
991,152,-152.0
992,144,-144.0
993,148,-148.0
994,144,-144.0
995,146,-146.0
996,147,-147.0
997,157,-157.0
998,150,-150.0
999,147,-147.0
1000,148,-148.0
1001,200,-200.0
1002,200,-200.0
1003,147,-147.0
1004,153,-153.0
1005,200,-200.0
1006,148,-148.0
1007,185,-185.0
1008,149,-149.0
1009,149,-149.0
1010,200,-200.0
1011,141,-141.0
1012,147,-147.0
1013,200,-200.0
1014,140,-140.0
1015,161,-161.0
1016,200,-200.0
1017,200,-200.0
1018,146,-146.0
1019,148,-148.0
1020,200,-200.0
1021,200,-200.0
1022,192,-192.0
1023,143,-143.0
1024,145,-145.0
1025,143,-143.0
1026,146,-146.0
1027,150,-150.0
1028,148,-148.0
1029,147,-147.0
1030,200,-200.0
1031,200,-200.0
1032,200,-200.0
1033,200,-200.0
1034,147,-147.0
1035,159,-159.0
1036,140,-140.0
1037,153,-153.0
1038,153,-153.0
1039,145,-145.0
1040,141,-141.0
1041,144,-144.0
1042,149,-149.0
1043,144,-144.0
1044,143,-143.0
1045,142,-142.0
1046,141,-141.0
1047,200,-200.0
1048,157,-157.0
1049,200,-200.0
1050,153,-153.0
1051,200,-200.0
1052,200,-200.0
1053,200,-200.0
1054,200,-200.0
1055,151,-151.0
1056,200,-200.0
1057,200,-200.0
1058,198,-198.0
1059,149,-149.0
1060,200,-200.0
1061,200,-200.0
1062,142,-142.0
1063,146,-146.0
1064,200,-200.0
1065,150,-150.0
1066,200,-200.0
1067,191,-191.0
1068,200,-200.0
1069,200,-200.0
1070,148,-148.0
1071,141,-141.0
1072,196,-196.0
1073,200,-200.0
1074,200,-200.0
1075,200,-200.0
1076,200,-200.0
1077,146,-146.0
1078,200,-200.0
1079,200,-200.0
1080,157,-157.0
1081,200,-200.0
1082,200,-200.0
1083,197,-197.0
1084,200,-200.0
1085,200,-200.0
1086,200,-200.0
1087,200,-200.0
1088,170,-170.0
1089,149,-149.0
1090,152,-152.0
1091,158,-158.0
1092,200,-200.0
1093,200,-200.0
1094,200,-200.0
1095,200,-200.0
1096,200,-200.0
1097,158,-158.0
1098,200,-200.0
1099,200,-200.0
1100,147,-147.0
1101,154,-154.0
1102,163,-163.0
1103,152,-152.0
1104,200,-200.0
1105,200,-200.0
1106,200,-200.0
1107,200,-200.0
1108,200,-200.0
1109,200,-200.0
1110,174,-174.0
1111,200,-200.0
1112,168,-168.0
1113,162,-162.0
1114,200,-200.0
1115,200,-200.0
1116,200,-200.0
1117,200,-200.0
1118,167,-167.0
1119,200,-200.0
1120,200,-200.0
1121,200,-200.0
1122,200,-200.0
1123,200,-200.0
1124,200,-200.0
1125,200,-200.0
1126,200,-200.0
1127,200,-200.0
1128,200,-200.0
1129,200,-200.0
1130,200,-200.0
1131,200,-200.0
1132,200,-200.0
1133,200,-200.0
1134,200,-200.0
1135,200,-200.0
1136,200,-200.0
1137,200,-200.0
1138,200,-200.0
1139,200,-200.0
1140,200,-200.0
1141,200,-200.0
1142,200,-200.0
1143,200,-200.0
1144,200,-200.0
1145,200,-200.0
1146,200,-200.0
1147,200,-200.0
1148,200,-200.0
1149,200,-200.0
1150,200,-200.0
1151,200,-200.0
1152,200,-200.0
1153,200,-200.0
1154,200,-200.0
1155,200,-200.0
1156,200,-200.0
1157,200,-200.0
1158,157,-157.0
1159,200,-200.0
1160,156,-156.0
1161,200,-200.0
1162,155,-155.0
1163,168,-168.0
1164,182,-182.0
1165,147,-147.0
1166,159,-159.0
1167,167,-167.0
1168,200,-200.0
1169,166,-166.0
1170,150,-150.0
1171,200,-200.0
1172,103,-103.0
1173,189,-189.0
1174,150,-150.0
1175,149,-149.0
1176,154,-154.0
1177,154,-154.0
1178,155,-155.0
1179,200,-200.0
1180,158,-158.0
1181,130,-130.0
1182,148,-148.0
1183,160,-160.0
1184,152,-152.0
1185,89,-89.0
1186,181,-181.0
1187,97,-97.0
1188,163,-163.0
1189,177,-177.0
1190,171,-171.0
1191,90,-90.0
1192,162,-162.0
1193,166,-166.0
1194,163,-163.0
1195,88,-88.0
1196,157,-157.0
1197,126,-126.0
1198,86,-86.0
1199,170,-170.0
1200,153,-153.0
1201,148,-148.0
1202,101,-101.0
1203,156,-156.0
1204,84,-84.0
1205,146,-146.0
1206,165,-165.0
1207,105,-105.0
1208,162,-162.0
1209,177,-177.0
1210,92,-92.0
1211,180,-180.0
1212,171,-171.0
1213,184,-184.0
1214,90,-90.0
1215,158,-158.0
1216,200,-200.0
1217,167,-167.0
1218,200,-200.0
1219,91,-91.0
1220,87,-87.0
1221,173,-173.0
1222,155,-155.0
1223,152,-152.0
1224,146,-146.0
1225,151,-151.0
1226,161,-161.0
1227,159,-159.0
1228,154,-154.0
1229,161,-161.0
1230,147,-147.0
1231,160,-160.0
1232,163,-163.0
1233,160,-160.0
1234,97,-97.0
1235,162,-162.0
1236,162,-162.0
1237,116,-116.0
1238,156,-156.0
1239,93,-93.0
1240,149,-149.0
1241,155,-155.0
1242,200,-200.0
1243,151,-151.0
1244,173,-173.0
1245,155,-155.0
1246,200,-200.0
1247,149,-149.0
1248,159,-159.0
1249,153,-153.0
1250,150,-150.0
1251,153,-153.0
1252,150,-150.0
1253,151,-151.0
1254,148,-148.0
1255,156,-156.0
1256,157,-157.0
1257,146,-146.0
1258,128,-128.0
1259,151,-151.0
1260,155,-155.0
1261,154,-154.0
1262,148,-148.0
1263,161,-161.0
1264,163,-163.0
1265,152,-152.0
1266,158,-158.0
1267,163,-163.0
1268,99,-99.0
1269,168,-168.0
1270,164,-164.0
1271,122,-122.0
1272,91,-91.0
1273,155,-155.0
1274,181,-181.0
1275,199,-199.0
1276,158,-158.0
1277,87,-87.0
1278,149,-149.0
1279,152,-152.0
1280,118,-118.0
1281,98,-98.0
1282,154,-154.0
1283,149,-149.0
1284,155,-155.0
1285,145,-145.0
1286,147,-147.0
1287,150,-150.0
1288,97,-97.0
1289,156,-156.0
1290,156,-156.0
1291,176,-176.0
1292,144,-144.0
1293,158,-158.0
1294,88,-88.0
1295,181,-181.0
1296,151,-151.0
1297,147,-147.0
1298,93,-93.0
1299,145,-145.0
1300,103,-103.0
1301,148,-148.0
1302,184,-184.0
1303,144,-144.0
1304,148,-148.0
1305,146,-146.0
1306,145,-145.0
1307,148,-148.0
1308,148,-148.0
1309,186,-186.0
1310,149,-149.0
1311,97,-97.0
1312,94,-94.0
1313,143,-143.0
1314,89,-89.0
1315,148,-148.0
1316,153,-153.0
1317,143,-143.0
1318,168,-168.0
1319,200,-200.0
1320,148,-148.0
1321,150,-150.0
1322,151,-151.0
1323,93,-93.0
1324,155,-155.0
1325,190,-190.0
1326,170,-170.0
1327,153,-153.0
1328,178,-178.0
1329,153,-153.0
1330,200,-200.0
1331,200,-200.0
1332,170,-170.0
1333,144,-144.0
1334,109,-109.0
1335,200,-200.0
1336,149,-149.0
1337,150,-150.0
1338,143,-143.0
1339,200,-200.0
1340,147,-147.0
1341,108,-108.0
1342,97,-97.0
1343,142,-142.0
1344,88,-88.0
1345,200,-200.0
1346,157,-157.0
1347,96,-96.0
1348,174,-174.0
1349,153,-153.0
1350,164,-164.0
1351,168,-168.0
1352,131,-131.0
1353,142,-142.0
1354,99,-99.0
1355,183,-183.0
1356,169,-169.0
1357,169,-169.0
1358,158,-158.0
1359,154,-154.0
1360,158,-158.0
1361,164,-164.0
1362,88,-88.0
1363,159,-159.0
1364,169,-169.0
1365,156,-156.0
1366,155,-155.0
1367,149,-149.0
1368,145,-145.0
1369,151,-151.0
1370,153,-153.0
1371,169,-169.0
1372,147,-147.0
1373,159,-159.0
1374,93,-93.0
1375,156,-156.0
1376,125,-125.0
1377,147,-147.0
1378,143,-143.0
1379,85,-85.0
1380,165,-165.0
1381,89,-89.0
1382,151,-151.0
1383,151,-151.0
1384,146,-146.0
1385,86,-86.0
1386,147,-147.0
1387,110,-110.0
1388,146,-146.0
1389,152,-152.0
1390,148,-148.0
1391,155,-155.0
1392,147,-147.0
1393,147,-147.0
1394,146,-146.0
1395,146,-146.0
1396,141,-141.0
1397,93,-93.0
1398,166,-166.0
1399,89,-89.0
1400,140,-140.0
1401,95,-95.0
1402,150,-150.0
1403,87,-87.0
1404,152,-152.0
1405,151,-151.0
1406,89,-89.0
1407,160,-160.0
1408,101,-101.0
1409,151,-151.0
1410,97,-97.0
1411,163,-163.0
1412,93,-93.0
1413,181,-181.0
1414,97,-97.0
1415,159,-159.0
1416,154,-154.0
1417,91,-91.0
1418,162,-162.0
1419,161,-161.0
1420,198,-198.0
1421,95,-95.0
1422,145,-145.0
1423,89,-89.0
1424,200,-200.0
1425,153,-153.0
1426,200,-200.0
1427,200,-200.0
1428,165,-165.0
1429,200,-200.0
1430,159,-159.0
1431,98,-98.0
1432,151,-151.0
1433,93,-93.0
1434,160,-160.0
1435,155,-155.0
1436,145,-145.0
1437,169,-169.0
1438,95,-95.0
1439,149,-149.0
1440,170,-170.0
1441,98,-98.0
1442,169,-169.0
1443,169,-169.0
1444,158,-158.0
1445,143,-143.0
1446,105,-105.0
1447,162,-162.0
1448,143,-143.0
1449,179,-179.0
1450,96,-96.0
1451,92,-92.0
1452,149,-149.0
1453,200,-200.0
1454,86,-86.0
1455,174,-174.0
1456,151,-151.0
1457,99,-99.0
1458,165,-165.0
1459,169,-169.0
1460,89,-89.0
1461,92,-92.0
1462,146,-146.0
1463,94,-94.0
1464,159,-159.0
1465,87,-87.0
1466,93,-93.0
1467,163,-163.0
1468,140,-140.0
1469,200,-200.0
1470,157,-157.0
1471,148,-148.0
1472,151,-151.0
1473,148,-148.0
1474,149,-149.0
1475,94,-94.0
1476,163,-163.0
1477,147,-147.0
1478,90,-90.0
1479,149,-149.0
1480,108,-108.0
1481,164,-164.0
1482,150,-150.0
1483,172,-172.0
1484,149,-149.0
1485,150,-150.0
1486,142,-142.0
1487,168,-168.0
1488,123,-123.0
1489,105,-105.0
1490,97,-97.0
1491,144,-144.0
1492,148,-148.0
1493,199,-199.0
1494,172,-172.0
1495,156,-156.0
1496,200,-200.0
1497,89,-89.0
1498,158,-158.0
1499,200,-200.0
1500,163,-163.0
1501,89,-89.0
1502,155,-155.0
1503,101,-101.0
1504,162,-162.0
1505,160,-160.0
1506,168,-168.0
1507,172,-172.0
1508,147,-147.0
1509,154,-154.0
1510,150,-150.0
1511,155,-155.0
1512,92,-92.0
1513,200,-200.0
1514,160,-160.0
1515,155,-155.0
1516,151,-151.0
1517,155,-155.0
1518,97,-97.0
1519,200,-200.0
1520,200,-200.0
1521,142,-142.0
1522,174,-174.0
1523,163,-163.0
1524,200,-200.0
1525,169,-169.0
1526,193,-193.0
1527,142,-142.0
1528,149,-149.0
1529,103,-103.0
1530,86,-86.0
1531,143,-143.0
1532,138,-138.0
1533,87,-87.0
1534,174,-174.0
1535,146,-146.0
1536,144,-144.0
1537,159,-159.0
1538,100,-100.0
1539,168,-168.0
1540,164,-164.0
1541,149,-149.0
1542,141,-141.0
1543,130,-130.0
1544,190,-190.0
1545,87,-87.0
1546,158,-158.0
1547,85,-85.0
1548,159,-159.0
1549,87,-87.0
1550,200,-200.0
1551,96,-96.0
1552,87,-87.0
1553,152,-152.0
1554,93,-93.0
1555,88,-88.0
1556,166,-166.0
1557,156,-156.0
1558,91,-91.0
1559,153,-153.0
1560,145,-145.0
1561,154,-154.0
1562,117,-117.0
1563,149,-149.0
1564,89,-89.0
1565,141,-141.0
1566,161,-161.0
1567,96,-96.0
1568,85,-85.0
1569,132,-132.0
1570,102,-102.0
1571,87,-87.0
1572,92,-92.0
1573,144,-144.0
1574,149,-149.0
1575,200,-200.0
1576,152,-152.0
1577,147,-147.0
1578,153,-153.0
1579,147,-147.0
1580,146,-146.0
1581,95,-95.0
1582,144,-144.0
1583,160,-160.0
1584,96,-96.0
1585,164,-164.0
1586,88,-88.0
1587,112,-112.0
1588,162,-162.0
1589,163,-163.0
1590,91,-91.0
1591,174,-174.0
1592,157,-157.0
1593,85,-85.0
1594,94,-94.0
1595,152,-152.0
1596,200,-200.0
1597,145,-145.0
1598,87,-87.0
1599,146,-146.0
1600,176,-176.0
1601,161,-161.0
1602,191,-191.0
1603,169,-169.0
1604,110,-110.0
1605,140,-140.0
1606,132,-132.0
1607,85,-85.0
1608,144,-144.0
1609,151,-151.0
1610,88,-88.0
1611,200,-200.0
1612,85,-85.0
1613,145,-145.0
1614,96,-96.0
1615,90,-90.0
1616,151,-151.0
1617,145,-145.0
1618,111,-111.0
1619,161,-161.0
1620,151,-151.0
1621,190,-190.0
1622,139,-139.0
1623,154,-154.0
1624,86,-86.0
1625,138,-138.0
1626,98,-98.0
1627,148,-148.0
1628,130,-130.0
1629,142,-142.0
1630,121,-121.0
1631,139,-139.0
1632,198,-198.0
1633,89,-89.0
1634,146,-146.0
1635,161,-161.0
1636,140,-140.0
1637,139,-139.0
1638,140,-140.0
1639,143,-143.0
1640,112,-112.0
1641,103,-103.0
1642,143,-143.0
1643,140,-140.0
1644,90,-90.0
1645,157,-157.0
1646,89,-89.0
1647,149,-149.0
1648,91,-91.0
1649,91,-91.0
1650,149,-149.0
1651,161,-161.0
1652,180,-180.0
1653,150,-150.0
1654,143,-143.0
1655,142,-142.0
1656,155,-155.0
1657,172,-172.0
1658,90,-90.0
1659,115,-115.0
1660,148,-148.0
1661,149,-149.0
1662,160,-160.0
1663,149,-149.0
1664,185,-185.0
1665,161,-161.0
1666,135,-135.0
1667,160,-160.0
1668,161,-161.0
1669,117,-117.0
1670,141,-141.0
1671,85,-85.0
1672,159,-159.0
1673,86,-86.0
1674,118,-118.0
1675,92,-92.0
1676,144,-144.0
1677,154,-154.0
1678,152,-152.0
1679,145,-145.0
1680,90,-90.0
1681,96,-96.0
1682,146,-146.0
1683,146,-146.0
1684,160,-160.0
1685,91,-91.0
1686,174,-174.0
1687,106,-106.0
1688,89,-89.0
1689,92,-92.0
1690,138,-138.0
1691,119,-119.0
1692,200,-200.0
1693,195,-195.0
1694,93,-93.0
1695,86,-86.0
1696,142,-142.0
1697,145,-145.0
1698,113,-113.0
1699,142,-142.0
1700,145,-145.0
1701,86,-86.0
1702,100,-100.0
1703,149,-149.0
1704,119,-119.0
1705,138,-138.0
1706,138,-138.0
1707,88,-88.0
1708,103,-103.0
1709,118,-118.0
1710,103,-103.0
1711,140,-140.0
1712,92,-92.0
1713,141,-141.0
1714,116,-116.0
1715,136,-136.0
1716,138,-138.0
1717,151,-151.0
1718,138,-138.0
1719,142,-142.0
1720,136,-136.0
1721,141,-141.0
1722,107,-107.0
1723,147,-147.0
1724,170,-170.0
1725,140,-140.0
1726,139,-139.0
1727,148,-148.0
1728,137,-137.0
1729,144,-144.0
1730,134,-134.0
1731,84,-84.0
1732,87,-87.0
1733,132,-132.0
1734,145,-145.0
1735,141,-141.0
1736,142,-142.0
1737,146,-146.0
1738,144,-144.0
1739,144,-144.0
1740,143,-143.0
1741,86,-86.0
1742,173,-173.0
1743,141,-141.0
1744,133,-133.0
1745,155,-155.0
1746,108,-108.0
1747,114,-114.0
1748,91,-91.0
1749,92,-92.0
1750,166,-166.0
1751,87,-87.0
1752,162,-162.0
1753,143,-143.0
1754,128,-128.0
1755,139,-139.0
1756,147,-147.0
1757,177,-177.0
1758,139,-139.0
1759,145,-145.0
1760,88,-88.0
1761,115,-115.0
1762,144,-144.0
1763,89,-89.0
1764,147,-147.0
1765,141,-141.0
1766,145,-145.0
1767,99,-99.0
1768,85,-85.0
1769,200,-200.0
1770,160,-160.0
1771,101,-101.0
1772,162,-162.0
1773,84,-84.0
1774,91,-91.0
1775,85,-85.0
1776,90,-90.0
1777,141,-141.0
1778,150,-150.0
1779,143,-143.0
1780,153,-153.0
1781,177,-177.0
1782,90,-90.0
1783,138,-138.0
1784,148,-148.0
1785,165,-165.0
1786,93,-93.0
1787,85,-85.0
1788,139,-139.0
1789,84,-84.0
1790,137,-137.0
1791,146,-146.0
1792,86,-86.0
1793,110,-110.0
1794,200,-200.0
1795,200,-200.0
1796,150,-150.0
1797,150,-150.0
1798,165,-165.0
1799,152,-152.0
1800,95,-95.0
