episodes,steps,rewards
0,200,-200.0
1,200,-200.0
2,200,-200.0
3,200,-200.0
4,200,-200.0
5,200,-200.0
6,200,-200.0
7,200,-200.0
8,200,-200.0
9,200,-200.0
10,200,-200.0
11,200,-200.0
12,200,-200.0
13,200,-200.0
14,200,-200.0
15,200,-200.0
16,200,-200.0
17,200,-200.0
18,200,-200.0
19,200,-200.0
20,200,-200.0
21,200,-200.0
22,200,-200.0
23,200,-200.0
24,200,-200.0
25,200,-200.0
26,200,-200.0
27,200,-200.0
28,200,-200.0
29,200,-200.0
30,200,-200.0
31,200,-200.0
32,200,-200.0
33,200,-200.0
34,200,-200.0
35,200,-200.0
36,200,-200.0
37,200,-200.0
38,200,-200.0
39,200,-200.0
40,200,-200.0
41,200,-200.0
42,200,-200.0
43,200,-200.0
44,200,-200.0
45,200,-200.0
46,200,-200.0
47,200,-200.0
48,200,-200.0
49,200,-200.0
50,200,-200.0
51,200,-200.0
52,200,-200.0
53,200,-200.0
54,200,-200.0
55,200,-200.0
56,200,-200.0
57,200,-200.0
58,200,-200.0
59,200,-200.0
60,200,-200.0
61,200,-200.0
62,200,-200.0
63,200,-200.0
64,200,-200.0
65,200,-200.0
66,200,-200.0
67,200,-200.0
68,200,-200.0
69,200,-200.0
70,200,-200.0
71,200,-200.0
72,200,-200.0
73,200,-200.0
74,200,-200.0
75,200,-200.0
76,200,-200.0
77,200,-200.0
78,200,-200.0
79,200,-200.0
80,200,-200.0
81,200,-200.0
82,200,-200.0
83,200,-200.0
84,200,-200.0
85,200,-200.0
86,200,-200.0
87,200,-200.0
88,200,-200.0
89,200,-200.0
90,200,-200.0
91,200,-200.0
92,200,-200.0
93,200,-200.0
94,200,-200.0
95,200,-200.0
96,200,-200.0
97,195,-195.0
98,200,-200.0
99,200,-200.0
100,200,-200.0
101,200,-200.0
102,200,-200.0
103,200,-200.0
104,200,-200.0
105,200,-200.0
106,200,-200.0
107,200,-200.0
108,200,-200.0
109,192,-192.0
110,200,-200.0
111,200,-200.0
112,200,-200.0
113,200,-200.0
114,200,-200.0
115,200,-200.0
116,200,-200.0
117,200,-200.0
118,200,-200.0
119,200,-200.0
120,200,-200.0
121,200,-200.0
122,200,-200.0
123,200,-200.0
124,120,-120.0
125,200,-200.0
126,200,-200.0
127,200,-200.0
128,200,-200.0
129,200,-200.0
130,200,-200.0
131,200,-200.0
132,200,-200.0
133,200,-200.0
134,192,-192.0
135,200,-200.0
136,200,-200.0
137,200,-200.0
138,200,-200.0
139,200,-200.0
140,200,-200.0
141,200,-200.0
142,148,-148.0
143,189,-189.0
144,200,-200.0
145,200,-200.0
146,200,-200.0
147,200,-200.0
148,200,-200.0
149,200,-200.0
150,200,-200.0
151,200,-200.0
152,200,-200.0
153,200,-200.0
154,200,-200.0
155,200,-200.0
156,200,-200.0
157,200,-200.0
158,200,-200.0
159,200,-200.0
160,200,-200.0
161,200,-200.0
162,200,-200.0
163,200,-200.0
164,200,-200.0
165,200,-200.0
166,200,-200.0
167,200,-200.0
168,200,-200.0
169,200,-200.0
170,200,-200.0
171,153,-153.0
172,200,-200.0
173,200,-200.0
174,191,-191.0
175,150,-150.0
176,200,-200.0
177,200,-200.0
178,151,-151.0
179,200,-200.0
180,145,-145.0
181,199,-199.0
182,200,-200.0
183,200,-200.0
184,119,-119.0
185,200,-200.0
186,200,-200.0
187,200,-200.0
188,150,-150.0
189,122,-122.0
190,200,-200.0
191,157,-157.0
192,200,-200.0
193,163,-163.0
194,200,-200.0
195,200,-200.0
196,156,-156.0
197,161,-161.0
198,150,-150.0
199,198,-198.0
200,147,-147.0
201,137,-137.0
202,150,-150.0
203,190,-190.0
204,200,-200.0
205,136,-136.0
206,141,-141.0
207,200,-200.0
208,200,-200.0
209,200,-200.0
210,200,-200.0
211,141,-141.0
212,200,-200.0
213,200,-200.0
214,147,-147.0
215,200,-200.0
216,147,-147.0
217,146,-146.0
218,147,-147.0
219,149,-149.0
220,200,-200.0
221,167,-167.0
222,137,-137.0
223,175,-175.0
224,152,-152.0
225,131,-131.0
226,170,-170.0
227,140,-140.0
228,187,-187.0
229,142,-142.0
230,200,-200.0
231,123,-123.0
232,183,-183.0
233,200,-200.0
234,121,-121.0
235,92,-92.0
236,197,-197.0
237,169,-169.0
238,179,-179.0
239,187,-187.0
240,163,-163.0
241,154,-154.0
242,153,-153.0
243,187,-187.0
244,171,-171.0
245,122,-122.0
246,118,-118.0
247,200,-200.0
248,164,-164.0
249,129,-129.0
250,200,-200.0
251,118,-118.0
252,166,-166.0
253,117,-117.0
254,185,-185.0
255,117,-117.0
256,112,-112.0
257,168,-168.0
258,108,-108.0
259,156,-156.0
260,138,-138.0
261,199,-199.0
262,200,-200.0
263,161,-161.0
264,162,-162.0
265,154,-154.0
266,158,-158.0
267,134,-134.0
268,197,-197.0
269,166,-166.0
270,165,-165.0
271,89,-89.0
272,163,-163.0
273,157,-157.0
274,122,-122.0
275,162,-162.0
276,165,-165.0
277,183,-183.0
278,161,-161.0
279,170,-170.0
280,152,-152.0
281,142,-142.0
282,92,-92.0
283,167,-167.0
284,147,-147.0
285,181,-181.0
286,149,-149.0
287,200,-200.0
288,168,-168.0
289,173,-173.0
290,86,-86.0
291,157,-157.0
292,153,-153.0
293,86,-86.0
294,181,-181.0
295,151,-151.0
296,157,-157.0
297,160,-160.0
298,103,-103.0
299,147,-147.0
300,181,-181.0
301,158,-158.0
302,99,-99.0
303,158,-158.0
304,157,-157.0
305,152,-152.0
306,85,-85.0
307,85,-85.0
308,159,-159.0
309,87,-87.0
310,89,-89.0
311,175,-175.0
312,158,-158.0
313,154,-154.0
314,200,-200.0
315,95,-95.0
316,139,-139.0
317,200,-200.0
318,105,-105.0
319,163,-163.0
320,179,-179.0
321,176,-176.0
322,95,-95.0
323,85,-85.0
324,143,-143.0
325,148,-148.0
326,143,-143.0
327,170,-170.0
328,164,-164.0
329,139,-139.0
330,84,-84.0
331,86,-86.0
332,88,-88.0
333,163,-163.0
334,100,-100.0
335,174,-174.0
336,138,-138.0
337,154,-154.0
338,151,-151.0
339,157,-157.0
340,200,-200.0
341,147,-147.0
342,89,-89.0
343,94,-94.0
344,147,-147.0
345,147,-147.0
346,159,-159.0
347,84,-84.0
348,200,-200.0
349,150,-150.0
350,115,-115.0
351,150,-150.0
352,144,-144.0
353,83,-83.0
354,97,-97.0
355,150,-150.0
356,150,-150.0
357,159,-159.0
358,94,-94.0
359,143,-143.0
360,152,-152.0
361,142,-142.0
362,200,-200.0
363,145,-145.0
364,173,-173.0
365,158,-158.0
366,181,-181.0
367,96,-96.0
368,149,-149.0
369,147,-147.0
370,89,-89.0
371,110,-110.0
372,155,-155.0
373,153,-153.0
374,161,-161.0
375,151,-151.0
376,182,-182.0
377,152,-152.0
378,85,-85.0
379,157,-157.0
380,179,-179.0
381,150,-150.0
382,155,-155.0
383,185,-185.0
384,142,-142.0
385,86,-86.0
386,154,-154.0
387,104,-104.0
388,145,-145.0
389,114,-114.0
390,106,-106.0
391,114,-114.0
392,200,-200.0
393,140,-140.0
394,149,-149.0
395,156,-156.0
396,87,-87.0
397,89,-89.0
398,144,-144.0
399,118,-118.0
400,92,-92.0
401,159,-159.0
402,143,-143.0
403,165,-165.0
404,97,-97.0
405,161,-161.0
406,102,-102.0
407,143,-143.0
408,152,-152.0
409,162,-162.0
410,93,-93.0
411,166,-166.0
412,170,-170.0
413,165,-165.0
414,172,-172.0
415,161,-161.0
416,164,-164.0
417,162,-162.0
418,149,-149.0
419,149,-149.0
420,143,-143.0
421,159,-159.0
422,104,-104.0
423,157,-157.0
424,153,-153.0
425,86,-86.0
426,161,-161.0
427,148,-148.0
428,92,-92.0
429,84,-84.0
430,178,-178.0
431,151,-151.0
432,144,-144.0
433,148,-148.0
434,169,-169.0
435,105,-105.0
436,150,-150.0
437,139,-139.0
438,147,-147.0
439,85,-85.0
440,176,-176.0
441,89,-89.0
442,167,-167.0
443,97,-97.0
444,173,-173.0
445,153,-153.0
446,102,-102.0
447,154,-154.0
448,200,-200.0
449,150,-150.0
450,159,-159.0
451,163,-163.0
452,136,-136.0
453,155,-155.0
454,84,-84.0
455,89,-89.0
456,84,-84.0
457,86,-86.0
458,151,-151.0
459,148,-148.0
460,110,-110.0
461,143,-143.0
462,116,-116.0
463,109,-109.0
464,107,-107.0
465,154,-154.0
466,164,-164.0
467,147,-147.0
468,142,-142.0
469,138,-138.0
470,142,-142.0
471,94,-94.0
472,153,-153.0
473,144,-144.0
474,179,-179.0
475,160,-160.0
476,102,-102.0
477,157,-157.0
478,144,-144.0
479,88,-88.0
480,95,-95.0
481,143,-143.0
482,87,-87.0
483,145,-145.0
484,95,-95.0
485,155,-155.0
486,139,-139.0
487,140,-140.0
488,143,-143.0
489,152,-152.0
490,92,-92.0
491,149,-149.0
492,87,-87.0
493,143,-143.0
494,143,-143.0
495,145,-145.0
496,200,-200.0
497,96,-96.0
498,91,-91.0
499,158,-158.0
500,147,-147.0
501,108,-108.0
502,90,-90.0
503,152,-152.0
504,91,-91.0
505,139,-139.0
506,140,-140.0
507,90,-90.0
508,144,-144.0
509,154,-154.0
510,139,-139.0
511,147,-147.0
512,161,-161.0
513,147,-147.0
514,139,-139.0
515,91,-91.0
516,86,-86.0
517,144,-144.0
518,158,-158.0
519,90,-90.0
520,139,-139.0
521,118,-118.0
522,90,-90.0
523,113,-113.0
524,141,-141.0
525,152,-152.0
526,94,-94.0
527,147,-147.0
528,146,-146.0
529,161,-161.0
530,153,-153.0
531,156,-156.0
532,155,-155.0
533,150,-150.0
534,101,-101.0
535,94,-94.0
536,145,-145.0
537,139,-139.0
538,120,-120.0
539,85,-85.0
540,152,-152.0
541,84,-84.0
542,147,-147.0
543,150,-150.0
544,85,-85.0
545,123,-123.0
546,170,-170.0
547,157,-157.0
548,84,-84.0
549,165,-165.0
550,162,-162.0
551,145,-145.0
552,104,-104.0
553,88,-88.0
554,200,-200.0
555,139,-139.0
556,95,-95.0
557,143,-143.0
558,200,-200.0
559,105,-105.0
560,97,-97.0
561,148,-148.0
562,167,-167.0
563,140,-140.0
564,94,-94.0
565,159,-159.0
566,90,-90.0
567,147,-147.0
568,165,-165.0
569,148,-148.0
570,143,-143.0
571,144,-144.0
572,200,-200.0
573,146,-146.0
574,84,-84.0
575,150,-150.0
576,85,-85.0
577,151,-151.0
578,84,-84.0
579,152,-152.0
580,148,-148.0
581,90,-90.0
582,160,-160.0
583,91,-91.0
584,152,-152.0
585,107,-107.0
586,156,-156.0
587,92,-92.0
588,161,-161.0
589,189,-189.0
590,129,-129.0
591,133,-133.0
592,142,-142.0
593,159,-159.0
594,147,-147.0
595,152,-152.0
596,145,-145.0
597,141,-141.0
598,88,-88.0
599,160,-160.0
600,106,-106.0
601,146,-146.0
602,98,-98.0
603,148,-148.0
604,85,-85.0
605,142,-142.0
606,143,-143.0
607,149,-149.0
608,163,-163.0
609,109,-109.0
610,134,-134.0
611,86,-86.0
612,131,-131.0
613,146,-146.0
614,91,-91.0
615,108,-108.0
616,138,-138.0
617,161,-161.0
618,145,-145.0
619,89,-89.0
620,146,-146.0
621,139,-139.0
622,131,-131.0
623,89,-89.0
624,90,-90.0
625,165,-165.0
626,143,-143.0
627,168,-168.0
628,129,-129.0
629,90,-90.0
630,145,-145.0
631,145,-145.0
632,93,-93.0
633,104,-104.0
634,161,-161.0
635,92,-92.0
636,94,-94.0
637,167,-167.0
638,88,-88.0
639,152,-152.0
640,135,-135.0
641,90,-90.0
642,92,-92.0
643,91,-91.0
644,147,-147.0
645,101,-101.0
646,140,-140.0
647,145,-145.0
648,87,-87.0
649,96,-96.0
650,143,-143.0
651,145,-145.0
652,135,-135.0
653,154,-154.0
654,170,-170.0
655,87,-87.0
656,141,-141.0
657,103,-103.0
658,142,-142.0
659,144,-144.0
660,112,-112.0
661,169,-169.0
662,165,-165.0
663,149,-149.0
664,145,-145.0
665,86,-86.0
666,146,-146.0
667,162,-162.0
668,164,-164.0
669,141,-141.0
670,154,-154.0
671,87,-87.0
672,141,-141.0
673,143,-143.0
674,146,-146.0
675,87,-87.0
676,97,-97.0
677,142,-142.0
678,94,-94.0
679,166,-166.0
680,143,-143.0
681,87,-87.0
682,139,-139.0
683,164,-164.0
684,88,-88.0
685,140,-140.0
686,146,-146.0
687,147,-147.0
688,175,-175.0
689,200,-200.0
690,140,-140.0
691,89,-89.0
692,139,-139.0
693,142,-142.0
694,94,-94.0
695,100,-100.0
696,162,-162.0
697,144,-144.0
698,150,-150.0
699,137,-137.0
700,99,-99.0
701,137,-137.0
702,135,-135.0
703,140,-140.0
704,148,-148.0
705,144,-144.0
706,141,-141.0
707,139,-139.0
708,90,-90.0
709,152,-152.0
710,146,-146.0
711,142,-142.0
712,150,-150.0
713,144,-144.0
714,90,-90.0
715,93,-93.0
716,146,-146.0
717,145,-145.0
718,158,-158.0
719,146,-146.0
720,145,-145.0
721,142,-142.0
722,145,-145.0
723,144,-144.0
724,149,-149.0
725,155,-155.0
726,155,-155.0
727,151,-151.0
728,102,-102.0
729,188,-188.0
730,86,-86.0
731,140,-140.0
732,84,-84.0
733,147,-147.0
734,200,-200.0
735,189,-189.0
736,146,-146.0
737,151,-151.0
738,97,-97.0
739,200,-200.0
740,85,-85.0
741,97,-97.0
742,177,-177.0
743,141,-141.0
744,153,-153.0
745,140,-140.0
746,152,-152.0
747,139,-139.0
748,141,-141.0
749,142,-142.0
750,144,-144.0
751,137,-137.0
752,143,-143.0
753,146,-146.0
754,146,-146.0
755,149,-149.0
756,154,-154.0
757,200,-200.0
758,147,-147.0
759,156,-156.0
760,200,-200.0
761,200,-200.0
762,151,-151.0
763,97,-97.0
764,160,-160.0
765,200,-200.0
766,92,-92.0
767,153,-153.0
768,146,-146.0
769,200,-200.0
770,150,-150.0
771,150,-150.0
772,200,-200.0
773,149,-149.0
774,148,-148.0
775,200,-200.0
776,200,-200.0
777,156,-156.0
778,150,-150.0
779,144,-144.0
780,147,-147.0
781,147,-147.0
782,143,-143.0
783,153,-153.0
784,153,-153.0
785,158,-158.0
786,156,-156.0
787,149,-149.0
788,157,-157.0
789,160,-160.0
790,158,-158.0
791,159,-159.0
792,84,-84.0
793,92,-92.0
794,162,-162.0
795,148,-148.0
796,169,-169.0
797,142,-142.0
798,156,-156.0
799,200,-200.0
800,161,-161.0
801,200,-200.0
802,160,-160.0
803,173,-173.0
804,152,-152.0
805,90,-90.0
806,145,-145.0
807,148,-148.0
808,171,-171.0
809,151,-151.0
810,157,-157.0
811,146,-146.0
812,152,-152.0
813,151,-151.0
814,144,-144.0
815,99,-99.0
816,162,-162.0
817,153,-153.0
818,162,-162.0
819,152,-152.0
820,164,-164.0
821,146,-146.0
822,169,-169.0
823,156,-156.0
824,141,-141.0
825,160,-160.0
826,88,-88.0
827,167,-167.0
828,144,-144.0
829,148,-148.0
830,145,-145.0
831,173,-173.0
832,104,-104.0
833,161,-161.0
834,156,-156.0
835,125,-125.0
836,97,-97.0
837,100,-100.0
838,91,-91.0
839,158,-158.0
840,159,-159.0
841,150,-150.0
842,86,-86.0
843,85,-85.0
844,155,-155.0
845,162,-162.0
846,93,-93.0
847,150,-150.0
848,148,-148.0
849,155,-155.0
850,146,-146.0
851,87,-87.0
852,161,-161.0
853,89,-89.0
854,161,-161.0
855,93,-93.0
856,131,-131.0
857,146,-146.0
858,167,-167.0
859,123,-123.0
860,155,-155.0
861,150,-150.0
862,162,-162.0
863,159,-159.0
864,85,-85.0
865,200,-200.0
866,200,-200.0
867,183,-183.0
868,155,-155.0
869,170,-170.0
870,157,-157.0
871,200,-200.0
872,84,-84.0
873,200,-200.0
874,126,-126.0
875,152,-152.0
876,179,-179.0
877,200,-200.0
878,157,-157.0
879,107,-107.0
880,187,-187.0
881,178,-178.0
882,200,-200.0
883,163,-163.0
884,176,-176.0
885,171,-171.0
886,126,-126.0
887,88,-88.0
888,107,-107.0
889,180,-180.0
890,141,-141.0
891,141,-141.0
892,153,-153.0
893,88,-88.0
894,140,-140.0
895,114,-114.0
896,109,-109.0
897,99,-99.0
898,94,-94.0
899,148,-148.0
900,154,-154.0
901,147,-147.0
902,160,-160.0
903,172,-172.0
904,100,-100.0
905,150,-150.0
906,162,-162.0
907,89,-89.0
908,180,-180.0
909,84,-84.0
910,90,-90.0
911,172,-172.0
912,175,-175.0
913,112,-112.0
914,139,-139.0
915,145,-145.0
916,84,-84.0
917,158,-158.0
918,176,-176.0
919,160,-160.0
920,115,-115.0
921,200,-200.0
922,136,-136.0
923,173,-173.0
924,139,-139.0
925,86,-86.0
926,200,-200.0
927,143,-143.0
928,150,-150.0
929,137,-137.0
930,118,-118.0
931,100,-100.0
932,200,-200.0
933,152,-152.0
934,136,-136.0
935,139,-139.0
936,129,-129.0
937,171,-171.0
938,148,-148.0
939,153,-153.0
940,136,-136.0
941,91,-91.0
942,131,-131.0
943,145,-145.0
944,139,-139.0
945,156,-156.0
946,130,-130.0
947,120,-120.0
948,170,-170.0
949,161,-161.0
950,99,-99.0
951,138,-138.0
952,185,-185.0
953,200,-200.0
954,142,-142.0
955,146,-146.0
956,90,-90.0
957,141,-141.0
958,159,-159.0
959,95,-95.0
960,154,-154.0
961,200,-200.0
962,155,-155.0
963,93,-93.0
964,143,-143.0
965,144,-144.0
966,118,-118.0
967,141,-141.0
968,141,-141.0
969,165,-165.0
970,87,-87.0
971,114,-114.0
972,93,-93.0
973,148,-148.0
974,144,-144.0
975,163,-163.0
976,110,-110.0
977,175,-175.0
978,149,-149.0
979,94,-94.0
980,151,-151.0
981,124,-124.0
982,155,-155.0
983,110,-110.0
984,144,-144.0
985,87,-87.0
986,102,-102.0
987,126,-126.0
988,156,-156.0
989,103,-103.0
990,141,-141.0
991,88,-88.0
992,145,-145.0
993,113,-113.0
994,153,-153.0
995,154,-154.0
996,92,-92.0
997,93,-93.0
998,144,-144.0
999,112,-112.0
1000,93,-93.0
1001,158,-158.0
1002,151,-151.0
1003,158,-158.0
1004,148,-148.0
1005,200,-200.0
1006,110,-110.0
1007,90,-90.0
1008,91,-91.0
1009,88,-88.0
1010,148,-148.0
1011,131,-131.0
1012,200,-200.0
1013,177,-177.0
1014,184,-184.0
1015,169,-169.0
1016,149,-149.0
1017,137,-137.0
1018,170,-170.0
1019,86,-86.0
1020,96,-96.0
1021,97,-97.0
1022,86,-86.0
1023,152,-152.0
1024,143,-143.0
1025,149,-149.0
1026,160,-160.0
1027,186,-186.0
1028,149,-149.0
1029,147,-147.0
1030,160,-160.0
1031,111,-111.0
1032,126,-126.0
1033,88,-88.0
1034,160,-160.0
1035,163,-163.0
1036,146,-146.0
1037,174,-174.0
1038,140,-140.0
1039,165,-165.0
1040,100,-100.0
1041,150,-150.0
1042,89,-89.0
1043,148,-148.0
1044,163,-163.0
1045,151,-151.0
1046,152,-152.0
1047,143,-143.0
1048,171,-171.0
1049,90,-90.0
1050,144,-144.0
1051,157,-157.0
1052,96,-96.0
1053,113,-113.0
1054,110,-110.0
1055,159,-159.0
1056,146,-146.0
1057,154,-154.0
1058,89,-89.0
1059,147,-147.0
1060,179,-179.0
1061,150,-150.0
1062,143,-143.0
1063,147,-147.0
1064,152,-152.0
1065,191,-191.0
1066,139,-139.0
1067,170,-170.0
1068,144,-144.0
1069,142,-142.0
1070,132,-132.0
1071,178,-178.0
1072,143,-143.0
1073,108,-108.0
1074,101,-101.0
1075,93,-93.0
1076,148,-148.0
1077,85,-85.0
1078,144,-144.0
1079,135,-135.0
1080,140,-140.0
1081,139,-139.0
1082,87,-87.0
1083,83,-83.0
1084,176,-176.0
1085,139,-139.0
1086,98,-98.0
1087,98,-98.0
1088,142,-142.0
1089,90,-90.0
1090,177,-177.0
1091,148,-148.0
1092,127,-127.0
1093,106,-106.0
1094,91,-91.0
1095,150,-150.0
1096,128,-128.0
1097,134,-134.0
1098,115,-115.0
1099,157,-157.0
1100,95,-95.0
1101,166,-166.0
1102,105,-105.0
1103,153,-153.0
1104,92,-92.0
1105,97,-97.0
1106,156,-156.0
1107,161,-161.0
1108,159,-159.0
1109,116,-116.0
1110,110,-110.0
1111,123,-123.0
1112,156,-156.0
1113,156,-156.0
1114,91,-91.0
1115,146,-146.0
1116,160,-160.0
1117,172,-172.0
1118,157,-157.0
1119,175,-175.0
1120,99,-99.0
1121,91,-91.0
1122,100,-100.0
1123,148,-148.0
1124,91,-91.0
1125,94,-94.0
1126,157,-157.0
1127,167,-167.0
1128,151,-151.0
1129,153,-153.0
1130,150,-150.0
1131,156,-156.0
1132,155,-155.0
1133,144,-144.0
1134,123,-123.0
1135,154,-154.0
1136,171,-171.0
1137,100,-100.0
1138,153,-153.0
1139,111,-111.0
1140,156,-156.0
1141,161,-161.0
1142,153,-153.0
1143,154,-154.0
1144,153,-153.0
1145,152,-152.0
1146,90,-90.0
1147,88,-88.0
1148,158,-158.0
1149,92,-92.0
1150,171,-171.0
1151,86,-86.0
1152,103,-103.0
1153,147,-147.0
1154,160,-160.0
1155,158,-158.0
1156,90,-90.0
1157,163,-163.0
1158,152,-152.0
1159,164,-164.0
1160,157,-157.0
1161,111,-111.0
1162,142,-142.0
1163,98,-98.0
1164,164,-164.0
1165,86,-86.0
1166,91,-91.0
1167,116,-116.0
1168,200,-200.0
1169,200,-200.0
1170,148,-148.0
1171,200,-200.0
1172,200,-200.0
1173,90,-90.0
1174,89,-89.0
1175,90,-90.0
1176,200,-200.0
1177,155,-155.0
1178,200,-200.0
1179,200,-200.0
1180,200,-200.0
1181,200,-200.0
1182,200,-200.0
1183,200,-200.0
1184,157,-157.0
1185,167,-167.0
1186,167,-167.0
1187,200,-200.0
1188,161,-161.0
1189,200,-200.0
1190,200,-200.0
1191,200,-200.0
1192,200,-200.0
1193,200,-200.0
1194,151,-151.0
1195,156,-156.0
1196,85,-85.0
1197,85,-85.0
1198,200,-200.0
1199,105,-105.0
1200,108,-108.0
1201,158,-158.0
1202,200,-200.0
1203,181,-181.0
1204,85,-85.0
1205,200,-200.0
1206,200,-200.0
1207,85,-85.0
1208,200,-200.0
1209,97,-97.0
1210,107,-107.0
1211,154,-154.0
1212,181,-181.0
1213,147,-147.0
1214,200,-200.0
1215,200,-200.0
1216,200,-200.0
1217,100,-100.0
1218,161,-161.0
1219,109,-109.0
1220,94,-94.0
1221,177,-177.0
1222,200,-200.0
1223,109,-109.0
1224,127,-127.0
1225,86,-86.0
1226,96,-96.0
1227,155,-155.0
1228,101,-101.0
1229,200,-200.0
1230,110,-110.0
1231,200,-200.0
1232,97,-97.0
1233,166,-166.0
1234,200,-200.0
1235,157,-157.0
1236,200,-200.0
1237,161,-161.0
1238,138,-138.0
1239,200,-200.0
1240,161,-161.0
1241,98,-98.0
1242,93,-93.0
1243,200,-200.0
1244,169,-169.0
1245,167,-167.0
1246,200,-200.0
1247,200,-200.0
1248,183,-183.0
1249,184,-184.0
1250,200,-200.0
1251,166,-166.0
1252,200,-200.0
1253,117,-117.0
1254,103,-103.0
1255,154,-154.0
1256,157,-157.0
1257,157,-157.0
1258,85,-85.0
1259,154,-154.0
1260,161,-161.0
1261,163,-163.0
1262,171,-171.0
1263,164,-164.0
1264,159,-159.0
1265,154,-154.0
1266,173,-173.0
1267,95,-95.0
1268,166,-166.0
1269,200,-200.0
1270,89,-89.0
1271,185,-185.0
1272,161,-161.0
1273,150,-150.0
1274,150,-150.0
1275,162,-162.0
1276,123,-123.0
1277,200,-200.0
1278,200,-200.0
1279,98,-98.0
1280,147,-147.0
1281,94,-94.0
1282,150,-150.0
1283,178,-178.0
1284,200,-200.0
1285,200,-200.0
1286,87,-87.0
1287,146,-146.0
1288,164,-164.0
1289,119,-119.0
1290,200,-200.0
1291,159,-159.0
1292,105,-105.0
1293,176,-176.0
1294,188,-188.0
1295,156,-156.0
1296,158,-158.0
1297,155,-155.0
1298,91,-91.0
1299,163,-163.0
1300,147,-147.0
1301,153,-153.0
1302,160,-160.0
1303,145,-145.0
1304,167,-167.0
1305,168,-168.0
1306,153,-153.0
1307,93,-93.0
1308,116,-116.0
1309,94,-94.0
1310,84,-84.0
1311,161,-161.0
1312,164,-164.0
1313,94,-94.0
1314,191,-191.0
1315,91,-91.0
1316,114,-114.0
1317,151,-151.0
1318,93,-93.0
1319,88,-88.0
1320,96,-96.0
1321,147,-147.0
1322,160,-160.0
1323,172,-172.0
1324,101,-101.0
1325,171,-171.0
1326,158,-158.0
1327,200,-200.0
1328,101,-101.0
1329,155,-155.0
1330,143,-143.0
1331,96,-96.0
1332,137,-137.0
1333,153,-153.0
1334,106,-106.0
1335,163,-163.0
1336,100,-100.0
1337,151,-151.0
1338,121,-121.0
1339,153,-153.0
1340,161,-161.0
1341,145,-145.0
1342,115,-115.0
1343,200,-200.0
1344,200,-200.0
1345,111,-111.0
1346,147,-147.0
1347,164,-164.0
1348,156,-156.0
1349,101,-101.0
1350,143,-143.0
1351,154,-154.0
1352,86,-86.0
1353,160,-160.0
1354,155,-155.0
1355,110,-110.0
1356,159,-159.0
1357,153,-153.0
1358,152,-152.0
1359,88,-88.0
1360,85,-85.0
1361,94,-94.0
1362,200,-200.0
1363,166,-166.0
1364,149,-149.0
1365,174,-174.0
1366,148,-148.0
1367,200,-200.0
1368,200,-200.0
1369,200,-200.0
1370,155,-155.0
1371,160,-160.0
1372,152,-152.0
1373,200,-200.0
1374,200,-200.0
1375,200,-200.0
1376,192,-192.0
1377,144,-144.0
1378,150,-150.0
1379,177,-177.0
1380,188,-188.0
1381,147,-147.0
1382,143,-143.0
1383,185,-185.0
1384,162,-162.0
1385,200,-200.0
1386,150,-150.0
1387,176,-176.0
1388,162,-162.0
1389,102,-102.0
1390,152,-152.0
1391,187,-187.0
1392,171,-171.0
1393,126,-126.0
1394,145,-145.0
1395,113,-113.0
1396,118,-118.0
1397,166,-166.0
1398,120,-120.0
1399,127,-127.0
1400,159,-159.0
1401,200,-200.0
1402,200,-200.0
1403,119,-119.0
1404,172,-172.0
1405,149,-149.0
1406,124,-124.0
1407,111,-111.0
1408,175,-175.0
1409,115,-115.0
1410,130,-130.0
1411,90,-90.0
1412,120,-120.0
1413,169,-169.0
1414,88,-88.0
1415,115,-115.0
1416,120,-120.0
1417,200,-200.0
1418,154,-154.0
1419,175,-175.0
1420,170,-170.0
1421,150,-150.0
1422,171,-171.0
1423,174,-174.0
1424,166,-166.0
1425,200,-200.0
1426,200,-200.0
1427,119,-119.0
1428,200,-200.0
1429,152,-152.0
1430,183,-183.0
1431,124,-124.0
1432,200,-200.0
1433,196,-196.0
1434,156,-156.0
1435,150,-150.0
1436,200,-200.0
1437,114,-114.0
1438,156,-156.0
1439,157,-157.0
1440,156,-156.0
1441,109,-109.0
1442,200,-200.0
1443,125,-125.0
1444,124,-124.0
1445,197,-197.0
1446,181,-181.0
1447,154,-154.0
1448,200,-200.0
1449,146,-146.0
1450,200,-200.0
1451,162,-162.0
1452,127,-127.0
1453,200,-200.0
1454,104,-104.0
1455,95,-95.0
1456,200,-200.0
1457,200,-200.0
1458,136,-136.0
1459,115,-115.0
1460,151,-151.0
1461,200,-200.0
1462,136,-136.0
1463,158,-158.0
1464,158,-158.0
1465,87,-87.0
1466,165,-165.0
1467,200,-200.0
1468,93,-93.0
1469,145,-145.0
1470,175,-175.0
1471,151,-151.0
1472,148,-148.0
1473,161,-161.0
1474,128,-128.0
1475,92,-92.0
1476,116,-116.0
1477,171,-171.0
1478,159,-159.0
1479,200,-200.0
1480,88,-88.0
1481,163,-163.0
1482,174,-174.0
1483,165,-165.0
1484,158,-158.0
1485,154,-154.0
1486,165,-165.0
1487,200,-200.0
1488,119,-119.0
1489,152,-152.0
1490,200,-200.0
1491,145,-145.0
1492,151,-151.0
1493,154,-154.0
1494,155,-155.0
1495,150,-150.0
1496,156,-156.0
1497,132,-132.0
1498,145,-145.0
1499,173,-173.0
1500,163,-163.0
1501,141,-141.0
1502,90,-90.0
1503,136,-136.0
1504,173,-173.0
1505,140,-140.0
1506,126,-126.0
1507,160,-160.0
1508,142,-142.0
1509,143,-143.0
1510,88,-88.0
1511,142,-142.0
1512,156,-156.0
1513,157,-157.0
1514,156,-156.0
1515,158,-158.0
1516,193,-193.0
1517,182,-182.0
1518,118,-118.0
1519,134,-134.0
1520,119,-119.0
1521,147,-147.0
1522,157,-157.0
1523,140,-140.0
1524,152,-152.0
1525,151,-151.0
1526,144,-144.0
1527,150,-150.0
1528,142,-142.0
1529,152,-152.0
1530,148,-148.0
1531,139,-139.0
1532,93,-93.0
1533,177,-177.0
1534,162,-162.0
1535,155,-155.0
1536,156,-156.0
1537,138,-138.0
1538,144,-144.0
1539,138,-138.0
1540,98,-98.0
1541,153,-153.0
1542,146,-146.0
1543,148,-148.0
1544,140,-140.0
1545,155,-155.0
1546,85,-85.0
1547,148,-148.0
1548,182,-182.0
1549,125,-125.0
1550,97,-97.0
1551,117,-117.0
1552,150,-150.0
1553,146,-146.0
1554,155,-155.0
1555,144,-144.0
1556,145,-145.0
1557,140,-140.0
1558,151,-151.0
1559,200,-200.0
1560,88,-88.0
1561,85,-85.0
1562,121,-121.0
1563,177,-177.0
1564,85,-85.0
1565,146,-146.0
1566,151,-151.0
1567,200,-200.0
1568,190,-190.0
1569,94,-94.0
1570,174,-174.0
1571,162,-162.0
1572,152,-152.0
1573,150,-150.0
1574,168,-168.0
1575,158,-158.0
1576,166,-166.0
1577,146,-146.0
1578,176,-176.0
1579,163,-163.0
1580,101,-101.0
1581,144,-144.0
1582,147,-147.0
1583,101,-101.0
1584,197,-197.0
1585,200,-200.0
1586,200,-200.0
1587,200,-200.0
1588,162,-162.0
1589,154,-154.0
1590,149,-149.0
1591,200,-200.0
1592,147,-147.0
1593,90,-90.0
1594,200,-200.0
1595,167,-167.0
1596,143,-143.0
1597,86,-86.0
1598,143,-143.0
1599,159,-159.0
1600,156,-156.0
1601,200,-200.0
1602,150,-150.0
1603,119,-119.0
1604,200,-200.0
1605,151,-151.0
1606,200,-200.0
1607,96,-96.0
1608,176,-176.0
1609,98,-98.0
1610,144,-144.0
1611,151,-151.0
1612,104,-104.0
1613,156,-156.0
1614,200,-200.0
1615,200,-200.0
1616,183,-183.0
1617,158,-158.0
1618,105,-105.0
1619,155,-155.0
1620,200,-200.0
1621,91,-91.0
1622,200,-200.0
1623,200,-200.0
1624,200,-200.0
1625,200,-200.0
1626,171,-171.0
1627,89,-89.0
1628,106,-106.0
1629,200,-200.0
1630,150,-150.0
1631,200,-200.0
1632,105,-105.0
1633,102,-102.0
1634,94,-94.0
1635,200,-200.0
1636,153,-153.0
1637,91,-91.0
1638,152,-152.0
1639,167,-167.0
1640,100,-100.0
1641,121,-121.0
1642,200,-200.0
1643,189,-189.0
1644,200,-200.0
1645,111,-111.0
1646,107,-107.0
1647,149,-149.0
1648,148,-148.0
1649,160,-160.0
1650,200,-200.0
1651,90,-90.0
1652,145,-145.0
1653,89,-89.0
1654,86,-86.0
1655,158,-158.0
1656,85,-85.0
1657,200,-200.0
1658,102,-102.0
1659,107,-107.0
1660,200,-200.0
1661,152,-152.0
1662,183,-183.0
1663,133,-133.0
1664,200,-200.0
1665,98,-98.0
1666,111,-111.0
1667,200,-200.0
1668,96,-96.0
1669,147,-147.0
1670,127,-127.0
1671,169,-169.0
1672,147,-147.0
1673,200,-200.0
1674,162,-162.0
1675,175,-175.0
1676,157,-157.0
1677,163,-163.0
1678,151,-151.0
1679,146,-146.0
1680,109,-109.0
1681,200,-200.0
1682,200,-200.0
1683,200,-200.0
1684,156,-156.0
1685,200,-200.0
1686,139,-139.0
1687,105,-105.0
1688,146,-146.0
1689,149,-149.0
1690,170,-170.0
1691,90,-90.0
1692,128,-128.0
1693,86,-86.0
1694,154,-154.0
1695,111,-111.0
1696,150,-150.0
1697,200,-200.0
1698,95,-95.0
1699,149,-149.0
1700,94,-94.0
1701,200,-200.0
1702,140,-140.0
1703,96,-96.0
1704,155,-155.0
1705,106,-106.0
1706,121,-121.0
1707,114,-114.0
1708,157,-157.0
1709,200,-200.0
1710,151,-151.0
1711,158,-158.0
1712,127,-127.0
1713,152,-152.0
1714,89,-89.0
1715,159,-159.0
1716,106,-106.0
1717,146,-146.0
1718,148,-148.0
1719,179,-179.0
1720,176,-176.0
1721,163,-163.0
1722,173,-173.0
1723,175,-175.0
1724,156,-156.0
1725,144,-144.0
1726,148,-148.0
1727,111,-111.0
1728,90,-90.0
1729,170,-170.0
1730,165,-165.0
1731,150,-150.0
1732,193,-193.0
1733,161,-161.0
1734,144,-144.0
1735,168,-168.0
1736,114,-114.0
1737,148,-148.0
1738,141,-141.0
1739,88,-88.0
1740,85,-85.0
1741,173,-173.0
1742,91,-91.0
1743,144,-144.0
1744,106,-106.0
1745,146,-146.0
1746,200,-200.0
1747,172,-172.0
1748,102,-102.0
1749,200,-200.0
1750,171,-171.0
1751,109,-109.0
1752,124,-124.0
1753,101,-101.0
1754,102,-102.0
1755,116,-116.0
1756,145,-145.0
1757,122,-122.0
1758,123,-123.0
1759,200,-200.0
1760,140,-140.0
1761,142,-142.0
1762,164,-164.0
1763,104,-104.0
1764,149,-149.0
1765,142,-142.0
1766,103,-103.0
1767,109,-109.0
1768,95,-95.0
1769,146,-146.0
1770,85,-85.0
1771,144,-144.0
1772,107,-107.0
1773,104,-104.0
1774,99,-99.0
1775,98,-98.0
1776,145,-145.0
1777,161,-161.0
1778,115,-115.0
1779,98,-98.0
1780,89,-89.0
1781,147,-147.0
1782,200,-200.0
1783,142,-142.0
1784,149,-149.0
1785,157,-157.0
1786,194,-194.0
1787,157,-157.0
1788,200,-200.0
1789,200,-200.0
1790,89,-89.0
1791,145,-145.0
1792,143,-143.0
1793,148,-148.0
1794,97,-97.0
1795,119,-119.0
1796,84,-84.0
1797,152,-152.0
1798,147,-147.0
1799,168,-168.0
1800,91,-91.0
1801,89,-89.0
1802,163,-163.0
1803,105,-105.0
1804,151,-151.0
1805,144,-144.0
1806,101,-101.0
1807,162,-162.0
1808,111,-111.0
1809,95,-95.0
1810,200,-200.0
1811,90,-90.0
1812,156,-156.0
1813,95,-95.0
1814,111,-111.0
1815,145,-145.0
1816,99,-99.0
1817,150,-150.0
1818,144,-144.0
1819,105,-105.0
1820,120,-120.0
1821,113,-113.0
1822,97,-97.0
1823,89,-89.0
1824,99,-99.0
1825,96,-96.0
1826,86,-86.0
1827,94,-94.0
1828,96,-96.0
1829,169,-169.0
1830,142,-142.0
1831,103,-103.0
1832,100,-100.0
1833,146,-146.0
1834,150,-150.0
1835,142,-142.0
1836,163,-163.0
1837,103,-103.0
1838,148,-148.0
1839,91,-91.0
1840,108,-108.0
1841,86,-86.0
1842,110,-110.0
1843,145,-145.0
1844,92,-92.0
1845,88,-88.0
1846,104,-104.0
1847,145,-145.0
1848,148,-148.0
1849,161,-161.0
1850,168,-168.0
1851,105,-105.0
1852,114,-114.0
1853,148,-148.0
1854,91,-91.0
1855,84,-84.0
1856,111,-111.0
1857,101,-101.0
1858,90,-90.0
1859,103,-103.0
1860,107,-107.0
1861,182,-182.0
1862,200,-200.0
1863,87,-87.0
1864,102,-102.0
1865,200,-200.0
1866,114,-114.0
1867,147,-147.0
1868,162,-162.0
1869,85,-85.0
1870,106,-106.0
1871,110,-110.0
1872,151,-151.0
1873,200,-200.0
1874,103,-103.0
1875,160,-160.0
1876,162,-162.0
1877,113,-113.0
1878,113,-113.0
1879,108,-108.0
1880,90,-90.0
1881,145,-145.0
1882,150,-150.0
1883,163,-163.0
1884,110,-110.0
1885,143,-143.0
1886,171,-171.0
1887,156,-156.0
1888,112,-112.0
1889,88,-88.0
1890,157,-157.0
1891,140,-140.0
1892,107,-107.0
1893,141,-141.0
1894,105,-105.0
1895,140,-140.0
1896,142,-142.0
1897,108,-108.0
1898,200,-200.0
1899,146,-146.0
1900,105,-105.0
1901,139,-139.0
1902,147,-147.0
1903,107,-107.0
1904,167,-167.0
1905,137,-137.0
1906,149,-149.0
1907,162,-162.0
1908,94,-94.0
1909,96,-96.0
1910,160,-160.0
1911,174,-174.0
1912,139,-139.0
1913,137,-137.0
1914,164,-164.0
1915,170,-170.0
1916,91,-91.0
1917,143,-143.0
1918,155,-155.0
1919,85,-85.0
1920,168,-168.0
1921,154,-154.0
1922,145,-145.0
1923,173,-173.0
1924,138,-138.0
1925,145,-145.0
1926,155,-155.0
1927,144,-144.0
1928,139,-139.0
1929,143,-143.0
1930,138,-138.0
1931,160,-160.0
1932,89,-89.0
1933,148,-148.0
1934,155,-155.0
1935,152,-152.0
1936,146,-146.0
1937,143,-143.0
1938,161,-161.0
1939,159,-159.0
1940,143,-143.0
1941,142,-142.0
1942,150,-150.0
1943,139,-139.0
1944,89,-89.0
1945,141,-141.0
1946,170,-170.0
1947,152,-152.0
1948,170,-170.0
1949,145,-145.0
1950,87,-87.0
1951,159,-159.0
1952,110,-110.0
1953,149,-149.0
1954,91,-91.0
1955,151,-151.0
1956,141,-141.0
1957,141,-141.0
1958,200,-200.0
1959,148,-148.0
1960,132,-132.0
1961,200,-200.0
1962,109,-109.0
1963,137,-137.0
1964,139,-139.0
1965,143,-143.0
1966,142,-142.0
1967,166,-166.0
1968,96,-96.0
1969,143,-143.0
1970,88,-88.0
1971,158,-158.0
1972,173,-173.0
1973,146,-146.0
1974,88,-88.0
1975,146,-146.0
1976,149,-149.0
1977,95,-95.0
1978,163,-163.0
1979,145,-145.0
1980,85,-85.0
1981,144,-144.0
1982,151,-151.0
1983,162,-162.0
1984,144,-144.0
1985,88,-88.0
1986,142,-142.0
1987,139,-139.0
1988,149,-149.0
1989,139,-139.0
1990,136,-136.0
1991,142,-142.0
1992,154,-154.0
1993,149,-149.0
1994,142,-142.0
1995,117,-117.0
1996,164,-164.0
1997,117,-117.0
1998,136,-136.0
1999,171,-171.0
2000,144,-144.0
2001,200,-200.0
2002,92,-92.0
2003,176,-176.0
2004,174,-174.0
2005,166,-166.0
2006,123,-123.0
2007,135,-135.0
2008,153,-153.0
2009,125,-125.0
2010,194,-194.0
2011,126,-126.0
2012,110,-110.0
2013,132,-132.0
2014,200,-200.0
2015,200,-200.0
2016,200,-200.0
2017,200,-200.0
2018,200,-200.0
2019,200,-200.0
2020,200,-200.0
2021,200,-200.0
2022,200,-200.0
2023,200,-200.0
2024,200,-200.0
2025,114,-114.0
2026,200,-200.0
2027,130,-130.0
2028,200,-200.0
2029,200,-200.0
2030,148,-148.0
2031,200,-200.0
2032,200,-200.0
2033,165,-165.0
2034,200,-200.0
2035,200,-200.0
2036,200,-200.0
2037,200,-200.0
2038,200,-200.0
2039,200,-200.0
2040,200,-200.0
2041,200,-200.0
2042,163,-163.0
2043,155,-155.0
2044,200,-200.0
2045,200,-200.0
2046,187,-187.0
2047,200,-200.0
2048,200,-200.0
2049,119,-119.0
2050,200,-200.0
2051,120,-120.0
2052,186,-186.0
2053,172,-172.0
2054,114,-114.0
2055,135,-135.0
2056,115,-115.0
2057,196,-196.0
2058,113,-113.0
2059,114,-114.0
2060,163,-163.0
2061,180,-180.0
2062,161,-161.0
2063,158,-158.0
2064,159,-159.0
2065,151,-151.0
2066,154,-154.0
2067,157,-157.0
2068,198,-198.0
2069,109,-109.0
2070,136,-136.0
2071,117,-117.0
2072,133,-133.0
2073,165,-165.0
2074,200,-200.0
2075,200,-200.0
2076,200,-200.0
2077,200,-200.0
2078,200,-200.0
2079,200,-200.0
2080,200,-200.0
2081,105,-105.0
2082,186,-186.0
2083,111,-111.0
2084,114,-114.0
2085,179,-179.0
2086,200,-200.0
2087,200,-200.0
2088,200,-200.0
2089,189,-189.0
2090,188,-188.0
2091,169,-169.0
2092,195,-195.0
2093,200,-200.0
2094,200,-200.0
2095,176,-176.0
2096,165,-165.0
2097,154,-154.0
2098,187,-187.0
2099,179,-179.0
2100,200,-200.0
