episodes,steps,rewards
0,200,-200.0
1,200,-200.0
2,200,-200.0
3,200,-200.0
4,200,-200.0
5,200,-200.0
6,200,-200.0
7,148,-148.0
8,140,-140.0
9,200,-200.0
10,200,-200.0
11,189,-189.0
12,119,-119.0
13,125,-125.0
14,200,-200.0
15,190,-190.0
16,200,-200.0
17,200,-200.0
18,200,-200.0
19,200,-200.0
20,200,-200.0
21,200,-200.0
22,200,-200.0
23,200,-200.0
24,200,-200.0
25,200,-200.0
26,200,-200.0
27,127,-127.0
28,200,-200.0
29,200,-200.0
30,199,-199.0
31,200,-200.0
32,159,-159.0
33,200,-200.0
34,169,-169.0
35,117,-117.0
36,200,-200.0
37,200,-200.0
38,161,-161.0
39,182,-182.0
40,200,-200.0
41,200,-200.0
42,200,-200.0
43,142,-142.0
44,106,-106.0
45,197,-197.0
46,182,-182.0
47,171,-171.0
48,151,-151.0
49,200,-200.0
50,88,-88.0
51,163,-163.0
52,200,-200.0
53,200,-200.0
54,200,-200.0
55,158,-158.0
56,151,-151.0
57,188,-188.0
58,171,-171.0
59,159,-159.0
60,160,-160.0
61,156,-156.0
62,200,-200.0
63,145,-145.0
64,189,-189.0
65,199,-199.0
66,170,-170.0
67,168,-168.0
68,109,-109.0
69,143,-143.0
70,175,-175.0
71,153,-153.0
72,154,-154.0
73,156,-156.0
74,161,-161.0
75,148,-148.0
76,138,-138.0
77,139,-139.0
78,138,-138.0
79,153,-153.0
80,176,-176.0
81,139,-139.0
82,146,-146.0
83,170,-170.0
84,140,-140.0
85,172,-172.0
86,151,-151.0
87,145,-145.0
88,200,-200.0
89,200,-200.0
90,152,-152.0
91,169,-169.0
92,142,-142.0
93,200,-200.0
94,189,-189.0
95,157,-157.0
96,147,-147.0
97,144,-144.0
98,194,-194.0
99,139,-139.0
100,159,-159.0
101,135,-135.0
102,104,-104.0
103,107,-107.0
104,131,-131.0
105,141,-141.0
106,176,-176.0
107,85,-85.0
108,161,-161.0
109,136,-136.0
110,145,-145.0
111,167,-167.0
112,159,-159.0
113,157,-157.0
114,107,-107.0
115,132,-132.0
116,158,-158.0
117,110,-110.0
118,112,-112.0
119,132,-132.0
120,122,-122.0
121,156,-156.0
122,90,-90.0
123,106,-106.0
124,139,-139.0
125,150,-150.0
126,200,-200.0
127,163,-163.0
128,146,-146.0
129,140,-140.0
130,158,-158.0
131,117,-117.0
132,106,-106.0
133,90,-90.0
134,134,-134.0
135,118,-118.0
136,90,-90.0
137,145,-145.0
138,154,-154.0
139,137,-137.0
140,102,-102.0
141,155,-155.0
142,151,-151.0
143,154,-154.0
144,151,-151.0
145,139,-139.0
146,159,-159.0
147,112,-112.0
148,200,-200.0
149,164,-164.0
150,114,-114.0
151,162,-162.0
152,86,-86.0
153,86,-86.0
154,185,-185.0
155,105,-105.0
156,149,-149.0
157,142,-142.0
158,85,-85.0
159,141,-141.0
160,110,-110.0
161,169,-169.0
162,136,-136.0
163,107,-107.0
164,126,-126.0
165,154,-154.0
166,164,-164.0
167,154,-154.0
168,93,-93.0
169,156,-156.0
170,103,-103.0
171,107,-107.0
172,143,-143.0
173,96,-96.0
174,137,-137.0
175,106,-106.0
176,89,-89.0
177,158,-158.0
178,138,-138.0
179,90,-90.0
180,163,-163.0
181,138,-138.0
182,100,-100.0
183,168,-168.0
184,149,-149.0
185,101,-101.0
186,109,-109.0
187,152,-152.0
188,154,-154.0
189,140,-140.0
190,93,-93.0
191,150,-150.0
192,137,-137.0
193,162,-162.0
194,160,-160.0
195,104,-104.0
196,139,-139.0
197,97,-97.0
198,143,-143.0
199,168,-168.0
200,140,-140.0
201,156,-156.0
202,129,-129.0
203,85,-85.0
204,143,-143.0
205,146,-146.0
206,105,-105.0
207,87,-87.0
208,138,-138.0
209,89,-89.0
210,164,-164.0
211,115,-115.0
212,94,-94.0
213,148,-148.0
214,90,-90.0
215,174,-174.0
216,98,-98.0
217,137,-137.0
218,147,-147.0
219,148,-148.0
220,138,-138.0
221,150,-150.0
222,148,-148.0
223,179,-179.0
224,92,-92.0
225,114,-114.0
226,117,-117.0
227,142,-142.0
228,117,-117.0
229,106,-106.0
230,148,-148.0
231,144,-144.0
232,143,-143.0
233,139,-139.0
234,147,-147.0
235,90,-90.0
236,145,-145.0
237,146,-146.0
238,96,-96.0
239,110,-110.0
240,113,-113.0
241,142,-142.0
242,161,-161.0
243,94,-94.0
244,129,-129.0
245,87,-87.0
246,148,-148.0
247,192,-192.0
248,153,-153.0
249,129,-129.0
250,144,-144.0
251,91,-91.0
252,200,-200.0
253,89,-89.0
254,189,-189.0
255,142,-142.0
256,143,-143.0
257,142,-142.0
258,89,-89.0
259,104,-104.0
260,136,-136.0
261,150,-150.0
262,142,-142.0
263,143,-143.0
264,104,-104.0
265,144,-144.0
266,88,-88.0
267,170,-170.0
268,146,-146.0
269,88,-88.0
270,145,-145.0
271,102,-102.0
272,145,-145.0
273,174,-174.0
274,170,-170.0
275,145,-145.0
276,95,-95.0
277,150,-150.0
278,146,-146.0
279,136,-136.0
280,93,-93.0
281,89,-89.0
282,138,-138.0
283,150,-150.0
284,144,-144.0
285,144,-144.0
286,84,-84.0
287,147,-147.0
288,146,-146.0
289,90,-90.0
290,143,-143.0
291,84,-84.0
292,145,-145.0
293,101,-101.0
294,91,-91.0
295,87,-87.0
296,144,-144.0
297,147,-147.0
298,86,-86.0
299,95,-95.0
300,147,-147.0
301,94,-94.0
302,154,-154.0
303,91,-91.0
304,83,-83.0
305,144,-144.0
306,147,-147.0
307,150,-150.0
308,86,-86.0
309,100,-100.0
310,146,-146.0
311,140,-140.0
312,85,-85.0
313,86,-86.0
314,143,-143.0
315,90,-90.0
316,141,-141.0
317,92,-92.0
318,85,-85.0
319,171,-171.0
320,180,-180.0
321,94,-94.0
322,90,-90.0
323,147,-147.0
324,144,-144.0
325,104,-104.0
326,174,-174.0
327,133,-133.0
328,178,-178.0
329,147,-147.0
330,86,-86.0
331,146,-146.0
332,148,-148.0
333,146,-146.0
334,147,-147.0
335,85,-85.0
336,154,-154.0
337,143,-143.0
338,149,-149.0
339,87,-87.0
340,92,-92.0
341,148,-148.0
342,145,-145.0
343,147,-147.0
344,143,-143.0
345,94,-94.0
346,103,-103.0
347,114,-114.0
348,143,-143.0
349,150,-150.0
350,153,-153.0
351,91,-91.0
352,145,-145.0
353,112,-112.0
354,149,-149.0
355,146,-146.0
356,90,-90.0
357,152,-152.0
358,147,-147.0
359,143,-143.0
360,146,-146.0
361,139,-139.0
362,99,-99.0
363,141,-141.0
364,145,-145.0
365,108,-108.0
366,200,-200.0
367,85,-85.0
368,99,-99.0
369,185,-185.0
370,150,-150.0
371,144,-144.0
372,139,-139.0
373,127,-127.0
374,149,-149.0
375,143,-143.0
376,148,-148.0
377,144,-144.0
378,145,-145.0
379,84,-84.0
380,145,-145.0
381,160,-160.0
382,165,-165.0
383,84,-84.0
384,89,-89.0
385,100,-100.0
386,164,-164.0
387,144,-144.0
388,193,-193.0
389,149,-149.0
390,85,-85.0
391,86,-86.0
392,134,-134.0
393,138,-138.0
394,143,-143.0
395,87,-87.0
396,149,-149.0
397,89,-89.0
398,140,-140.0
399,187,-187.0
400,95,-95.0
401,146,-146.0
402,138,-138.0
403,136,-136.0
404,147,-147.0
405,143,-143.0
406,142,-142.0
407,149,-149.0
408,97,-97.0
409,87,-87.0
410,142,-142.0
411,140,-140.0
412,163,-163.0
413,144,-144.0
414,158,-158.0
415,163,-163.0
416,105,-105.0
417,159,-159.0
418,144,-144.0
419,145,-145.0
420,183,-183.0
421,150,-150.0
422,93,-93.0
423,145,-145.0
424,144,-144.0
425,176,-176.0
426,171,-171.0
427,145,-145.0
428,90,-90.0
429,188,-188.0
430,142,-142.0
431,102,-102.0
432,99,-99.0
433,144,-144.0
434,103,-103.0
435,128,-128.0
436,140,-140.0
437,85,-85.0
438,166,-166.0
439,101,-101.0
440,138,-138.0
441,166,-166.0
442,142,-142.0
443,139,-139.0
444,93,-93.0
445,143,-143.0
446,109,-109.0
447,154,-154.0
448,141,-141.0
449,146,-146.0
450,155,-155.0
451,100,-100.0
452,163,-163.0
453,196,-196.0
454,143,-143.0
455,145,-145.0
456,140,-140.0
457,110,-110.0
458,141,-141.0
459,156,-156.0
460,107,-107.0
461,143,-143.0
462,142,-142.0
463,146,-146.0
464,140,-140.0
465,187,-187.0
466,143,-143.0
467,95,-95.0
468,142,-142.0
469,143,-143.0
470,164,-164.0
471,104,-104.0
472,87,-87.0
473,136,-136.0
474,89,-89.0
475,106,-106.0
476,111,-111.0
477,87,-87.0
478,168,-168.0
479,89,-89.0
480,158,-158.0
481,150,-150.0
482,95,-95.0
483,134,-134.0
484,150,-150.0
485,95,-95.0
486,159,-159.0
487,158,-158.0
488,89,-89.0
489,141,-141.0
490,135,-135.0
491,163,-163.0
492,88,-88.0
493,86,-86.0
494,106,-106.0
495,171,-171.0
496,92,-92.0
497,92,-92.0
498,89,-89.0
499,105,-105.0
500,90,-90.0
501,179,-179.0
502,90,-90.0
503,147,-147.0
504,96,-96.0
505,164,-164.0
506,131,-131.0
507,89,-89.0
508,168,-168.0
509,88,-88.0
510,141,-141.0
511,174,-174.0
512,146,-146.0
513,91,-91.0
514,165,-165.0
515,172,-172.0
516,144,-144.0
517,169,-169.0
518,148,-148.0
519,120,-120.0
520,88,-88.0
521,87,-87.0
522,87,-87.0
523,142,-142.0
524,139,-139.0
525,107,-107.0
526,151,-151.0
527,144,-144.0
528,181,-181.0
529,127,-127.0
530,184,-184.0
531,88,-88.0
532,177,-177.0
533,89,-89.0
534,92,-92.0
535,148,-148.0
536,90,-90.0
537,138,-138.0
538,145,-145.0
539,162,-162.0
540,87,-87.0
541,86,-86.0
542,101,-101.0
543,88,-88.0
544,127,-127.0
545,87,-87.0
546,143,-143.0
547,200,-200.0
548,173,-173.0
549,145,-145.0
550,91,-91.0
551,89,-89.0
552,88,-88.0
553,142,-142.0
554,107,-107.0
555,152,-152.0
556,170,-170.0
557,175,-175.0
558,157,-157.0
559,99,-99.0
560,147,-147.0
561,86,-86.0
562,96,-96.0
563,86,-86.0
564,86,-86.0
565,138,-138.0
566,200,-200.0
567,190,-190.0
568,186,-186.0
569,85,-85.0
570,87,-87.0
571,87,-87.0
572,93,-93.0
573,144,-144.0
574,85,-85.0
575,98,-98.0
576,163,-163.0
577,158,-158.0
578,170,-170.0
579,87,-87.0
580,146,-146.0
581,167,-167.0
582,95,-95.0
583,147,-147.0
584,85,-85.0
585,91,-91.0
586,87,-87.0
587,147,-147.0
588,145,-145.0
589,143,-143.0
590,87,-87.0
591,143,-143.0
592,88,-88.0
593,148,-148.0
594,166,-166.0
595,177,-177.0
596,143,-143.0
597,168,-168.0
598,200,-200.0
599,87,-87.0
600,148,-148.0
601,142,-142.0
602,133,-133.0
603,143,-143.0
604,148,-148.0
605,96,-96.0
606,169,-169.0
607,128,-128.0
608,85,-85.0
609,88,-88.0
610,165,-165.0
611,90,-90.0
612,98,-98.0
613,148,-148.0
614,92,-92.0
615,171,-171.0
616,166,-166.0
617,95,-95.0
618,89,-89.0
619,192,-192.0
620,145,-145.0
621,95,-95.0
622,86,-86.0
623,112,-112.0
624,94,-94.0
625,92,-92.0
626,139,-139.0
627,123,-123.0
628,197,-197.0
629,142,-142.0
630,180,-180.0
631,167,-167.0
632,146,-146.0
633,87,-87.0
634,157,-157.0
635,200,-200.0
636,86,-86.0
637,147,-147.0
638,106,-106.0
639,145,-145.0
640,148,-148.0
641,87,-87.0
642,94,-94.0
643,146,-146.0
644,145,-145.0
645,84,-84.0
646,162,-162.0
647,86,-86.0
648,147,-147.0
649,143,-143.0
650,155,-155.0
651,92,-92.0
652,94,-94.0
653,171,-171.0
654,86,-86.0
655,84,-84.0
656,177,-177.0
657,143,-143.0
658,152,-152.0
659,162,-162.0
660,88,-88.0
661,107,-107.0
662,164,-164.0
663,146,-146.0
664,146,-146.0
665,90,-90.0
666,89,-89.0
667,84,-84.0
668,168,-168.0
669,177,-177.0
670,170,-170.0
671,93,-93.0
672,86,-86.0
673,143,-143.0
674,143,-143.0
675,172,-172.0
676,92,-92.0
677,84,-84.0
678,165,-165.0
679,146,-146.0
680,141,-141.0
681,106,-106.0
682,159,-159.0
683,84,-84.0
684,103,-103.0
685,91,-91.0
686,97,-97.0
687,94,-94.0
688,92,-92.0
689,148,-148.0
690,172,-172.0
691,200,-200.0
692,89,-89.0
693,151,-151.0
694,93,-93.0
695,91,-91.0
696,106,-106.0
697,106,-106.0
698,89,-89.0
699,106,-106.0
700,86,-86.0
701,163,-163.0
702,85,-85.0
703,200,-200.0
704,169,-169.0
705,145,-145.0
706,91,-91.0
707,173,-173.0
708,176,-176.0
709,187,-187.0
710,144,-144.0
711,92,-92.0
712,178,-178.0
713,105,-105.0
714,168,-168.0
715,91,-91.0
716,90,-90.0
717,146,-146.0
718,164,-164.0
719,137,-137.0
720,166,-166.0
721,143,-143.0
722,89,-89.0
723,168,-168.0
724,156,-156.0
725,86,-86.0
726,94,-94.0
727,152,-152.0
728,87,-87.0
729,164,-164.0
730,145,-145.0
731,200,-200.0
732,145,-145.0
733,85,-85.0
734,145,-145.0
735,158,-158.0
736,144,-144.0
737,144,-144.0
738,147,-147.0
739,99,-99.0
740,146,-146.0
741,190,-190.0
742,145,-145.0
743,148,-148.0
744,95,-95.0
745,91,-91.0
746,186,-186.0
747,143,-143.0
748,146,-146.0
749,85,-85.0
750,86,-86.0
751,85,-85.0
752,183,-183.0
753,146,-146.0
754,142,-142.0
755,144,-144.0
756,146,-146.0
757,151,-151.0
758,84,-84.0
759,168,-168.0
760,184,-184.0
761,91,-91.0
762,85,-85.0
763,161,-161.0
764,169,-169.0
765,87,-87.0
766,83,-83.0
767,109,-109.0
768,87,-87.0
769,94,-94.0
770,142,-142.0
771,173,-173.0
772,200,-200.0
773,145,-145.0
774,148,-148.0
775,147,-147.0
776,141,-141.0
777,133,-133.0
778,157,-157.0
779,200,-200.0
780,143,-143.0
781,85,-85.0
782,84,-84.0
783,165,-165.0
784,87,-87.0
785,200,-200.0
786,87,-87.0
787,143,-143.0
788,83,-83.0
789,197,-197.0
790,146,-146.0
791,145,-145.0
792,171,-171.0
793,100,-100.0
794,147,-147.0
795,142,-142.0
796,175,-175.0
797,89,-89.0
798,85,-85.0
799,97,-97.0
800,159,-159.0
801,148,-148.0
802,145,-145.0
803,143,-143.0
804,149,-149.0
805,146,-146.0
806,166,-166.0
807,93,-93.0
808,100,-100.0
809,172,-172.0
810,146,-146.0
811,144,-144.0
812,145,-145.0
813,146,-146.0
814,96,-96.0
815,84,-84.0
816,85,-85.0
817,151,-151.0
818,159,-159.0
819,157,-157.0
820,142,-142.0
821,146,-146.0
822,97,-97.0
823,170,-170.0
824,87,-87.0
825,86,-86.0
826,104,-104.0
827,91,-91.0
828,147,-147.0
829,85,-85.0
830,141,-141.0
831,163,-163.0
832,90,-90.0
833,174,-174.0
834,86,-86.0
835,172,-172.0
836,168,-168.0
837,144,-144.0
838,85,-85.0
839,89,-89.0
840,145,-145.0
841,173,-173.0
842,200,-200.0
843,141,-141.0
844,170,-170.0
845,89,-89.0
846,97,-97.0
847,133,-133.0
848,146,-146.0
849,87,-87.0
850,133,-133.0
851,173,-173.0
852,86,-86.0
853,97,-97.0
854,172,-172.0
855,143,-143.0
856,93,-93.0
857,150,-150.0
858,87,-87.0
859,96,-96.0
860,89,-89.0
861,146,-146.0
862,146,-146.0
863,150,-150.0
864,90,-90.0
865,88,-88.0
866,139,-139.0
867,164,-164.0
868,200,-200.0
869,147,-147.0
870,89,-89.0
871,158,-158.0
872,143,-143.0
873,143,-143.0
874,200,-200.0
875,144,-144.0
876,148,-148.0
877,100,-100.0
878,188,-188.0
879,148,-148.0
880,150,-150.0
881,98,-98.0
882,172,-172.0
883,146,-146.0
884,88,-88.0
885,146,-146.0
886,165,-165.0
887,92,-92.0
888,156,-156.0
889,142,-142.0
890,171,-171.0
891,87,-87.0
892,159,-159.0
893,89,-89.0
894,86,-86.0
895,140,-140.0
896,175,-175.0
897,162,-162.0
898,146,-146.0
899,171,-171.0
900,147,-147.0
901,143,-143.0
902,142,-142.0
903,88,-88.0
904,174,-174.0
905,94,-94.0
906,88,-88.0
907,200,-200.0
908,168,-168.0
909,87,-87.0
910,141,-141.0
911,142,-142.0
912,99,-99.0
913,145,-145.0
914,142,-142.0
915,144,-144.0
916,154,-154.0
917,150,-150.0
918,83,-83.0
919,148,-148.0
920,172,-172.0
921,85,-85.0
922,87,-87.0
923,141,-141.0
924,166,-166.0
925,144,-144.0
926,104,-104.0
927,170,-170.0
928,166,-166.0
929,164,-164.0
930,86,-86.0
931,144,-144.0
932,145,-145.0
933,108,-108.0
934,174,-174.0
935,166,-166.0
936,96,-96.0
937,145,-145.0
938,142,-142.0
939,146,-146.0
940,151,-151.0
941,145,-145.0
942,143,-143.0
943,87,-87.0
944,164,-164.0
945,88,-88.0
946,151,-151.0
947,100,-100.0
948,165,-165.0
949,161,-161.0
950,167,-167.0
951,143,-143.0
952,86,-86.0
953,145,-145.0
954,99,-99.0
955,87,-87.0
956,142,-142.0
957,114,-114.0
958,85,-85.0
959,85,-85.0
960,144,-144.0
961,146,-146.0
962,88,-88.0
963,146,-146.0
964,149,-149.0
965,88,-88.0
966,89,-89.0
967,85,-85.0
968,105,-105.0
969,200,-200.0
970,183,-183.0
971,168,-168.0
972,88,-88.0
973,143,-143.0
974,122,-122.0
975,93,-93.0
976,174,-174.0
977,144,-144.0
978,157,-157.0
979,92,-92.0
980,95,-95.0
981,84,-84.0
982,154,-154.0
983,183,-183.0
984,145,-145.0
985,123,-123.0
986,85,-85.0
987,83,-83.0
988,177,-177.0
989,138,-138.0
990,85,-85.0
991,156,-156.0
992,147,-147.0
993,146,-146.0
994,148,-148.0
995,87,-87.0
996,149,-149.0
997,148,-148.0
998,152,-152.0
999,147,-147.0
1000,90,-90.0
1001,131,-131.0
1002,84,-84.0
1003,90,-90.0
1004,142,-142.0
1005,91,-91.0
1006,140,-140.0
1007,146,-146.0
1008,87,-87.0
1009,140,-140.0
1010,157,-157.0
1011,147,-147.0
1012,149,-149.0
1013,108,-108.0
1014,146,-146.0
1015,146,-146.0
1016,93,-93.0
1017,143,-143.0
1018,142,-142.0
1019,142,-142.0
1020,98,-98.0
1021,144,-144.0
1022,96,-96.0
1023,146,-146.0
1024,146,-146.0
1025,145,-145.0
1026,102,-102.0
1027,93,-93.0
1028,84,-84.0
1029,84,-84.0
1030,89,-89.0
1031,104,-104.0
1032,144,-144.0
1033,86,-86.0
1034,140,-140.0
1035,145,-145.0
1036,148,-148.0
1037,146,-146.0
1038,143,-143.0
1039,155,-155.0
1040,147,-147.0
1041,84,-84.0
1042,158,-158.0
1043,146,-146.0
1044,89,-89.0
1045,143,-143.0
1046,140,-140.0
1047,145,-145.0
1048,90,-90.0
1049,146,-146.0
1050,84,-84.0
1051,150,-150.0
1052,147,-147.0
1053,91,-91.0
1054,159,-159.0
1055,85,-85.0
1056,86,-86.0
1057,141,-141.0
1058,92,-92.0
1059,144,-144.0
1060,87,-87.0
1061,101,-101.0
1062,154,-154.0
1063,140,-140.0
1064,85,-85.0
1065,91,-91.0
1066,107,-107.0
1067,143,-143.0
1068,142,-142.0
1069,111,-111.0
1070,87,-87.0
1071,159,-159.0
1072,88,-88.0
1073,151,-151.0
1074,167,-167.0
1075,97,-97.0
1076,146,-146.0
1077,91,-91.0
1078,91,-91.0
1079,145,-145.0
1080,148,-148.0
1081,145,-145.0
1082,104,-104.0
1083,145,-145.0
1084,149,-149.0
1085,200,-200.0
1086,162,-162.0
1087,84,-84.0
1088,96,-96.0
1089,157,-157.0
1090,84,-84.0
1091,200,-200.0
1092,151,-151.0
1093,96,-96.0
1094,119,-119.0
1095,117,-117.0
1096,175,-175.0
1097,200,-200.0
1098,200,-200.0
1099,200,-200.0
1100,200,-200.0
1101,156,-156.0
1102,200,-200.0
1103,139,-139.0
1104,150,-150.0
1105,85,-85.0
1106,200,-200.0
1107,200,-200.0
1108,91,-91.0
1109,154,-154.0
1110,85,-85.0
1111,87,-87.0
1112,85,-85.0
1113,117,-117.0
1114,119,-119.0
1115,178,-178.0
1116,200,-200.0
1117,85,-85.0
1118,186,-186.0
1119,151,-151.0
1120,158,-158.0
1121,185,-185.0
1122,200,-200.0
1123,83,-83.0
1124,200,-200.0
1125,200,-200.0
1126,169,-169.0
1127,90,-90.0
1128,200,-200.0
1129,200,-200.0
1130,116,-116.0
1131,89,-89.0
1132,193,-193.0
1133,200,-200.0
1134,87,-87.0
1135,200,-200.0
1136,98,-98.0
1137,118,-118.0
1138,200,-200.0
1139,171,-171.0
1140,103,-103.0
1141,92,-92.0
1142,112,-112.0
1143,134,-134.0
1144,116,-116.0
1145,124,-124.0
1146,108,-108.0
1147,104,-104.0
1148,102,-102.0
1149,147,-147.0
1150,121,-121.0
1151,96,-96.0
1152,129,-129.0
1153,105,-105.0
1154,200,-200.0
1155,86,-86.0
1156,136,-136.0
1157,97,-97.0
1158,88,-88.0
1159,110,-110.0
1160,109,-109.0
1161,147,-147.0
1162,88,-88.0
1163,195,-195.0
1164,124,-124.0
1165,156,-156.0
1166,168,-168.0
1167,97,-97.0
1168,99,-99.0
1169,121,-121.0
1170,146,-146.0
1171,122,-122.0
1172,87,-87.0
1173,197,-197.0
1174,184,-184.0
1175,200,-200.0
1176,96,-96.0
1177,200,-200.0
1178,93,-93.0
1179,102,-102.0
1180,106,-106.0
1181,141,-141.0
1182,100,-100.0
1183,119,-119.0
1184,165,-165.0
1185,166,-166.0
1186,200,-200.0
1187,136,-136.0
1188,124,-124.0
1189,107,-107.0
1190,148,-148.0
1191,117,-117.0
1192,117,-117.0
1193,86,-86.0
1194,83,-83.0
1195,200,-200.0
1196,99,-99.0
1197,140,-140.0
1198,84,-84.0
1199,109,-109.0
1200,93,-93.0
1201,165,-165.0
1202,129,-129.0
1203,102,-102.0
1204,111,-111.0
1205,118,-118.0
1206,102,-102.0
1207,90,-90.0
1208,95,-95.0
1209,92,-92.0
1210,90,-90.0
1211,184,-184.0
1212,100,-100.0
1213,103,-103.0
1214,110,-110.0
1215,96,-96.0
1216,96,-96.0
1217,147,-147.0
1218,155,-155.0
1219,96,-96.0
1220,91,-91.0
1221,152,-152.0
1222,108,-108.0
1223,100,-100.0
1224,86,-86.0
1225,146,-146.0
1226,146,-146.0
1227,149,-149.0
1228,114,-114.0
1229,124,-124.0
1230,113,-113.0
1231,111,-111.0
1232,106,-106.0
1233,87,-87.0
1234,116,-116.0
1235,156,-156.0
1236,88,-88.0
1237,150,-150.0
1238,169,-169.0
1239,89,-89.0
1240,139,-139.0
1241,147,-147.0
1242,98,-98.0
1243,141,-141.0
1244,153,-153.0
1245,154,-154.0
1246,113,-113.0
1247,105,-105.0
1248,86,-86.0
1249,105,-105.0
1250,180,-180.0
1251,90,-90.0
1252,145,-145.0
1253,111,-111.0
1254,89,-89.0
1255,108,-108.0
1256,124,-124.0
1257,114,-114.0
1258,154,-154.0
1259,155,-155.0
1260,88,-88.0
1261,110,-110.0
1262,160,-160.0
1263,95,-95.0
1264,99,-99.0
1265,106,-106.0
1266,109,-109.0
1267,116,-116.0
1268,88,-88.0
1269,109,-109.0
1270,200,-200.0
1271,134,-134.0
1272,130,-130.0
1273,103,-103.0
1274,95,-95.0
1275,118,-118.0
1276,88,-88.0
1277,143,-143.0
1278,84,-84.0
1279,140,-140.0
1280,111,-111.0
1281,99,-99.0
1282,106,-106.0
1283,111,-111.0
1284,101,-101.0
1285,157,-157.0
1286,92,-92.0
1287,158,-158.0
1288,130,-130.0
1289,107,-107.0
1290,105,-105.0
1291,103,-103.0
1292,149,-149.0
1293,117,-117.0
1294,116,-116.0
1295,154,-154.0
1296,100,-100.0
1297,108,-108.0
1298,105,-105.0
1299,110,-110.0
1300,101,-101.0
1301,153,-153.0
1302,156,-156.0
1303,150,-150.0
1304,109,-109.0
1305,109,-109.0
1306,119,-119.0
1307,168,-168.0
1308,86,-86.0
1309,105,-105.0
1310,85,-85.0
1311,116,-116.0
1312,111,-111.0
1313,105,-105.0
1314,109,-109.0
1315,88,-88.0
1316,109,-109.0
1317,105,-105.0
1318,85,-85.0
1319,100,-100.0
1320,109,-109.0
1321,116,-116.0
1322,107,-107.0
1323,108,-108.0
1324,120,-120.0
1325,108,-108.0
1326,104,-104.0
1327,86,-86.0
1328,107,-107.0
1329,84,-84.0
1330,104,-104.0
1331,104,-104.0
1332,86,-86.0
1333,102,-102.0
1334,105,-105.0
1335,105,-105.0
1336,102,-102.0
1337,106,-106.0
1338,110,-110.0
1339,110,-110.0
1340,102,-102.0
1341,165,-165.0
1342,108,-108.0
1343,98,-98.0
1344,101,-101.0
1345,104,-104.0
1346,109,-109.0
1347,105,-105.0
1348,101,-101.0
1349,101,-101.0
1350,84,-84.0
