episodes,steps,rewards
0,74,-101.03979372119957
1,98,-221.51460830702382
2,64,-37.16871989069974
3,69,-93.6113619488817
4,93,-301.9350790263968
5,135,-43.838587570567874
6,94,-213.57029288955889
7,87,-115.52506153730272
8,97,-232.8157986942632
9,121,-244.83139772152154
10,123,-120.44557804792406
11,54,-225.03543601639748
12,145,-90.4298208535517
13,258,-380.29294465651765
14,126,-288.2429050887397
15,279,-193.34506900834447
16,144,20.34360504128385
17,243,-276.8873022232841
18,1000,-33.088386650673
19,190,-93.49873937887197
20,292,-200.66570782817882
21,335,-188.07978417113134
22,1000,-127.81512182024944
23,1000,-142.34774073887846
24,1000,-97.43849233960151
25,1000,-78.21004194102532
26,1000,-105.59302204475472
27,1000,-89.73447412209671
28,1000,-79.83747874789329
29,1000,-144.30385856537106
30,1000,-19.845671804219577
31,1000,-45.3029048249017
32,1000,-88.20956697174071
33,1000,-133.36332302656504
34,1000,-90.31513733866575
35,1000,-25.51227175853154
36,1000,-194.33604826063396
37,458,-190.79522009471157
38,245,-119.8429764417498
39,607,-149.58850013612215
40,1000,-67.92342868315237
41,1000,-158.76567330262571
42,1000,-68.54005805044048
43,910,-199.1397363894758
44,1000,-57.40417429619339
45,1000,-98.412661403547
46,1000,-97.6132107109059
47,319,-123.42327174587011
48,141,-109.54653610064386
49,361,-203.5626989151006
50,613,-210.21582892438767
51,721,-220.18604989308972
52,271,-118.15948894610884
53,1000,-159.38194723372425
54,1000,-129.66178769595018
55,1000,-40.12740287197643
56,1000,-80.80652022904415
57,1000,-49.36476174277533
58,1000,-75.62288924908452
59,1000,-102.26053891028685
60,1000,-69.36955413212355
61,182,-463.62047705318076
62,173,-248.06527224746304
63,889,-330.6781668813628
64,188,-185.1980411664136
65,270,-180.32804917035338
66,150,-130.16202205015338
67,163,-230.28788511889522
68,985,-198.82170075553978
69,127,-126.15720662769753
70,659,-529.9537020158145
71,368,-201.81067498578142
72,240,-119.3170362139191
73,1000,-128.82648319223313
74,916,-175.24265243917114
75,1000,-57.286989042831166
76,1000,-16.46674921096244
77,1000,-135.47176547803434
78,1000,-81.97738003567412
79,1000,-29.6370948447873
80,260,6.546871599763591
81,764,-196.45476406802823
82,273,-91.6791868396823
83,256,-73.5860219788355
84,1000,-39.30284471250753
85,1000,-37.20392211345276
86,1000,-170.9315632875552
87,1000,-139.8282740483641
88,1000,-31.83440063817446
89,1000,-43.05027389041092
90,887,-244.18381524755605
91,1000,-30.83810055545656
92,934,-111.2159848789391
93,942,-440.8797081484209
94,1000,-122.01959360029691
95,197,-99.07083973110092
96,962,-364.63727954052865
97,673,-97.94127772310166
98,328,-240.2035919642166
99,1000,-173.38608269646397
100,312,-410.71591934405814
101,1000,-469.1929809061426
102,1000,-297.30108884066897
103,165,-716.6037461980761
104,1000,-336.06852831082983
105,771,-350.12634423114486
106,205,-303.4420254707047
107,806,-452.52359486249105
108,293,-268.08056817837735
109,255,-245.26823661770044
110,1000,-212.80763934076276
111,663,-587.1640191284121
112,572,-425.5667377092275
113,1000,-109.30544199206278
114,363,1.0894057096913627
115,1000,-113.22525002611019
116,754,-386.7046525361669
117,241,-65.83577888345995
118,1000,-253.02800582609012
119,1000,-200.43609908098534
120,175,-149.05999270273105
121,119,-127.80044380541871
122,396,-152.0591025749408
123,87,-165.51204253750987
124,225,-192.4323532055067
125,800,-256.6965517437419
126,1000,-162.50551783192662
127,998,-475.2966959123847
128,1000,-133.5507770663427
129,374,-90.25427466660369
130,1000,-86.31440472187421
131,1000,-109.36555170615426
132,521,-126.88663778418324
133,410,-179.2650486874435
134,366,-101.87490306858336
135,1000,-59.968062460428676
136,1000,-61.39027478185912
137,1000,-116.84827181725527
138,1000,-58.52731050373919
139,1000,-89.77366269101476
140,141,-178.87783253809198
141,1000,-145.5617188462395
142,1000,-206.26168517459172
143,1000,-128.21983346723823
144,270,-167.06274654856077
145,456,-5.8247191832390115
146,601,-253.94268116813203
147,229,-231.50781496893975
148,1000,-75.67522407675393
149,605,-29.10417728697088
150,1000,-92.25026536991912
151,1000,-197.29845575399176
152,1000,-139.2965246427342
153,1000,-109.48344101912693
154,137,-173.48174115075233
155,466,-246.13018920734729
156,150,-224.12860446399714
157,302,-157.26012119437388
158,1000,-135.43547917930394
159,1000,-38.63304156890607
160,121,-268.6669442956322
161,1000,2.4572296276532883
162,1000,-53.322411289057925
163,1000,-73.28138665287528
164,1000,-50.70763917145721
165,55,-94.81299677240881
166,1000,-130.3901199323597
167,989,-653.6656927066392
168,103,-241.84068437682544
169,404,-178.11098527072508
170,487,-328.33149599331745
171,239,-120.95540674172945
172,482,-313.7667489975479
173,583,-436.0389575324373
174,183,-9.094726238789903
175,735,-368.7124751516764
176,1000,-121.99972666955318
177,1000,-299.45719313278903
178,1000,-54.450989075648025
179,1000,-120.86311719964195
180,969,-195.18112609047347
181,1000,-10.557713854800289
182,1000,-52.034040289554504
183,1000,-19.179804081322292
184,1000,-14.163932877333899
185,987,-266.9788697448058
186,1000,-99.46402522783188
187,1000,-57.574841015338684
188,211,-120.66050723392476
189,171,-115.12035811575137
190,1000,-75.26015654520141
191,1000,-28.683633009334788
192,1000,-67.09927216136343
193,1000,-98.2853466541628
194,1000,-74.8577417739891
195,1000,-60.999655595203706
196,343,-195.9176704112853
197,210,-91.434903328827
198,820,-314.83274456967604
199,388,-164.03995967825477
200,158,-997.6008452476525
201,155,-118.76647348032986
202,130,-208.5452469202632
203,133,-299.83067316898286
204,121,-263.73831279690773
205,124,-560.7287887134937
206,65,-177.0210681632887
207,104,-166.23067621662602
208,78,-267.1800446552585
209,103,-61.03229315623088
210,170,-347.3700789144982
211,120,-268.86351695116855
212,1000,-298.95503320757547
213,261,-382.9668840052706
214,270,-208.05171412334892
215,194,-328.88080685745166
216,670,-411.6324488026642
217,1000,-238.16576444251137
218,662,-214.8315035758663
219,153,-132.50802700607704
220,1000,-170.74127814537596
221,1000,-122.66301339146708
222,467,-131.68627897375637
223,523,-219.22077510807145
224,1000,-293.4582539771651
225,515,-312.1486668480835
226,1000,-195.82170002758133
227,555,-314.2246444488118
228,562,-331.3513294392423
229,812,-443.80494647315095
230,1000,-192.96092127169928
231,652,-346.57787524063747
232,1000,-269.35149950407805
233,1000,-116.46029024908147
234,1000,-45.937906498329895
235,1000,-171.5593773123774
236,1000,-16.069662434446254
237,829,-763.5708869765856
238,654,-413.1904635069311
239,372,-330.3556204576331
240,473,-300.5830254942605
241,70,-135.69520069787575
242,141,-487.15552996044954
243,68,-125.83169680366
244,518,-498.9399431339374
245,1000,-225.7791865909433
246,603,-351.4330619312662
247,189,-357.09309165731065
248,58,-356.50396550643984
249,78,-259.7399996698013
250,495,-221.1379898483799
251,540,-592.8044002559508
252,343,-441.57165650922906
253,572,-352.3534997803864
254,1000,-196.75993424333072
255,55,-272.6696803070018
256,86,-201.33027709218334
257,94,-348.4667990497926
258,1000,-259.91480519970656
259,1000,-295.09128854894954
260,1000,-198.80343302507893
261,1000,-234.88120300796484
262,1000,-252.45196862266272
263,1000,-312.65149583624884
264,1000,-298.672499091009
265,80,-379.5895767561724
266,1000,-226.8029671135906
267,1000,-293.04413500255697
268,356,-441.12940233203625
269,195,-311.1320582041999
270,1000,-140.96790679688144
271,1000,-202.43596248258848
272,1000,-176.84299485637175
273,629,-410.3038262263828
274,1000,-125.33191488328087
275,333,-218.26920608070833
276,1000,-160.98340589488166
277,413,-51.48639156051617
278,455,-232.34837631002023
279,356,-28.529415032307156
280,277,-6.15843724356985
281,141,-249.063937631365
282,521,-369.72122941471383
283,616,-258.8971116789155
284,239,-240.50954118497722
285,195,-226.7245832683856
286,294,-358.91811788700335
287,471,-298.46814414778646
288,272,-229.95482062785518
289,137,-109.15735528504322
290,197,-372.66523453129724
291,115,-486.387869504277
292,98,-294.62357236674745
293,198,-192.78679635728514
294,175,-185.64350967644936
295,221,-294.2872292306651
296,296,-241.5291230625503
297,307,-271.3896385376838
298,114,-772.1460013300969
299,95,-336.1192050080198
300,229,-578.6971545067896
301,270,-205.47968257702502
302,131,-213.5390048938404
303,226,-94.02430848038216
304,362,-229.87939218068618
305,1000,-77.21186218924542
306,133,-46.956479792277534
307,271,-163.3038677660341
308,652,-82.52913487109397
309,350,-126.65094058518463
310,1000,-80.68419653033527
311,1000,-58.661364619760775
312,292,-430.1689256978993
313,603,-227.84891234601815
314,351,-57.55305422014786
315,1000,-461.39605247206475
316,431,-127.18011312406108
317,1000,-144.99701996168992
318,521,-336.47241361281124
319,328,-168.8443147898235
320,1000,-89.58689743474932
321,1000,-72.05472418736218
322,127,-343.25712280041785
323,150,-198.86836178467527
324,299,-342.81679847102157
325,53,-135.85028244832623
326,111,-166.52343743412177
327,118,-204.3484061862562
328,181,-307.0618872890778
329,92,-30.500813200160167
330,1000,-345.7775381768923
331,536,-271.27521907750634
332,130,-217.52056533639106
333,260,-499.7492988389412
334,1000,-120.96298339575264
335,84,-197.43812554011538
336,1000,-227.3265190728102
337,811,-185.70959000372943
338,227,-221.37475223302613
339,1000,-209.04244832095162
340,385,-280.2842390362563
341,491,-858.1224854098913
342,319,-396.96207433729813
343,230,-242.53025536995673
344,207,-206.72588591842015
345,231,-269.3017246454589
346,1000,-153.49696245210873
347,148,-156.49209208945913
348,1000,-144.11936541437538
349,1000,-148.4162409100028
350,1000,-136.1565294838591
351,1000,-109.53784702456201
352,333,-256.07590229815116
353,127,-201.39131336468955
354,145,-252.77257109916914
355,1000,-144.19708075254158
356,212,-275.5922749780076
357,116,-118.28368376839146
358,156,-324.11478813387197
359,116,-165.17768778369742
360,1000,-133.8306064420302
361,1000,-82.27209410277156
362,407,-292.0331332217627
363,376,-695.4371614200684
364,167,-100.87088045143558
365,297,-220.71733476506887
366,327,-209.69324380223173
367,157,-108.96356641863574
368,148,-212.849136696053
369,197,-92.22069868777017
370,266,-319.5922713652475
371,288,-219.97968573929046
372,351,-202.76212614278052
373,363,-173.72314071646372
374,958,-389.67134675757495
375,642,-224.67910670617312
376,670,-302.0566752046713
377,101,-188.5212603799755
378,281,-952.5991322860003
379,206,-657.2940739307948
380,233,-471.29074404399813
381,521,-1215.2963289443428
382,199,-93.45130959979976
383,188,-198.00983651107927
384,414,-737.6239287216366
385,428,-458.01924741737264
386,226,-139.3434320924074
387,86,-60.102264878232425
388,137,-137.72585228798815
389,353,-690.0762590519228
390,138,-199.23084988791362
391,142,-194.89716343859558
392,431,-188.27904059326104
393,365,-212.90417341760974
394,145,-55.66478250254298
395,521,-175.9345187724944
396,362,-850.4677731536016
397,790,-191.77285353411307
398,576,-338.06376250625215
399,1000,-215.04158823884435
400,1000,-350.224444055601
401,448,-196.593321195881
402,1000,-80.65400613124636
403,1000,-81.9258309483774
404,1000,-165.08097660489082
405,1000,-242.70080094790066
406,1000,-80.96059965588509
407,1000,-104.96942711147506
408,673,-456.15747620135477
409,319,-417.87554793455956
410,213,-197.43896406306737
411,1000,-224.91136518192428
412,313,-145.3369014304513
413,174,-209.35802379932846
414,370,-89.97390574322873
415,672,-157.47841679114012
416,1000,-88.79816071788687
417,1000,-152.6599256078409
418,1000,-140.94157167379177
419,1000,-229.60430735425933
420,805,-272.9255119632585
421,311,-141.9390230831781
422,1000,-221.87301128924926
423,459,-363.20545095740687
424,1000,-120.1827040210397
425,541,-271.9177463437369
426,71,-324.90382500309573
427,130,-327.94568677640507
428,90,-363.4026506325745
429,455,-445.7041100265607
430,68,-515.6820415419393
431,120,-342.8753869512436
432,257,-277.60832158798263
433,112,-218.27513340095243
434,331,-248.27025286395872
435,1000,-177.65931709245373
436,275,-630.8967614308995
437,1000,-160.38837409303164
438,1000,-259.9776930144288
439,713,-1098.1226776067967
440,1000,-224.43244919505736
441,486,-353.9172939655158
442,159,-145.92675194499998
443,951,-314.0047511217972
444,260,-123.01653567536039
445,315,-133.95199513729293
446,1000,-161.24099260385782
447,327,-92.79408690187084
448,1000,-90.058967600781
449,1000,-113.76912330362906
450,93,-242.9928763708924
451,1000,-93.64790259969612
452,1000,-128.29942106641764
453,275,-169.90516311578864
454,467,-154.94101902985867
455,1000,-90.30131175062199
456,128,-182.45659592935016
457,1000,-184.7450323628264
458,150,-382.19831704455254
459,1000,-211.09372577848728
460,1000,-135.13826449628667
461,958,-246.8434491383821
462,1000,-51.537007156048524
463,719,-159.42873220542089
464,1000,-58.878188408089315
465,1000,-71.86255973634105
466,369,-655.4316534111
467,1000,-89.7074547345145
468,255,-252.186410287426
469,1000,-97.26420303152274
470,1000,-82.1326453909079
471,1000,-37.5853366227806
472,1000,-57.26904991170527
473,1000,-20.45294825790176
474,1000,-58.47862564649466
475,822,147.59259232222695
476,499,-60.4775068708712
477,1000,-12.616504620345982
478,158,0.4517985530194295
479,529,-148.76357984777803
480,622,-195.57722399984286
481,610,-161.71695801793862
482,1000,-38.82100119879951
483,1000,-86.9785719050048
484,60,-118.64436404121975
485,399,-299.79807187456106
486,1000,-27.91228385895685
487,1000,-10.24009964445346
488,135,-68.9423591742104
489,712,-180.38311316713558
490,124,-77.19858395332666
491,1000,-249.4898101054421
492,1000,-43.585186327057215
493,1000,-57.61268864160371
494,429,-165.15128599962708
495,1000,-72.18057779201511
496,1000,-232.12650453080337
497,717,-239.59379036731886
498,1000,-173.96229982404424
499,392,-140.58582664182148
500,1000,-223.08054037541083
501,154,-202.04838103249898
502,1000,-123.0620202291723
503,330,-87.49077731030674
504,829,-212.88057635379207
505,640,-198.0507981889528
506,166,-264.0271147369627
507,1000,-128.90079647862473
508,1000,-118.04066268860869
509,1000,-117.9847152772054
510,1000,-205.7922122241036
511,1000,-91.36506607474021
512,136,-103.1827955188885
513,1000,-180.78079998228935
514,1000,-117.67322149453604
515,525,-60.843305665778054
516,61,-96.08419516964045
517,66,-139.23026171935823
518,1000,-60.00103935255024
519,63,-162.9677766676894
520,1000,-39.964788844331174
521,1000,-119.73996006399587
522,1000,-48.72196674025926
523,1000,-32.37765328563451
524,1000,-128.89463291766742
525,1000,-61.174227050148644
526,1000,-37.735918141016285
527,1000,-162.97330878161938
528,1000,-55.393112153454744
529,1000,-100.45794142073976
530,243,-110.73228971808858
531,1000,-95.81012340828987
532,1000,-93.65012362672303
533,1000,-72.20302572592198
534,650,-293.2543068211512
535,66,-480.59570487075405
536,59,-121.05339718559667
537,78,-110.16064361435538
538,57,-134.42892044248012
539,85,-253.9157012751151
540,1000,-347.45240470902746
541,1000,-155.19333125966926
542,1000,-48.95481027045684
543,1000,-33.37857499486876
544,1000,-39.321835792666896
545,1000,-36.7426359305917
546,1000,-28.88331379165869
547,744,-188.46868078825793
548,1000,-203.34388118306296
549,1000,-7.547528704785672
550,1000,-18.369623927891734
551,1000,-11.84799939023254
552,1000,-66.84474652590576
553,183,-300.8068062092859
554,214,-485.6191338642992
555,144,-923.7224801684262
556,135,-629.2752951880765
557,171,-130.17304492159627
558,140,-41.14632216684409
559,963,-583.4487758099119
560,58,-437.1874893874808
561,82,-523.3591013735114
562,64,-417.29784820276683
563,67,-328.59767650987123
564,103,-334.80109301653584
565,97,-333.5041859148969
566,103,-461.30926660844915
567,80,-51.639593691863226
568,81,-389.09134224620794
569,143,-631.9965940150742
570,94,-477.0197581291547
571,197,-286.92075546743797
572,88,-225.0807401573697
573,104,-179.00826442242334
574,116,-219.4409441474363
575,143,-208.14621495145605
576,125,-91.04569047979436
577,244,-349.35342018538745
578,361,-252.10222418529582
579,190,-100.02203731281534
580,65,-181.4618965372166
581,980,-296.8518955040853
582,207,-175.5980322445736
583,131,-156.48609724405617
584,271,-154.84812517309618
585,1000,-247.41121978616727
586,414,-287.73393676990406
587,490,-248.77751483706618
588,777,-385.14122226336167
589,411,-292.2631923014295
590,755,-294.75369513909493
591,818,-289.4637190628042
592,1000,-198.66026069261923
593,1000,-198.8959647338645
594,1000,-151.20297933896597
595,1000,-251.24512525241715
596,136,-170.37203472594143
597,1000,-148.51657849548016
598,1000,-292.1338515713464
599,849,-271.63926629162495
600,612,-328.32501922895085
