episodes,steps,rewards
0,200,-200.0
1,200,-200.0
2,200,-200.0
3,200,-200.0
4,200,-200.0
5,200,-200.0
6,200,-200.0
7,200,-200.0
8,200,-200.0
9,200,-200.0
10,200,-200.0
11,200,-200.0
12,200,-200.0
13,200,-200.0
14,196,-196.0
15,200,-200.0
16,200,-200.0
17,200,-200.0
18,200,-200.0
19,200,-200.0
20,200,-200.0
21,200,-200.0
22,200,-200.0
23,200,-200.0
24,200,-200.0
25,200,-200.0
26,200,-200.0
27,200,-200.0
28,200,-200.0
29,200,-200.0
30,200,-200.0
31,200,-200.0
32,200,-200.0
33,200,-200.0
34,200,-200.0
35,200,-200.0
36,200,-200.0
37,200,-200.0
38,200,-200.0
39,200,-200.0
40,200,-200.0
41,200,-200.0
42,200,-200.0
43,200,-200.0
44,200,-200.0
45,120,-120.0
46,200,-200.0
47,150,-150.0
48,200,-200.0
49,131,-131.0
50,200,-200.0
51,200,-200.0
52,200,-200.0
53,200,-200.0
54,200,-200.0
55,200,-200.0
56,200,-200.0
57,200,-200.0
58,200,-200.0
59,200,-200.0
60,200,-200.0
61,200,-200.0
62,200,-200.0
63,200,-200.0
64,200,-200.0
65,200,-200.0
66,200,-200.0
67,200,-200.0
68,200,-200.0
69,200,-200.0
70,200,-200.0
71,200,-200.0
72,200,-200.0
73,200,-200.0
74,200,-200.0
75,200,-200.0
76,200,-200.0
77,200,-200.0
78,200,-200.0
79,200,-200.0
80,200,-200.0
81,200,-200.0
82,200,-200.0
83,200,-200.0
84,200,-200.0
85,200,-200.0
86,200,-200.0
87,200,-200.0
88,200,-200.0
89,200,-200.0
90,200,-200.0
91,200,-200.0
92,200,-200.0
93,200,-200.0
94,200,-200.0
95,200,-200.0
96,200,-200.0
97,200,-200.0
98,200,-200.0
99,200,-200.0
100,200,-200.0
101,200,-200.0
102,200,-200.0
103,200,-200.0
104,200,-200.0
105,200,-200.0
106,200,-200.0
107,200,-200.0
108,200,-200.0
109,200,-200.0
110,200,-200.0
111,200,-200.0
112,200,-200.0
113,200,-200.0
114,200,-200.0
115,200,-200.0
116,200,-200.0
117,200,-200.0
118,200,-200.0
119,200,-200.0
120,200,-200.0
121,200,-200.0
122,200,-200.0
123,130,-130.0
124,200,-200.0
125,200,-200.0
126,200,-200.0
127,200,-200.0
128,200,-200.0
129,200,-200.0
130,200,-200.0
131,200,-200.0
132,200,-200.0
133,200,-200.0
134,200,-200.0
135,200,-200.0
136,200,-200.0
137,200,-200.0
138,200,-200.0
139,200,-200.0
140,200,-200.0
141,200,-200.0
142,200,-200.0
143,200,-200.0
144,200,-200.0
145,200,-200.0
146,200,-200.0
147,139,-139.0
148,200,-200.0
149,200,-200.0
150,200,-200.0
151,200,-200.0
152,200,-200.0
153,200,-200.0
154,200,-200.0
155,200,-200.0
156,200,-200.0
157,200,-200.0
158,200,-200.0
159,200,-200.0
160,200,-200.0
161,200,-200.0
162,200,-200.0
163,200,-200.0
164,200,-200.0
165,200,-200.0
166,200,-200.0
167,200,-200.0
168,200,-200.0
169,200,-200.0
170,200,-200.0
171,200,-200.0
172,200,-200.0
173,200,-200.0
174,200,-200.0
175,200,-200.0
176,200,-200.0
177,200,-200.0
178,200,-200.0
179,200,-200.0
180,200,-200.0
181,200,-200.0
182,200,-200.0
183,200,-200.0
184,200,-200.0
185,200,-200.0
186,200,-200.0
187,200,-200.0
188,200,-200.0
189,200,-200.0
190,200,-200.0
191,200,-200.0
192,200,-200.0
193,200,-200.0
194,200,-200.0
195,200,-200.0
196,200,-200.0
197,200,-200.0
198,200,-200.0
199,200,-200.0
200,200,-200.0
201,200,-200.0
202,200,-200.0
203,200,-200.0
204,200,-200.0
205,159,-159.0
206,127,-127.0
207,200,-200.0
208,200,-200.0
209,200,-200.0
210,200,-200.0
211,200,-200.0
212,200,-200.0
213,200,-200.0
214,200,-200.0
215,200,-200.0
216,200,-200.0
217,200,-200.0
218,200,-200.0
219,200,-200.0
220,200,-200.0
221,200,-200.0
222,173,-173.0
223,162,-162.0
224,159,-159.0
225,167,-167.0
226,155,-155.0
227,161,-161.0
228,200,-200.0
229,200,-200.0
230,200,-200.0
231,200,-200.0
232,145,-145.0
233,200,-200.0
234,200,-200.0
235,200,-200.0
236,143,-143.0
237,140,-140.0
238,149,-149.0
239,161,-161.0
240,150,-150.0
241,153,-153.0
242,161,-161.0
243,147,-147.0
244,136,-136.0
245,142,-142.0
246,200,-200.0
247,152,-152.0
248,180,-180.0
249,131,-131.0
250,136,-136.0
251,133,-133.0
252,144,-144.0
253,138,-138.0
254,147,-147.0
255,142,-142.0
256,142,-142.0
257,165,-165.0
258,91,-91.0
259,137,-137.0
260,156,-156.0
261,141,-141.0
262,138,-138.0
263,141,-141.0
264,144,-144.0
265,138,-138.0
266,143,-143.0
267,147,-147.0
268,142,-142.0
269,144,-144.0
270,146,-146.0
271,164,-164.0
272,149,-149.0
273,149,-149.0
274,146,-146.0
275,200,-200.0
276,194,-194.0
277,144,-144.0
278,150,-150.0
279,144,-144.0
280,143,-143.0
281,146,-146.0
282,200,-200.0
283,200,-200.0
284,200,-200.0
285,200,-200.0
286,143,-143.0
287,200,-200.0
288,200,-200.0
289,200,-200.0
290,190,-190.0
291,200,-200.0
292,200,-200.0
293,188,-188.0
294,200,-200.0
295,141,-141.0
296,200,-200.0
297,144,-144.0
298,145,-145.0
299,200,-200.0
300,141,-141.0
