episodes,steps,rewards
0,123,-92.21864600807282
1,116,-206.92031130086724
2,73,-150.25020611549303
3,120,-215.8931944137367
4,84,-128.41320847958394
5,78,-96.18524573066568
6,100,-107.03295710081441
7,102,-286.09683825305115
8,90,-214.7928810409772
9,108,-208.31135688184702
10,74,-65.56390007803587
11,103,-171.2493253805738
12,272,-503.49514022938945
13,84,-369.26548094638036
14,114,-429.7209283447734
15,151,-104.6994875900664
16,365,-156.47657681709518
17,668,-173.5276380698223
18,206,-115.45208332933349
19,92,-118.0553249103773
20,96,-170.05932998086854
21,142,-156.56276177092752
22,103,-188.06197612138817
23,259,-83.7232099813314
24,373,-121.40850499136681
25,138,-210.83867328136523
26,258,-184.6383280696627
27,133,-191.38256361998504
28,139,-195.4868513278384
29,135,-108.09127723633073
30,142,-110.09613028959666
31,119,-277.0503393747059
32,141,-249.93757559612214
33,179,-219.43962876843983
34,157,-342.7176699907238
35,363,-258.25269704045127
36,1000,-137.25545036899626
37,1000,-95.84242347026672
38,1000,-137.48938602976938
39,850,-314.3352286920124
40,337,-221.10400498963844
41,354,-194.80792730331677
42,333,-251.47418600098177
43,260,-178.7826681718845
44,895,-272.9367790122151
45,420,-211.55617711554618
46,1000,-228.670556601776
47,1000,-254.50984876429706
48,1000,-160.58119510297547
49,1000,-179.26598207709483
50,322,-257.5749587172688
51,1000,-169.46059716080563
52,463,-213.35053907084085
53,1000,-187.3866393860793
54,1000,-193.33403958613283
55,1000,-193.1139521595387
56,1000,-147.82238234105736
57,1000,-148.44033901475453
58,1000,-194.0910470206291
59,1000,-143.7098236318674
60,1000,-171.26520515066503
61,1000,-141.52669287604846
62,311,-664.0596842188252
63,1000,-193.19941335238508
64,1000,-194.68151896803806
65,1000,-166.01401851603526
66,1000,-193.26238816679495
67,1000,-254.11096819880916
68,1000,-208.43026460937125
69,1000,-186.3776893885978
70,1000,-198.7838221833953
71,1000,-214.7257072459428
72,1000,-223.25408544343364
73,950,-416.33275074828464
74,743,-310.41852074903335
75,1000,-253.83721270848866
76,865,-345.1634539781588
77,1000,-266.0305937482872
78,157,-197.8349789690222
79,1000,-161.94840107437736
80,979,-318.4476425892378
81,1000,-179.43603896041725
82,1000,-178.49355952898827
83,1000,-217.52035709109882
84,426,-232.93701023100886
85,429,-267.35945978221093
86,182,-146.10591528298363
87,1000,-324.1885183065491
88,1000,-151.44642471881693
89,99,-287.12832851590144
90,1000,-189.422833913736
91,1000,-209.72888868244118
92,523,-221.01937588982344
93,1000,-185.50039221791477
94,795,-257.119292325178
95,1000,-201.38793206025335
96,1000,-226.34629551929152
97,982,-345.8253825682836
98,1000,-192.6609034997603
99,856,-269.75091533320165
100,1000,-167.29605285146857
101,1000,-137.98125312034065
102,1000,-152.18505091746275
103,1000,-167.4279426126026
104,1000,-266.21001423211555
105,1000,-205.4011115321367
106,1000,-181.5748776577328
107,1000,-190.57386819097385
108,1000,-274.7591586725827
109,1000,-143.2921285798515
110,1000,-168.69483939506338
111,1000,-110.42271519245931
112,1000,-220.15176223250702
113,1000,-136.03160297814816
114,175,-316.50530101584235
115,1000,-132.80887019706043
116,484,-108.90671602032191
117,1000,-148.20000111675338
118,1000,-128.98356097988125
119,1000,-93.3970233377804
120,543,-240.7051323574284
121,247,-225.11331030556227
122,1000,-53.27533578772473
123,1000,-113.60438452643501
124,515,-177.0359540179009
125,970,72.63144385356934
126,100,-133.59122960636645
127,327,-107.37891842434546
128,1000,-65.23029300790579
129,1000,-17.41003579289576
130,1000,-87.7608393256488
131,1000,-72.73147540410834
132,1000,-49.41521628188254
133,1000,-126.54762118919695
134,1000,-84.14568415184925
135,1000,-91.78225040634248
136,1000,-147.62310093139098
137,1000,-151.44406739247043
138,1000,-109.90317412457304
139,1000,-158.2336630098855
140,1000,-192.91571881141414
141,1000,-161.8637489887551
142,723,-195.7964261184116
143,1000,-99.45330658911028
144,496,-188.42683089059085
145,474,-191.82779573987824
146,319,-116.63397317002676
147,1000,-725.6105371648257
148,62,-160.4414426240483
149,1000,-625.9688508966428
150,1000,-422.0285831093937
151,77,-129.1370538200855
152,1000,-218.04899481051214
153,1000,-297.0840282857141
154,1000,-226.7721202957864
155,1000,-183.76068332726263
156,1000,-208.46586780277062
157,1000,-86.09739475175239
158,1000,-146.1716715627784
159,1000,-209.1189538045955
160,1000,-195.79054689452906
161,1000,-213.50187177949306
162,1000,-201.03902724281042
163,1000,-229.60928553203956
164,1000,-237.85931132375026
165,1000,-160.76683543460027
166,109,-163.80389860441318
167,348,-365.18464522933834
168,184,-371.2498308364742
169,1000,-252.394544414387
170,1000,-118.58884367503015
171,433,-59.001660535868005
172,253,-185.6326468458537
173,154,-123.21013629356419
174,1000,-165.0258043170371
175,1000,-139.08422069810595
176,1000,-144.34240025057792
177,1000,-121.06911402243533
178,1000,-112.69850419108849
179,389,-130.2112433989755
180,1000,-92.10342439715708
181,1000,-224.93293392988627
182,583,-353.7629581548913
183,1000,-187.7847770244197
184,1000,-133.8525899213234
185,1000,-60.34987341695769
186,1000,-83.91501948855297
187,99,-316.24819102465176
188,267,-22.270701556048067
189,188,-100.63962335425029
190,206,-142.44885965509997
191,114,-588.5745577369075
192,94,-322.1634315455809
193,866,-565.1154064180957
194,1000,-303.75878101910774
195,1000,-291.286617451717
196,1000,-274.8743767897432
197,1000,-188.88503567321362
198,1000,-187.86329155765964
199,1000,-216.73726329615877
200,265,-229.26666855353653
201,1000,-184.8705097985752
202,705,-275.0120220004397
203,661,-266.4431231703462
204,331,-240.49714428353863
205,789,-416.60120463248643
206,187,-358.2010242462576
207,93,-334.8346654042383
208,286,-366.9990542239921
209,388,-347.71935476535475
210,302,-273.7138176489534
211,149,-236.8323945648306
212,439,-210.2940833402564
213,286,-181.3567607521972
214,542,-258.70787720435453
215,346,-250.20009505261126
216,454,-223.16938989672826
217,657,-245.15439385054736
218,368,-192.14122493232873
219,79,-559.2059236462042
220,372,-262.71444586958836
221,549,-472.800776511384
222,1000,-130.0439786268474
223,93,-212.25214879824895
224,160,-188.96312101191037
225,270,-94.20981904104951
226,1000,-171.53203517873723
227,883,-304.8663986852165
228,1000,-178.99053193955075
229,1000,-219.23266949535866
230,1000,-296.66037484381286
231,332,-217.1676608700501
232,1000,-187.7156385827601
233,1000,-66.95068669892129
234,1000,-98.10153400805271
235,1000,-78.75883456314983
236,1000,-42.04680735388891
237,1000,-87.51698844277047
238,1000,-84.39018280451137
239,198,-159.09088193900547
240,488,-268.9358796603378
241,362,-370.04291616055076
242,325,-228.07952430733346
243,1000,-61.556393617370475
244,149,-166.9042044389427
245,612,-307.0357844822684
246,236,-472.87396404547303
247,190,-264.9339375997971
248,169,-250.37055853200246
249,1000,-141.57993659155255
250,1000,-138.15676667358377
251,160,-228.42044422222875
252,1000,-187.25047079271894
253,243,-351.82880248292406
254,289,-225.8797927335064
255,178,-237.25953107199254
256,211,-139.17890264397425
257,197,-269.1344826872519
258,1000,-137.1658767292334
259,242,-222.45123249269142
260,232,-276.2219695105122
261,1000,-196.7914028857936
262,125,-159.53019097392868
263,226,-236.474768339692
264,433,-270.2868685540296
265,489,-238.24475477859417
266,513,-262.13441078334114
267,157,-145.8388720466118
268,245,-182.00512442785657
269,560,-253.033640756676
270,264,-267.2385716569622
271,254,-309.07083804959245
272,242,-314.7873987049288
273,510,-313.83670332035695
274,441,-276.8881610774668
275,671,-363.6606463025013
276,251,-226.62723814781754
277,963,-419.7426400333381
278,1000,-134.10519448079478
279,1000,-125.61882629978483
280,1000,-110.51324757812456
281,1000,-127.19307555072966
282,824,-267.1507228189049
283,1000,-150.63794984614555
284,1000,-214.81435051180623
285,1000,-224.73682318572548
286,1000,-97.8662733586229
287,1000,-66.96316374564891
288,1000,-137.1212686670994
289,1000,-123.33488195965047
290,1000,-108.49849018200553
291,1000,-71.72974830124416
292,168,-170.1895164025924
293,1000,-142.3980044959029
294,1000,-183.62067780456513
295,491,-175.42205569637935
296,159,-252.6124332971939
297,102,-283.1206832062382
298,1000,-199.37067256076347
299,1000,-149.32430668302268
300,807,-286.63902856017046
301,207,-71.50959072346377
302,186,-282.40386963300386
303,1000,-92.00484712516163
304,343,-89.25924458997497
305,498,-153.65042928459664
306,287,-142.72753319019236
307,181,-208.03396508250762
308,364,-368.5580616478251
309,143,-213.3198920606809
310,214,-319.56150055769245
311,187,-242.97761219155413
312,596,-307.2384121972141
313,295,-283.62617986899306
314,1000,-274.23186932657507
315,203,-184.53283210847826
316,243,-257.3792149989847
317,891,-293.98835538200416
318,1000,-186.97715214805532
319,431,-339.8080458154873
320,130,-158.98080586260474
321,106,-247.0971240609154
322,116,-269.9678452960977
323,222,-216.6153375747753
324,224,-190.0581970940189
325,410,-393.90340166138304
326,283,-204.37640907407865
327,304,-307.30288250862316
328,217,-99.77356628080622
329,201,-158.4657166780397
330,248,-430.24236637599927
331,751,-244.1803396719304
332,564,-80.36130769627536
333,362,-268.4315404724014
334,363,-142.08455242672312
335,103,-210.0952761260255
336,898,-323.51094429968344
337,384,-127.15840279481192
338,1000,-169.64359216072702
339,1000,-218.87895439104983
340,987,-219.67192104519157
341,608,-197.51757829819422
342,593,-216.06741581753465
343,256,-112.549706474645
344,581,-275.44148234846244
345,604,-208.79453525476927
346,459,-197.86005015180524
347,433,-266.65928412192943
348,1000,-112.30652818023614
349,1000,-153.90603658182897
350,1000,-102.53217056605578
351,459,-193.1342306322885
352,944,-243.23226318320087
353,1000,-104.3478372814906
354,1000,-138.32341250905998
355,1000,-130.7207972021867
356,1000,-92.49877356270602
357,1000,-116.58106970922519
358,1000,-101.86867497919862
359,1000,-96.19443984991796
360,1000,-151.12124396154334
361,244,-144.40756373397704
362,1000,-141.81606006038535
363,1000,-185.399083669358
364,1000,-143.7065227127659
365,1000,-181.23669889780973
366,1000,-186.695361304708
367,1000,-215.3810314912978
368,1000,-154.06489984889737
369,1000,-172.5271043438072
370,1000,-125.44247574780718
371,1000,-193.47210067265135
372,275,-435.1490512822032
373,1000,-129.78098401967972
374,1000,-70.80797877503817
375,1000,-110.62151114496918
376,1000,-124.6032780144171
377,1000,-146.13134027632933
378,1000,-77.20162251640339
379,1000,-134.14726378350016
380,1000,-115.38055367914794
381,305,-288.20137827806866
382,249,-505.9648091775422
383,1000,-54.620479023225215
384,587,-359.1004230481578
385,840,-452.996895986001
386,840,-475.15810524715715
387,1000,-96.72466214858265
388,1000,-153.54932207103974
389,325,-438.56296835858575
390,255,-333.9001980424189
391,518,-319.11162330116565
392,1000,-89.59048971743526
393,1000,-134.09948167255962
394,1000,-136.2021970016615
395,1000,-124.4881251932562
396,975,-231.71435593179527
397,1000,-98.50841584062965
398,198,-154.66215929056213
399,542,-234.07502219832926
400,339,-232.74162264051287
401,320,-380.90507626806834
402,294,-435.9162062122317
403,373,-158.65532458139654
404,856,-347.05491251236566
405,644,-717.4575048084831
406,659,-522.8501396785954
407,273,-365.4665995778494
408,533,-572.0502737839358
409,1000,-253.26933320347268
410,417,-285.9564310148759
411,422,-221.28192751901264
412,141,-315.46054488712906
413,194,-395.7148827656839
414,751,-244.4866623695051
415,272,-183.8191854507338
416,275,-216.5093284522866
417,287,-300.2600426949042
418,185,-251.23402033664806
419,209,-210.89015478734387
420,368,-316.2736833056013
421,114,-307.038087831324
422,427,-309.5325030623647
423,547,-462.322647793573
424,182,-227.3968859893718
425,898,-499.19661883103
426,636,-637.1739613859012
427,399,-311.4594743247055
428,1000,-365.13634375610224
429,1000,-262.93715141865704
430,1000,-304.6210006912689
431,1000,-279.99890892875186
432,1000,-201.02994944186943
433,1000,-264.52154691250854
434,1000,-231.68787240068826
435,1000,-140.16839371748532
436,1000,-114.49108163563646
437,349,-543.6147703609768
438,734,-523.9975714063648
439,1000,-132.3247889470414
440,380,-250.7131561310525
441,548,-288.2285507674434
442,687,-281.15505154745927
443,482,-222.07473046483793
444,1000,-211.62894928772053
445,364,-347.4410049966263
446,397,-179.99812124720253
447,562,-245.1515498045435
448,1000,-191.1934863714768
449,1000,-107.1817531602959
450,1000,-90.30336831915919
451,1000,-113.20513333395095
452,1000,-68.52024587316245
453,1000,-178.92842370736244
454,1000,-185.9389251944644
455,229,-203.20894449849317
456,1000,-203.497372224137
457,1000,-188.8414980517716
458,1000,-230.95081703229803
459,1000,-206.4257347003671
460,1000,-187.79310351226167
461,1000,-198.44531400517803
462,1000,-156.2341531038022
463,198,-285.8856893441274
464,1000,-158.2379543966305
465,1000,-191.19671634376087
466,1000,-139.4680936271415
467,1000,-134.5082944831944
468,1000,-158.674910488792
469,212,-725.5581050960867
470,1000,-159.92781460338148
471,1000,-156.49621327329345
472,1000,-176.4142016548123
473,1000,-159.74095032234737
474,1000,-204.18845096397456
475,99,-203.41879537904327
476,209,-241.60616740483007
477,1000,-125.03412752747377
478,1000,-159.35842075669896
479,1000,-173.73093735278061
480,1000,-177.06022661872237
481,1000,-146.34767543974527
482,1000,-142.91098245655834
483,1000,-111.71817966094959
484,1000,-140.01522963266729
485,1000,-178.63054354518843
486,1000,-159.90959431364044
487,1000,-168.1037525145102
488,1000,-183.71024564322562
489,257,-723.1708109281175
490,368,-244.0035928234129
491,230,-277.3303517128144
492,131,-473.31043720493
493,321,-272.12070685121904
494,648,-360.52714024803214
495,761,-287.51814716627734
496,1000,-223.92085606892272
497,816,-300.8728541151896
498,254,-129.29851849386404
499,1000,-255.37098609989155
500,1000,-192.64654311157992
501,1000,-177.63341529706838
502,1000,-190.3662971032581
503,1000,-154.8249640400279
504,1000,-157.3573319382465
505,1000,-188.1638621436899
506,343,-484.56840485685706
507,388,-79.47967340671613
508,1000,-124.76028245501556
509,1000,-90.09363375717578
510,1000,-136.99244442364096
511,487,-126.87000358225467
512,349,-250.1793713371639
513,822,-618.0795092837179
514,164,-339.3834460460049
515,1000,-135.32073495685296
516,736,-337.87741561101745
517,916,-259.0834432449989
518,193,-389.0122544072488
519,202,-449.8934081511338
520,454,-170.90447412585135
521,391,-206.6746002429245
522,430,-194.34302108597873
523,900,-268.65792051779056
524,960,-503.2387792797198
525,1000,-214.73811847288673
526,1000,-154.11188082953095
527,702,-303.23443811422084
528,104,-476.2263433648353
529,324,-296.0891099958041
530,348,-378.2641695854244
531,819,-336.69246466407867
532,1000,-220.29891683393504
533,118,-175.6181057859108
534,761,-350.31230336394924
535,809,-483.1130084155569
536,182,-487.9541589761921
537,175,-248.49251027947005
538,616,-389.4749261286932
539,280,-317.0720808272643
540,1000,-190.19996340280997
541,573,-281.4425173044549
542,1000,-166.80193711755555
543,1000,-140.0252937669013
544,1000,-151.87725460179442
545,1000,-109.40460102902941
546,1000,-124.4542437630602
547,1000,-115.51669170253206
548,1000,-86.6170443033929
549,536,-183.3260316350927
550,992,-379.80020123333895
551,169,-248.69647741121858
552,179,-136.54077845012915
553,313,-238.63956274140307
554,297,-284.4803695420427
555,398,-299.8276380064905
556,254,-381.4549848195788
557,405,-287.0187302967952
558,172,-192.8501167370154
559,363,-179.5837941214946
560,187,-86.45563265381324
561,1000,-331.44881252147707
562,1000,-299.2510147671001
563,1000,-298.9231110938702
564,517,-270.35400470130037
565,1000,-229.27499569691304
566,1000,-185.12887289077545
567,968,-295.665256346953
568,333,-297.11081310246993
569,312,-243.75977996423455
570,296,-347.28059033098
571,500,-432.1662367675597
572,1000,-243.709733371639
573,1000,-225.83549057033122
574,1000,-348.24403204202014
575,222,-241.80790196451338
576,1000,-128.00460289062778
577,1000,-187.15300586830398
578,956,29.621943061955307
579,1000,-42.281055823376185
580,1000,-90.889879482358
581,1000,-103.48661274784847
582,1000,-80.2978523226667
583,1000,-65.17158747594566
584,1000,-78.87771642558221
585,1000,-88.76036647514297
586,1000,-133.24515829261833
587,1000,-138.2823680256471
588,1000,-106.30651062387089
589,1000,-128.46786725817765
590,1000,-99.05107829018024
591,1000,-59.54988715959345
592,1000,-68.56324444075803
593,1000,-64.91503392548132
594,1000,-60.317846895575464
595,1000,-38.97479210139979
596,1000,-117.4438478191824
597,73,-285.2245084186112
598,1000,-204.73035581714976
599,1000,-150.96085218033858
600,1000,-141.680655966391
601,1000,-104.08957630219908
602,1000,-165.5609253301986
603,1000,-186.19652788313581
604,1000,-162.2928754621742
605,1000,-163.33078380353456
606,291,-266.740844517143
607,327,-191.6347283494569
608,554,-233.9690465255601
609,467,-190.61823423766987
610,331,-152.7352179421241
611,1000,-202.72745394465025
612,1000,-154.75665298849256
613,128,-330.66804535482527
614,1000,-153.2023407486306
615,1000,-128.70555237919405
616,685,-266.1703028961578
617,1000,-154.02909108805346
618,1000,-155.3622976374446
619,1000,-124.1529129574063
620,826,-269.9733231102178
621,222,-298.01287832292127
622,595,-209.38980321852566
623,272,-201.50702212575243
624,1000,-129.53346644586162
625,615,-333.46401096574925
626,487,-133.28232303224482
627,1000,-128.0114058802822
628,767,-297.73163735502976
629,1000,-113.31080863723744
630,954,-117.1234229178383
631,1000,-62.1543930871966
632,150,-78.86220580956271
633,912,-194.60324168498735
634,1000,-137.2254066884775
635,235,-86.44605045798787
636,812,-176.5283655949981
637,1000,-83.48604656153807
638,1000,-109.68361947307152
639,429,-64.3136174072633
640,1000,-128.36224321279354
641,1000,-138.64763462561604
642,1000,-177.15314413147195
643,1000,-179.17147330773494
644,413,-495.8870925321776
645,1000,-165.2589905341218
646,1000,-152.716060555009
647,1000,-178.3051459414536
648,422,-400.97828971237374
649,119,-172.05366502379076
650,1000,-91.46491404787189
651,463,-216.14277009853043
652,1000,-182.9209058081826
653,1000,-125.11345062657753
654,1000,-136.60767614407197
655,1000,-155.9650993056276
656,1000,-152.35877820289514
657,1000,-175.45223641313459
658,1000,-173.98922965273573
659,810,-254.87285416655035
660,551,-205.17506245627982
661,1000,-155.31107385096604
662,1000,-169.39068984011487
663,1000,-177.6754550156055
664,1000,-161.7708158761824
665,1000,-182.58352621337232
666,1000,-199.24910418049126
667,609,-275.4822435492738
668,1000,-136.31370177838062
669,462,-245.2078766719265
670,419,-239.81539291846917
671,761,-302.567395431557
672,1000,-186.848831344783
673,1000,-158.14326664923016
674,278,-419.44623588248425
675,1000,-211.7748925868029
676,355,-388.059251104355
677,351,-250.5501514648816
678,522,-364.52693976925684
679,413,-371.12540252960054
680,1000,-263.32087075858095
681,230,-412.6210360448532
682,1000,-242.16846009761707
683,1000,-160.27489701239068
684,1000,-167.3934966629396
685,1000,-185.2391670063844
686,1000,-161.00172696663392
687,1000,-131.34427531329396
688,1000,-110.98415200244423
689,1000,-126.44610368693942
690,1000,-143.08910664081668
691,1000,-120.13561622707147
692,1000,-93.28075136071564
693,1000,-116.86274106492377
694,1000,-105.01997510862711
695,1000,-82.20353109835487
696,1000,-85.24296304710023
697,265,-265.30618594715986
698,833,-266.523464074588
699,424,-150.30993332051204
700,468,-204.16419264774538
701,1000,-163.2586618362433
702,895,-466.11438586638974
703,168,-311.3445813029223
704,1000,-237.704652429358
705,1000,-166.2455015298444
706,1000,-121.19534718136131
707,429,-683.1894234213822
708,232,-242.70048676808736
709,609,-632.4327766724375
710,131,-602.6893274819568
711,1000,-296.64235236083215
712,1000,-337.3422728587436
713,1000,-236.05125813877382
714,1000,-221.2510628959718
715,1000,-237.196175751233
716,1000,-242.56857588011104
717,1000,-180.51106061546074
718,1000,-198.787061259116
719,1000,-147.0847603586826
720,1000,-234.19839287789924
721,1000,-155.99786885160978
722,1000,-159.13001832532706
723,1000,-151.8168492349682
724,1000,-169.89500163679378
725,1000,-161.45761179992033
726,1000,-135.64206163936237
727,1000,-89.72597578892874
728,1000,-195.19773799299054
729,1000,-96.71726233159019
730,1000,-183.57386547635656
731,1000,-158.04405980040235
732,1000,-149.3805147907859
733,1000,-165.70233426943744
734,1000,-188.9466007028665
735,1000,-124.57744035119543
736,1000,-156.74222193983812
737,1000,-159.02093346855702
738,1000,-130.22259486617443
739,1000,-194.3082870354865
740,478,-227.541827523638
741,102,-188.8236450750374
742,524,-222.85349705585406
743,1000,-186.04703814230342
744,122,-191.19852338593836
745,1000,-206.7440138643106
746,306,-429.02455972281103
747,532,-402.2256696236914
748,308,-362.65092865564986
749,332,-350.6382800957471
750,206,-192.752356157507
751,126,-206.24215613900503
752,327,-373.77390441493515
753,611,-510.1315768283899
754,132,-154.36040547668372
755,406,-402.7186191188698
756,137,-240.14706939001164
757,263,-383.4540048727083
758,345,-323.5442169097428
759,486,-495.47487744803504
760,164,-193.3578234676949
761,137,-174.7138326592139
762,131,-175.0404159630309
763,149,-167.05767273167646
764,430,-221.91271414105813
765,811,-346.0566011129828
766,273,-190.63847087150378
767,170,-125.41926523764847
768,402,-240.76923952083848
769,635,-244.68893103844738
770,929,-271.99570334855855
771,1000,-218.4596720590735
772,1000,-185.77949463609707
773,1000,-165.3109119534875
774,1000,-173.62508846455998
775,1000,-262.551713540937
776,1000,-215.5392005211182
777,1000,-220.17670357857537
778,1000,-209.6724943894736
779,1000,-161.91066941798996
780,1000,-169.00857141255162
781,1000,-193.34205723179113
782,1000,-180.0929312121468
783,1000,-192.20906470965576
784,1000,-175.87371350059726
785,1000,-232.08075028959746
786,1000,-235.03732071545946
787,976,-536.4107115388892
788,118,-257.8288474335184
789,1000,-228.53370502690314
790,1000,-192.86542724411876
791,1000,-179.5673600376919
792,1000,-206.12680725084488
793,1000,-209.9980783452723
794,1000,-104.28258423593066
795,1000,-82.75372157001233
796,1000,-142.62713169153005
797,1000,-129.28071052171853
798,265,-170.54317009898793
799,196,-310.3312834193339
800,154,-132.24490790523075
801,1000,-206.91382619873335
802,1000,-98.79478796431981
803,340,-269.6836425998074
804,1000,-195.00235579953355
805,1000,-176.9929023712962
806,1000,-133.56071902468233
807,1000,-141.48990616316848
808,1000,-130.6843206875151
809,1000,-131.6182002978483
810,1000,-167.02688437176113
811,1000,-73.5661974343002
812,1000,-71.45259111945491
813,1000,-92.89324190614511
814,1000,-57.381656321911194
815,237,-331.0061255007381
816,1000,-68.56167173590195
817,1000,-90.07971523034396
818,163,-269.223885911333
819,262,-95.26374134936297
820,289,-172.71897081784397
821,281,-111.55277995004228
822,283,-122.51376542701327
823,1000,-52.48032835900458
824,1000,-47.67781320058027
825,1000,-57.17909751722537
826,1000,-101.56556822134338
827,210,3.672120408633049
828,1000,-90.45650152046082
829,191,-85.03309057447768
830,234,-183.5333295094738
831,189,-204.2514018355409
832,1000,-62.766925499572
833,193,-178.71555092693936
834,690,-544.8713176516715
835,1000,-269.90536727071657
836,1000,-185.7823709546417
837,1000,-260.6964617129588
838,1000,-179.8351353961205
839,1000,-188.70690466249417
840,370,-251.29757287855895
841,256,-164.59531395347594
842,161,-183.00441048835546
843,222,-143.93887106155609
844,233,-28.014323249348877
845,585,-184.792763073556
846,475,-219.4722512435025
847,140,-141.74783285295504
848,224,-114.20621423831645
849,300,-202.93327857461554
850,942,-210.64429331057633
851,1000,-297.60682123196847
852,689,-561.862548767808
853,432,-520.859625858958
854,659,-464.8183655697032
855,357,-352.06615036017007
856,425,-393.1072250077279
857,429,-436.0239205378997
858,386,-344.2381397415516
859,590,-651.7027951194267
860,642,-361.7580362110836
861,348,-497.0974457381504
862,349,-453.05248416185816
863,210,-224.47587217648504
864,244,-227.27448472651753
865,172,-193.73547610274397
866,161,-169.6708873036311
867,228,-190.02109147999278
868,325,-435.75000760179375
869,281,-244.86983730039483
870,301,-367.8726330970215
871,355,-249.40135652526757
872,280,-331.6942560109322
873,318,-204.56657235441963
874,521,-140.5608033801588
875,486,-214.30886803746904
876,290,-225.74037766310892
877,320,-234.8834983672835
878,458,-181.84702310567252
879,381,-184.4546677232159
880,559,-166.16655979328962
881,1000,-104.69636198553388
882,242,-99.86862756629756
883,287,-154.94957071185163
884,1000,-87.87689487259158
885,265,-65.62032207146893
886,1000,-110.38008376782875
887,1000,-39.49558478290115
888,440,-163.15059845605612
889,459,-167.74504143685493
890,1000,-144.08665900631013
891,1000,-98.36148515794197
892,1000,-99.9397657051225
893,1000,-90.4036717512294
894,394,-163.0089436291891
895,669,-190.22193424110137
896,599,-220.67265568238196
897,931,-240.31287672988253
898,922,-206.5031270303976
899,185,-292.159020186533
900,549,-271.19819567010893
901,960,-219.89995982575527
902,547,-329.0575024617134
903,594,-640.8811677728323
904,598,189.76497038549797
905,555,168.6179422147078
906,734,-489.0383362566857
907,718,-98.14715019077535
908,673,-173.2769372331444
909,441,-211.81202344553748
910,263,-357.91393921427584
911,389,-231.87132165961842
912,457,-505.3176748939473
913,607,-223.82231782263423
914,241,-173.07286490755868
915,925,-402.3380186298599
916,415,-360.6855731284088
917,283,-152.27996295351105
918,144,-186.91014622501535
919,386,-368.69584640898063
920,620,-307.9346157864487
921,471,-96.71502239289575
922,656,-329.384965630568
923,446,-305.7121228405656
924,580,-655.5033575788275
925,1000,-355.55725131994603
926,1000,-184.09276967079177
927,713,-450.94260325938535
928,551,-394.1697163223001
929,1000,-333.4668899814422
930,697,-505.0067178038829
931,1000,-307.85564522323205
932,1000,-278.814296058042
933,729,-459.55502177438103
934,351,-359.6543815621774
935,396,-332.16141226801926
936,602,-445.62226258352064
937,315,-279.04073199336193
938,138,-312.59416518760224
939,878,-404.07432362072086
940,322,-185.48258346176033
941,405,-192.04004376292653
942,340,-121.04218851755255
943,1000,-133.93996562554238
944,469,-183.5184146122983
945,151,-139.5559581154285
946,529,-566.2794675554724
947,210,-245.46970048145053
948,122,-339.5596357671683
949,121,-293.44880391583774
950,211,-345.49133366695423
