episodes,steps,rewards
0,200,-200.0
1,200,-200.0
2,200,-200.0
3,200,-200.0
4,200,-200.0
5,200,-200.0
6,200,-200.0
7,200,-200.0
8,200,-200.0
9,200,-200.0
10,200,-200.0
11,200,-200.0
12,200,-200.0
13,200,-200.0
14,200,-200.0
15,200,-200.0
16,200,-200.0
17,200,-200.0
18,200,-200.0
19,200,-200.0
20,200,-200.0
21,200,-200.0
22,200,-200.0
23,200,-200.0
24,200,-200.0
25,200,-200.0
26,200,-200.0
27,200,-200.0
28,200,-200.0
29,200,-200.0
30,200,-200.0
31,200,-200.0
32,200,-200.0
33,200,-200.0
34,200,-200.0
35,200,-200.0
36,200,-200.0
37,200,-200.0
38,200,-200.0
39,200,-200.0
40,200,-200.0
41,200,-200.0
42,200,-200.0
43,200,-200.0
44,200,-200.0
45,200,-200.0
46,200,-200.0
47,200,-200.0
48,200,-200.0
49,200,-200.0
50,200,-200.0
51,200,-200.0
52,200,-200.0
53,200,-200.0
54,200,-200.0
55,200,-200.0
56,200,-200.0
57,200,-200.0
58,200,-200.0
59,200,-200.0
60,200,-200.0
61,200,-200.0
62,200,-200.0
63,200,-200.0
64,200,-200.0
65,200,-200.0
66,200,-200.0
67,200,-200.0
68,200,-200.0
69,200,-200.0
70,200,-200.0
71,200,-200.0
72,200,-200.0
73,200,-200.0
74,200,-200.0
75,200,-200.0
76,200,-200.0
77,200,-200.0
78,200,-200.0
79,200,-200.0
80,200,-200.0
81,200,-200.0
82,200,-200.0
83,200,-200.0
84,200,-200.0
85,200,-200.0
86,200,-200.0
87,200,-200.0
88,200,-200.0
89,200,-200.0
90,200,-200.0
91,200,-200.0
92,200,-200.0
93,200,-200.0
94,200,-200.0
95,200,-200.0
96,200,-200.0
97,200,-200.0
98,200,-200.0
99,200,-200.0
100,200,-200.0
101,200,-200.0
102,200,-200.0
103,200,-200.0
104,200,-200.0
105,200,-200.0
106,200,-200.0
107,200,-200.0
108,200,-200.0
109,200,-200.0
110,200,-200.0
111,200,-200.0
112,200,-200.0
113,200,-200.0
114,200,-200.0
115,200,-200.0
116,200,-200.0
117,200,-200.0
118,200,-200.0
119,200,-200.0
120,200,-200.0
121,200,-200.0
122,200,-200.0
123,200,-200.0
124,200,-200.0
125,200,-200.0
126,200,-200.0
127,200,-200.0
128,200,-200.0
129,200,-200.0
130,200,-200.0
131,200,-200.0
132,200,-200.0
133,200,-200.0
134,200,-200.0
135,200,-200.0
136,200,-200.0
137,200,-200.0
138,200,-200.0
139,200,-200.0
140,200,-200.0
141,200,-200.0
142,200,-200.0
143,200,-200.0
144,200,-200.0
145,200,-200.0
146,200,-200.0
147,200,-200.0
148,200,-200.0
149,200,-200.0
150,200,-200.0
151,200,-200.0
152,200,-200.0
153,200,-200.0
154,200,-200.0
155,200,-200.0
156,200,-200.0
157,200,-200.0
158,200,-200.0
159,200,-200.0
160,200,-200.0
161,200,-200.0
162,200,-200.0
163,200,-200.0
164,200,-200.0
165,200,-200.0
166,200,-200.0
167,200,-200.0
168,200,-200.0
169,200,-200.0
170,200,-200.0
171,200,-200.0
172,200,-200.0
173,200,-200.0
174,200,-200.0
175,200,-200.0
176,200,-200.0
177,200,-200.0
178,200,-200.0
179,200,-200.0
180,182,-182.0
181,200,-200.0
182,200,-200.0
183,200,-200.0
184,200,-200.0
185,200,-200.0
186,200,-200.0
187,200,-200.0
188,200,-200.0
189,200,-200.0
190,200,-200.0
191,200,-200.0
192,200,-200.0
193,200,-200.0
194,200,-200.0
195,200,-200.0
196,200,-200.0
197,200,-200.0
198,200,-200.0
199,200,-200.0
200,200,-200.0
201,200,-200.0
202,200,-200.0
203,200,-200.0
204,200,-200.0
205,200,-200.0
206,200,-200.0
207,200,-200.0
208,200,-200.0
209,200,-200.0
210,200,-200.0
211,120,-120.0
212,200,-200.0
213,200,-200.0
214,200,-200.0
215,200,-200.0
216,200,-200.0
217,200,-200.0
218,200,-200.0
219,200,-200.0
220,200,-200.0
221,200,-200.0
222,200,-200.0
223,172,-172.0
224,200,-200.0
225,200,-200.0
226,200,-200.0
227,173,-173.0
228,200,-200.0
229,131,-131.0
230,200,-200.0
231,200,-200.0
232,200,-200.0
233,174,-174.0
234,200,-200.0
235,199,-199.0
236,200,-200.0
237,200,-200.0
238,188,-188.0
239,200,-200.0
240,200,-200.0
241,185,-185.0
242,194,-194.0
243,163,-163.0
244,200,-200.0
245,133,-133.0
246,200,-200.0
247,200,-200.0
248,200,-200.0
249,200,-200.0
250,200,-200.0
251,200,-200.0
252,200,-200.0
253,200,-200.0
254,200,-200.0
255,200,-200.0
256,200,-200.0
257,200,-200.0
258,176,-176.0
259,200,-200.0
260,200,-200.0
261,200,-200.0
262,200,-200.0
263,200,-200.0
264,200,-200.0
265,200,-200.0
266,200,-200.0
267,200,-200.0
268,200,-200.0
269,194,-194.0
270,176,-176.0
271,200,-200.0
272,200,-200.0
273,200,-200.0
274,200,-200.0
275,200,-200.0
276,200,-200.0
277,190,-190.0
278,200,-200.0
279,168,-168.0
280,200,-200.0
281,105,-105.0
282,200,-200.0
283,200,-200.0
284,200,-200.0
285,200,-200.0
286,200,-200.0
287,200,-200.0
288,200,-200.0
289,170,-170.0
290,200,-200.0
291,200,-200.0
292,200,-200.0
293,184,-184.0
294,200,-200.0
295,200,-200.0
296,200,-200.0
297,174,-174.0
298,200,-200.0
299,200,-200.0
300,200,-200.0
301,184,-184.0
302,171,-171.0
303,200,-200.0
304,174,-174.0
305,171,-171.0
306,95,-95.0
307,104,-104.0
308,200,-200.0
309,200,-200.0
310,160,-160.0
311,106,-106.0
312,200,-200.0
313,200,-200.0
314,200,-200.0
315,200,-200.0
316,200,-200.0
317,92,-92.0
318,200,-200.0
319,200,-200.0
320,100,-100.0
321,200,-200.0
322,200,-200.0
323,95,-95.0
324,190,-190.0
325,91,-91.0
326,200,-200.0
327,200,-200.0
328,200,-200.0
329,200,-200.0
330,200,-200.0
331,200,-200.0
332,200,-200.0
333,200,-200.0
334,200,-200.0
335,200,-200.0
336,200,-200.0
337,200,-200.0
338,200,-200.0
339,200,-200.0
340,200,-200.0
341,139,-139.0
342,200,-200.0
343,200,-200.0
344,200,-200.0
345,200,-200.0
346,200,-200.0
347,200,-200.0
348,200,-200.0
349,200,-200.0
350,200,-200.0
351,200,-200.0
352,200,-200.0
353,200,-200.0
354,168,-168.0
355,134,-134.0
356,170,-170.0
357,136,-136.0
358,200,-200.0
359,200,-200.0
360,200,-200.0
361,200,-200.0
362,200,-200.0
363,200,-200.0
364,168,-168.0
365,137,-137.0
366,155,-155.0
367,199,-199.0
368,148,-148.0
369,200,-200.0
370,145,-145.0
371,164,-164.0
372,169,-169.0
373,200,-200.0
374,200,-200.0
375,200,-200.0
376,200,-200.0
377,200,-200.0
378,200,-200.0
379,144,-144.0
380,173,-173.0
381,148,-148.0
382,89,-89.0
383,200,-200.0
384,200,-200.0
385,144,-144.0
386,155,-155.0
387,151,-151.0
388,200,-200.0
389,108,-108.0
390,157,-157.0
391,90,-90.0
392,189,-189.0
393,191,-191.0
394,166,-166.0
395,200,-200.0
396,200,-200.0
397,158,-158.0
398,200,-200.0
399,197,-197.0
400,200,-200.0
401,200,-200.0
402,200,-200.0
403,170,-170.0
404,172,-172.0
405,200,-200.0
406,177,-177.0
407,161,-161.0
408,99,-99.0
409,169,-169.0
410,200,-200.0
411,200,-200.0
412,200,-200.0
413,182,-182.0
414,111,-111.0
415,200,-200.0
416,154,-154.0
417,147,-147.0
418,200,-200.0
419,200,-200.0
420,167,-167.0
421,164,-164.0
422,160,-160.0
423,200,-200.0
424,200,-200.0
425,200,-200.0
426,179,-179.0
427,200,-200.0
428,200,-200.0
429,156,-156.0
430,200,-200.0
431,168,-168.0
432,153,-153.0
433,200,-200.0
434,145,-145.0
435,142,-142.0
436,148,-148.0
437,148,-148.0
438,147,-147.0
439,146,-146.0
440,145,-145.0
441,153,-153.0
442,155,-155.0
443,144,-144.0
444,150,-150.0
445,141,-141.0
446,143,-143.0
447,142,-142.0
448,138,-138.0
449,140,-140.0
450,138,-138.0
451,139,-139.0
452,149,-149.0
453,142,-142.0
454,136,-136.0
455,158,-158.0
456,153,-153.0
457,154,-154.0
458,151,-151.0
459,200,-200.0
460,165,-165.0
461,171,-171.0
462,200,-200.0
463,200,-200.0
464,152,-152.0
465,173,-173.0
466,200,-200.0
467,137,-137.0
468,164,-164.0
469,152,-152.0
470,150,-150.0
471,200,-200.0
472,200,-200.0
473,200,-200.0
474,147,-147.0
475,200,-200.0
476,164,-164.0
477,200,-200.0
478,180,-180.0
479,109,-109.0
480,94,-94.0
481,90,-90.0
482,200,-200.0
483,200,-200.0
484,200,-200.0
485,162,-162.0
486,100,-100.0
487,95,-95.0
488,200,-200.0
489,200,-200.0
490,152,-152.0
491,163,-163.0
492,200,-200.0
493,160,-160.0
494,200,-200.0
495,163,-163.0
496,200,-200.0
497,200,-200.0
498,167,-167.0
499,149,-149.0
500,159,-159.0
501,200,-200.0
502,93,-93.0
503,200,-200.0
504,200,-200.0
505,200,-200.0
506,171,-171.0
507,135,-135.0
508,171,-171.0
509,132,-132.0
510,200,-200.0
511,200,-200.0
512,169,-169.0
513,200,-200.0
514,193,-193.0
515,102,-102.0
516,105,-105.0
517,189,-189.0
518,180,-180.0
519,200,-200.0
520,140,-140.0
521,200,-200.0
522,96,-96.0
523,171,-171.0
524,157,-157.0
525,179,-179.0
526,164,-164.0
527,168,-168.0
528,200,-200.0
529,200,-200.0
530,162,-162.0
531,96,-96.0
532,92,-92.0
533,107,-107.0
534,164,-164.0
535,91,-91.0
536,200,-200.0
537,189,-189.0
538,176,-176.0
539,92,-92.0
540,94,-94.0
541,100,-100.0
542,164,-164.0
543,98,-98.0
544,92,-92.0
545,102,-102.0
546,115,-115.0
547,165,-165.0
548,169,-169.0
549,167,-167.0
550,165,-165.0
551,166,-166.0
552,194,-194.0
553,147,-147.0
554,190,-190.0
555,149,-149.0
556,150,-150.0
557,158,-158.0
558,155,-155.0
559,146,-146.0
560,143,-143.0
561,161,-161.0
562,160,-160.0
563,143,-143.0
564,148,-148.0
565,154,-154.0
566,103,-103.0
567,150,-150.0
568,101,-101.0
569,157,-157.0
570,154,-154.0
571,198,-198.0
572,175,-175.0
573,103,-103.0
574,91,-91.0
575,157,-157.0
576,147,-147.0
577,120,-120.0
578,95,-95.0
579,143,-143.0
580,106,-106.0
581,159,-159.0
582,94,-94.0
583,143,-143.0
584,148,-148.0
585,142,-142.0
586,191,-191.0
587,148,-148.0
588,84,-84.0
589,155,-155.0
590,88,-88.0
591,106,-106.0
592,178,-178.0
593,86,-86.0
594,159,-159.0
595,107,-107.0
596,200,-200.0
597,84,-84.0
598,149,-149.0
599,153,-153.0
600,152,-152.0
601,154,-154.0
602,85,-85.0
603,162,-162.0
604,155,-155.0
605,92,-92.0
606,146,-146.0
607,140,-140.0
608,142,-142.0
609,92,-92.0
610,84,-84.0
611,85,-85.0
612,156,-156.0
613,143,-143.0
614,126,-126.0
615,90,-90.0
616,84,-84.0
617,154,-154.0
618,103,-103.0
619,84,-84.0
620,156,-156.0
621,160,-160.0
622,98,-98.0
623,91,-91.0
624,175,-175.0
625,200,-200.0
626,200,-200.0
627,134,-134.0
628,97,-97.0
629,183,-183.0
630,94,-94.0
631,186,-186.0
632,170,-170.0
633,161,-161.0
634,99,-99.0
635,86,-86.0
636,140,-140.0
637,177,-177.0
638,146,-146.0
639,186,-186.0
640,188,-188.0
641,85,-85.0
642,183,-183.0
643,88,-88.0
644,149,-149.0
645,85,-85.0
646,200,-200.0
647,89,-89.0
648,89,-89.0
649,92,-92.0
650,89,-89.0
651,145,-145.0
652,145,-145.0
653,194,-194.0
654,91,-91.0
655,168,-168.0
656,154,-154.0
657,93,-93.0
658,90,-90.0
659,178,-178.0
660,199,-199.0
661,103,-103.0
662,200,-200.0
663,165,-165.0
664,190,-190.0
665,168,-168.0
666,150,-150.0
667,103,-103.0
668,110,-110.0
669,92,-92.0
670,103,-103.0
671,98,-98.0
672,144,-144.0
673,90,-90.0
674,142,-142.0
675,200,-200.0
676,103,-103.0
677,155,-155.0
678,103,-103.0
679,91,-91.0
680,168,-168.0
681,93,-93.0
682,185,-185.0
683,200,-200.0
684,161,-161.0
685,89,-89.0
686,147,-147.0
687,94,-94.0
688,156,-156.0
689,120,-120.0
690,90,-90.0
691,178,-178.0
692,91,-91.0
693,105,-105.0
694,86,-86.0
695,151,-151.0
696,151,-151.0
697,153,-153.0
698,155,-155.0
699,98,-98.0
700,159,-159.0
701,105,-105.0
702,157,-157.0
703,88,-88.0
704,150,-150.0
705,98,-98.0
706,178,-178.0
707,90,-90.0
708,160,-160.0
709,175,-175.0
710,151,-151.0
711,97,-97.0
712,88,-88.0
713,159,-159.0
714,154,-154.0
715,87,-87.0
716,144,-144.0
717,86,-86.0
718,153,-153.0
719,162,-162.0
720,150,-150.0
721,175,-175.0
722,153,-153.0
723,148,-148.0
724,143,-143.0
725,146,-146.0
726,142,-142.0
727,98,-98.0
728,90,-90.0
729,155,-155.0
730,159,-159.0
731,149,-149.0
732,145,-145.0
733,140,-140.0
734,140,-140.0
735,91,-91.0
736,110,-110.0
737,139,-139.0
738,141,-141.0
739,140,-140.0
740,140,-140.0
741,136,-136.0
742,179,-179.0
743,143,-143.0
744,145,-145.0
745,85,-85.0
746,193,-193.0
747,148,-148.0
748,164,-164.0
749,177,-177.0
750,181,-181.0
751,88,-88.0
752,179,-179.0
753,169,-169.0
754,146,-146.0
755,88,-88.0
756,103,-103.0
757,146,-146.0
758,150,-150.0
759,113,-113.0
760,120,-120.0
761,137,-137.0
762,93,-93.0
763,163,-163.0
764,123,-123.0
765,102,-102.0
766,93,-93.0
767,163,-163.0
768,100,-100.0
769,121,-121.0
770,89,-89.0
771,116,-116.0
772,168,-168.0
773,118,-118.0
774,114,-114.0
775,144,-144.0
776,88,-88.0
777,159,-159.0
778,156,-156.0
779,87,-87.0
780,163,-163.0
781,154,-154.0
782,146,-146.0
783,151,-151.0
784,146,-146.0
785,140,-140.0
786,143,-143.0
787,141,-141.0
788,114,-114.0
789,147,-147.0
790,145,-145.0
791,143,-143.0
792,156,-156.0
793,147,-147.0
794,141,-141.0
795,115,-115.0
796,145,-145.0
797,151,-151.0
798,147,-147.0
799,142,-142.0
800,146,-146.0
801,147,-147.0
802,146,-146.0
803,142,-142.0
804,88,-88.0
805,149,-149.0
806,148,-148.0
807,148,-148.0
808,85,-85.0
809,150,-150.0
810,168,-168.0
811,149,-149.0
812,158,-158.0
813,149,-149.0
814,151,-151.0
815,153,-153.0
816,157,-157.0
817,158,-158.0
818,119,-119.0
819,154,-154.0
820,151,-151.0
821,152,-152.0
822,144,-144.0
823,88,-88.0
824,148,-148.0
825,149,-149.0
826,148,-148.0
827,153,-153.0
828,151,-151.0
829,147,-147.0
830,146,-146.0
831,146,-146.0
832,85,-85.0
833,152,-152.0
834,90,-90.0
835,168,-168.0
836,100,-100.0
837,113,-113.0
838,193,-193.0
839,86,-86.0
840,96,-96.0
841,85,-85.0
842,93,-93.0
843,88,-88.0
844,163,-163.0
845,200,-200.0
846,106,-106.0
847,90,-90.0
848,95,-95.0
849,161,-161.0
850,86,-86.0
851,200,-200.0
852,100,-100.0
853,182,-182.0
854,92,-92.0
855,89,-89.0
856,143,-143.0
857,88,-88.0
858,137,-137.0
859,93,-93.0
860,138,-138.0
861,135,-135.0
862,109,-109.0
863,99,-99.0
864,136,-136.0
865,142,-142.0
866,136,-136.0
867,143,-143.0
868,146,-146.0
869,142,-142.0
870,200,-200.0
871,154,-154.0
872,163,-163.0
873,200,-200.0
874,167,-167.0
875,86,-86.0
876,143,-143.0
877,96,-96.0
878,153,-153.0
879,195,-195.0
880,112,-112.0
881,95,-95.0
882,87,-87.0
883,84,-84.0
884,142,-142.0
885,143,-143.0
886,152,-152.0
887,173,-173.0
888,85,-85.0
889,200,-200.0
890,200,-200.0
891,143,-143.0
892,162,-162.0
893,160,-160.0
894,151,-151.0
895,148,-148.0
896,146,-146.0
897,144,-144.0
898,157,-157.0
899,91,-91.0
900,91,-91.0
901,95,-95.0
902,160,-160.0
903,144,-144.0
904,151,-151.0
905,161,-161.0
906,145,-145.0
907,147,-147.0
908,147,-147.0
909,154,-154.0
910,163,-163.0
911,200,-200.0
912,157,-157.0
913,143,-143.0
914,147,-147.0
915,151,-151.0
916,159,-159.0
917,155,-155.0
918,144,-144.0
919,154,-154.0
920,149,-149.0
921,148,-148.0
922,200,-200.0
923,146,-146.0
924,143,-143.0
925,143,-143.0
926,152,-152.0
927,167,-167.0
928,158,-158.0
929,154,-154.0
930,87,-87.0
931,94,-94.0
932,152,-152.0
933,147,-147.0
934,156,-156.0
935,88,-88.0
936,148,-148.0
937,156,-156.0
938,159,-159.0
939,108,-108.0
940,200,-200.0
941,150,-150.0
942,146,-146.0
943,88,-88.0
944,179,-179.0
945,144,-144.0
946,88,-88.0
947,147,-147.0
948,95,-95.0
949,150,-150.0
950,143,-143.0
951,103,-103.0
952,89,-89.0
953,84,-84.0
954,200,-200.0
955,146,-146.0
956,200,-200.0
957,90,-90.0
958,200,-200.0
959,173,-173.0
960,163,-163.0
961,143,-143.0
962,161,-161.0
963,93,-93.0
964,191,-191.0
965,158,-158.0
966,200,-200.0
967,160,-160.0
968,200,-200.0
969,86,-86.0
970,156,-156.0
971,151,-151.0
972,87,-87.0
973,88,-88.0
974,92,-92.0
975,158,-158.0
976,158,-158.0
977,160,-160.0
978,200,-200.0
979,169,-169.0
980,149,-149.0
981,153,-153.0
982,85,-85.0
983,141,-141.0
984,183,-183.0
985,168,-168.0
986,144,-144.0
987,149,-149.0
988,167,-167.0
989,156,-156.0
990,146,-146.0
991,158,-158.0
992,163,-163.0
993,162,-162.0
994,148,-148.0
995,143,-143.0
996,143,-143.0
997,146,-146.0
998,141,-141.0
999,141,-141.0
1000,144,-144.0
1001,154,-154.0
1002,149,-149.0
1003,146,-146.0
1004,166,-166.0
1005,158,-158.0
1006,150,-150.0
1007,169,-169.0
1008,157,-157.0
1009,155,-155.0
1010,164,-164.0
1011,152,-152.0
1012,156,-156.0
1013,155,-155.0
1014,143,-143.0
1015,148,-148.0
1016,152,-152.0
1017,134,-134.0
1018,140,-140.0
1019,135,-135.0
1020,139,-139.0
1021,142,-142.0
1022,166,-166.0
1023,162,-162.0
1024,146,-146.0
1025,139,-139.0
1026,150,-150.0
1027,145,-145.0
1028,149,-149.0
1029,147,-147.0
1030,138,-138.0
1031,147,-147.0
1032,152,-152.0
1033,143,-143.0
1034,145,-145.0
1035,148,-148.0
1036,143,-143.0
1037,140,-140.0
1038,147,-147.0
1039,140,-140.0
1040,134,-134.0
1041,186,-186.0
1042,153,-153.0
1043,136,-136.0
1044,173,-173.0
1045,146,-146.0
1046,139,-139.0
1047,139,-139.0
1048,137,-137.0
1049,150,-150.0
1050,144,-144.0
1051,141,-141.0
1052,149,-149.0
1053,138,-138.0
1054,177,-177.0
1055,155,-155.0
1056,147,-147.0
1057,139,-139.0
1058,140,-140.0
1059,142,-142.0
1060,139,-139.0
1061,142,-142.0
1062,142,-142.0
1063,156,-156.0
1064,155,-155.0
1065,143,-143.0
1066,142,-142.0
1067,85,-85.0
1068,139,-139.0
1069,146,-146.0
1070,139,-139.0
1071,190,-190.0
1072,149,-149.0
1073,139,-139.0
1074,115,-115.0
1075,140,-140.0
1076,183,-183.0
1077,152,-152.0
1078,147,-147.0
1079,200,-200.0
1080,149,-149.0
1081,138,-138.0
1082,146,-146.0
1083,140,-140.0
1084,147,-147.0
1085,154,-154.0
1086,200,-200.0
1087,157,-157.0
1088,141,-141.0
1089,191,-191.0
1090,144,-144.0
1091,143,-143.0
1092,139,-139.0
1093,139,-139.0
1094,139,-139.0
1095,110,-110.0
1096,143,-143.0
1097,143,-143.0
1098,112,-112.0
1099,141,-141.0
1100,141,-141.0
1101,138,-138.0
1102,147,-147.0
1103,176,-176.0
1104,145,-145.0
1105,109,-109.0
1106,148,-148.0
1107,155,-155.0
1108,110,-110.0
1109,110,-110.0
1110,188,-188.0
1111,109,-109.0
1112,114,-114.0
1113,152,-152.0
1114,113,-113.0
1115,181,-181.0
1116,111,-111.0
1117,109,-109.0
1118,111,-111.0
1119,157,-157.0
1120,110,-110.0
1121,168,-168.0
1122,113,-113.0
1123,98,-98.0
1124,108,-108.0
1125,111,-111.0
1126,182,-182.0
1127,109,-109.0
1128,200,-200.0
1129,159,-159.0
1130,167,-167.0
1131,141,-141.0
1132,140,-140.0
1133,139,-139.0
1134,91,-91.0
1135,139,-139.0
1136,90,-90.0
1137,130,-130.0
1138,89,-89.0
1139,160,-160.0
1140,112,-112.0
1141,138,-138.0
1142,148,-148.0
1143,151,-151.0
1144,92,-92.0
1145,90,-90.0
1146,150,-150.0
1147,162,-162.0
1148,165,-165.0
1149,150,-150.0
1150,111,-111.0
1151,100,-100.0
1152,148,-148.0
1153,175,-175.0
1154,156,-156.0
1155,152,-152.0
1156,153,-153.0
1157,149,-149.0
1158,147,-147.0
1159,164,-164.0
1160,149,-149.0
1161,148,-148.0
1162,155,-155.0
1163,160,-160.0
1164,152,-152.0
1165,155,-155.0
1166,153,-153.0
1167,149,-149.0
1168,142,-142.0
1169,167,-167.0
1170,150,-150.0
1171,175,-175.0
1172,159,-159.0
1173,153,-153.0
1174,153,-153.0
1175,157,-157.0
1176,166,-166.0
1177,149,-149.0
1178,173,-173.0
1179,153,-153.0
1180,152,-152.0
1181,154,-154.0
1182,155,-155.0
1183,153,-153.0
1184,150,-150.0
1185,150,-150.0
1186,155,-155.0
1187,149,-149.0
1188,160,-160.0
1189,144,-144.0
1190,145,-145.0
1191,149,-149.0
1192,147,-147.0
1193,143,-143.0
1194,165,-165.0
1195,161,-161.0
1196,166,-166.0
1197,159,-159.0
1198,154,-154.0
1199,156,-156.0
1200,159,-159.0
1201,151,-151.0
1202,122,-122.0
1203,200,-200.0
1204,154,-154.0
1205,160,-160.0
1206,162,-162.0
1207,200,-200.0
1208,161,-161.0
1209,159,-159.0
1210,157,-157.0
1211,112,-112.0
1212,163,-163.0
1213,171,-171.0
1214,167,-167.0
1215,119,-119.0
1216,113,-113.0
1217,162,-162.0
1218,152,-152.0
1219,118,-118.0
1220,159,-159.0
1221,155,-155.0
1222,112,-112.0
1223,151,-151.0
1224,165,-165.0
1225,159,-159.0
1226,163,-163.0
1227,157,-157.0
1228,158,-158.0
1229,161,-161.0
1230,163,-163.0
1231,171,-171.0
1232,166,-166.0
1233,160,-160.0
1234,146,-146.0
1235,147,-147.0
1236,144,-144.0
1237,143,-143.0
1238,200,-200.0
1239,142,-142.0
1240,144,-144.0
1241,152,-152.0
1242,148,-148.0
1243,143,-143.0
1244,148,-148.0
1245,143,-143.0
1246,146,-146.0
1247,145,-145.0
1248,144,-144.0
1249,146,-146.0
1250,142,-142.0
1251,148,-148.0
1252,154,-154.0
1253,141,-141.0
1254,142,-142.0
1255,140,-140.0
1256,150,-150.0
1257,143,-143.0
1258,152,-152.0
1259,200,-200.0
1260,143,-143.0
1261,145,-145.0
1262,147,-147.0
1263,200,-200.0
1264,164,-164.0
1265,163,-163.0
1266,152,-152.0
1267,154,-154.0
1268,149,-149.0
1269,200,-200.0
1270,146,-146.0
1271,200,-200.0
1272,171,-171.0
1273,147,-147.0
1274,180,-180.0
1275,192,-192.0
1276,112,-112.0
1277,177,-177.0
1278,141,-141.0
1279,185,-185.0
1280,146,-146.0
1281,145,-145.0
1282,147,-147.0
1283,146,-146.0
1284,152,-152.0
1285,148,-148.0
1286,157,-157.0
1287,157,-157.0
1288,156,-156.0
1289,155,-155.0
1290,162,-162.0
1291,158,-158.0
1292,161,-161.0
1293,158,-158.0
1294,161,-161.0
1295,159,-159.0
1296,159,-159.0
1297,151,-151.0
1298,150,-150.0
1299,144,-144.0
1300,152,-152.0
1301,158,-158.0
1302,157,-157.0
1303,156,-156.0
1304,150,-150.0
1305,163,-163.0
1306,149,-149.0
1307,150,-150.0
1308,153,-153.0
1309,157,-157.0
1310,156,-156.0
1311,155,-155.0
1312,157,-157.0
1313,200,-200.0
1314,158,-158.0
1315,158,-158.0
1316,146,-146.0
1317,151,-151.0
1318,149,-149.0
1319,148,-148.0
1320,155,-155.0
1321,154,-154.0
1322,157,-157.0
1323,156,-156.0
1324,144,-144.0
1325,147,-147.0
1326,154,-154.0
1327,143,-143.0
1328,120,-120.0
1329,153,-153.0
1330,149,-149.0
1331,153,-153.0
1332,153,-153.0
1333,155,-155.0
1334,200,-200.0
1335,154,-154.0
1336,154,-154.0
1337,153,-153.0
1338,189,-189.0
1339,162,-162.0
1340,131,-131.0
1341,153,-153.0
1342,153,-153.0
1343,152,-152.0
1344,153,-153.0
1345,153,-153.0
1346,150,-150.0
1347,151,-151.0
1348,200,-200.0
1349,152,-152.0
1350,147,-147.0
1351,149,-149.0
1352,151,-151.0
1353,148,-148.0
1354,125,-125.0
1355,125,-125.0
1356,200,-200.0
1357,146,-146.0
1358,196,-196.0
1359,122,-122.0
1360,150,-150.0
1361,197,-197.0
1362,161,-161.0
1363,123,-123.0
1364,159,-159.0
1365,123,-123.0
1366,153,-153.0
1367,153,-153.0
1368,150,-150.0
1369,152,-152.0
1370,126,-126.0
1371,200,-200.0
1372,123,-123.0
1373,124,-124.0
1374,130,-130.0
1375,127,-127.0
1376,200,-200.0
1377,127,-127.0
1378,122,-122.0
1379,127,-127.0
1380,200,-200.0
1381,200,-200.0
1382,175,-175.0
1383,200,-200.0
1384,200,-200.0
1385,138,-138.0
1386,200,-200.0
1387,200,-200.0
1388,200,-200.0
1389,126,-126.0
1390,151,-151.0
1391,121,-121.0
1392,200,-200.0
1393,197,-197.0
1394,200,-200.0
1395,200,-200.0
1396,123,-123.0
1397,124,-124.0
1398,200,-200.0
1399,200,-200.0
1400,200,-200.0
1401,137,-137.0
1402,200,-200.0
1403,200,-200.0
1404,200,-200.0
1405,150,-150.0
1406,200,-200.0
1407,139,-139.0
1408,185,-185.0
1409,200,-200.0
1410,200,-200.0
1411,200,-200.0
1412,200,-200.0
1413,200,-200.0
1414,200,-200.0
1415,164,-164.0
1416,200,-200.0
1417,200,-200.0
1418,200,-200.0
1419,200,-200.0
1420,200,-200.0
1421,200,-200.0
1422,200,-200.0
1423,200,-200.0
1424,200,-200.0
1425,200,-200.0
1426,200,-200.0
1427,200,-200.0
1428,200,-200.0
1429,200,-200.0
1430,200,-200.0
1431,200,-200.0
1432,200,-200.0
1433,144,-144.0
1434,198,-198.0
1435,180,-180.0
1436,128,-128.0
1437,200,-200.0
1438,127,-127.0
1439,129,-129.0
1440,155,-155.0
1441,200,-200.0
1442,200,-200.0
1443,200,-200.0
1444,173,-173.0
1445,200,-200.0
1446,170,-170.0
1447,200,-200.0
1448,200,-200.0
1449,188,-188.0
1450,192,-192.0
1451,200,-200.0
1452,200,-200.0
1453,161,-161.0
1454,158,-158.0
1455,200,-200.0
1456,163,-163.0
1457,150,-150.0
1458,172,-172.0
1459,168,-168.0
1460,200,-200.0
1461,200,-200.0
1462,200,-200.0
1463,181,-181.0
1464,149,-149.0
1465,200,-200.0
1466,200,-200.0
1467,193,-193.0
1468,200,-200.0
1469,200,-200.0
1470,200,-200.0
1471,200,-200.0
1472,200,-200.0
1473,200,-200.0
1474,200,-200.0
1475,200,-200.0
1476,167,-167.0
1477,166,-166.0
1478,200,-200.0
1479,151,-151.0
1480,200,-200.0
1481,172,-172.0
1482,167,-167.0
1483,161,-161.0
1484,158,-158.0
1485,180,-180.0
1486,162,-162.0
1487,200,-200.0
1488,174,-174.0
1489,200,-200.0
1490,200,-200.0
1491,130,-130.0
1492,132,-132.0
1493,126,-126.0
1494,170,-170.0
1495,200,-200.0
1496,200,-200.0
1497,200,-200.0
1498,174,-174.0
1499,167,-167.0
1500,167,-167.0
1501,129,-129.0
1502,200,-200.0
1503,175,-175.0
1504,200,-200.0
1505,174,-174.0
1506,125,-125.0
1507,124,-124.0
1508,169,-169.0
1509,165,-165.0
1510,200,-200.0
1511,200,-200.0
1512,122,-122.0
1513,167,-167.0
1514,146,-146.0
1515,121,-121.0
1516,160,-160.0
1517,200,-200.0
1518,200,-200.0
1519,200,-200.0
1520,200,-200.0
1521,184,-184.0
1522,160,-160.0
1523,200,-200.0
1524,200,-200.0
1525,156,-156.0
1526,156,-156.0
1527,163,-163.0
1528,122,-122.0
1529,200,-200.0
1530,200,-200.0
1531,200,-200.0
1532,148,-148.0
1533,200,-200.0
1534,200,-200.0
1535,200,-200.0
1536,158,-158.0
1537,155,-155.0
1538,121,-121.0
1539,144,-144.0
1540,200,-200.0
1541,139,-139.0
1542,166,-166.0
1543,154,-154.0
1544,200,-200.0
1545,200,-200.0
1546,200,-200.0
1547,185,-185.0
1548,170,-170.0
1549,200,-200.0
1550,200,-200.0
1551,143,-143.0
1552,174,-174.0
1553,200,-200.0
1554,188,-188.0
1555,164,-164.0
1556,200,-200.0
1557,200,-200.0
1558,183,-183.0
1559,153,-153.0
1560,167,-167.0
1561,123,-123.0
1562,182,-182.0
1563,138,-138.0
1564,200,-200.0
1565,159,-159.0
1566,159,-159.0
1567,146,-146.0
1568,183,-183.0
1569,166,-166.0
1570,143,-143.0
1571,177,-177.0
1572,200,-200.0
1573,154,-154.0
1574,200,-200.0
1575,145,-145.0
1576,177,-177.0
1577,182,-182.0
1578,175,-175.0
1579,200,-200.0
1580,200,-200.0
1581,200,-200.0
1582,172,-172.0
1583,197,-197.0
1584,200,-200.0
1585,200,-200.0
1586,172,-172.0
1587,200,-200.0
1588,200,-200.0
1589,200,-200.0
1590,200,-200.0
1591,200,-200.0
1592,200,-200.0
1593,200,-200.0
1594,180,-180.0
1595,200,-200.0
1596,200,-200.0
1597,200,-200.0
1598,200,-200.0
1599,200,-200.0
1600,200,-200.0
1601,200,-200.0
1602,200,-200.0
1603,200,-200.0
1604,165,-165.0
1605,194,-194.0
1606,200,-200.0
1607,200,-200.0
1608,200,-200.0
1609,186,-186.0
1610,200,-200.0
1611,200,-200.0
1612,200,-200.0
1613,174,-174.0
1614,169,-169.0
1615,169,-169.0
1616,200,-200.0
1617,159,-159.0
1618,200,-200.0
1619,170,-170.0
1620,171,-171.0
1621,162,-162.0
1622,145,-145.0
1623,166,-166.0
1624,200,-200.0
1625,200,-200.0
1626,200,-200.0
1627,200,-200.0
1628,200,-200.0
1629,199,-199.0
1630,157,-157.0
1631,162,-162.0
1632,179,-179.0
1633,200,-200.0
1634,200,-200.0
1635,169,-169.0
1636,200,-200.0
1637,200,-200.0
1638,162,-162.0
1639,159,-159.0
1640,164,-164.0
1641,159,-159.0
1642,200,-200.0
1643,200,-200.0
1644,200,-200.0
1645,200,-200.0
1646,184,-184.0
1647,164,-164.0
1648,157,-157.0
1649,200,-200.0
1650,200,-200.0
1651,162,-162.0
1652,171,-171.0
1653,200,-200.0
1654,200,-200.0
1655,155,-155.0
1656,200,-200.0
1657,173,-173.0
1658,173,-173.0
1659,200,-200.0
1660,200,-200.0
1661,200,-200.0
1662,172,-172.0
1663,168,-168.0
1664,155,-155.0
1665,158,-158.0
1666,157,-157.0
1667,160,-160.0
1668,200,-200.0
1669,157,-157.0
1670,167,-167.0
1671,172,-172.0
1672,200,-200.0
1673,200,-200.0
1674,200,-200.0
1675,200,-200.0
1676,200,-200.0
1677,171,-171.0
1678,200,-200.0
1679,163,-163.0
1680,158,-158.0
1681,158,-158.0
1682,159,-159.0
1683,163,-163.0
1684,200,-200.0
1685,200,-200.0
1686,200,-200.0
1687,200,-200.0
1688,200,-200.0
1689,200,-200.0
1690,200,-200.0
1691,200,-200.0
1692,200,-200.0
1693,200,-200.0
1694,200,-200.0
1695,200,-200.0
1696,200,-200.0
1697,200,-200.0
1698,200,-200.0
1699,154,-154.0
1700,124,-124.0
1701,200,-200.0
1702,200,-200.0
1703,200,-200.0
1704,200,-200.0
1705,200,-200.0
1706,200,-200.0
1707,200,-200.0
1708,200,-200.0
1709,200,-200.0
1710,200,-200.0
1711,183,-183.0
1712,200,-200.0
1713,200,-200.0
1714,173,-173.0
1715,177,-177.0
1716,200,-200.0
1717,197,-197.0
1718,200,-200.0
1719,180,-180.0
1720,200,-200.0
1721,200,-200.0
1722,117,-117.0
1723,117,-117.0
1724,106,-106.0
1725,161,-161.0
1726,95,-95.0
1727,183,-183.0
1728,131,-131.0
1729,187,-187.0
1730,126,-126.0
1731,121,-121.0
1732,104,-104.0
1733,169,-169.0
1734,96,-96.0
1735,168,-168.0
1736,163,-163.0
1737,115,-115.0
1738,163,-163.0
1739,160,-160.0
1740,163,-163.0
1741,93,-93.0
1742,108,-108.0
1743,153,-153.0
1744,114,-114.0
1745,161,-161.0
1746,152,-152.0
1747,152,-152.0
1748,86,-86.0
1749,152,-152.0
1750,145,-145.0
1751,193,-193.0
1752,151,-151.0
1753,96,-96.0
1754,146,-146.0
1755,160,-160.0
1756,100,-100.0
1757,140,-140.0
1758,142,-142.0
1759,131,-131.0
1760,89,-89.0
1761,160,-160.0
1762,140,-140.0
1763,92,-92.0
1764,197,-197.0
1765,110,-110.0
1766,151,-151.0
1767,143,-143.0
1768,90,-90.0
1769,153,-153.0
1770,143,-143.0
1771,137,-137.0
1772,140,-140.0
1773,145,-145.0
1774,92,-92.0
1775,140,-140.0
1776,146,-146.0
1777,166,-166.0
1778,90,-90.0
1779,200,-200.0
1780,145,-145.0
1781,152,-152.0
1782,145,-145.0
1783,143,-143.0
1784,158,-158.0
1785,157,-157.0
1786,151,-151.0
1787,148,-148.0
1788,169,-169.0
1789,147,-147.0
1790,90,-90.0
1791,152,-152.0
1792,148,-148.0
1793,150,-150.0
1794,147,-147.0
1795,97,-97.0
1796,161,-161.0
1797,149,-149.0
1798,157,-157.0
1799,148,-148.0
1800,138,-138.0
1801,149,-149.0
1802,145,-145.0
1803,154,-154.0
1804,162,-162.0
1805,88,-88.0
1806,98,-98.0
1807,99,-99.0
1808,160,-160.0
1809,98,-98.0
1810,188,-188.0
1811,156,-156.0
1812,152,-152.0
1813,165,-165.0
1814,171,-171.0
1815,151,-151.0
1816,107,-107.0
1817,170,-170.0
1818,161,-161.0
1819,93,-93.0
1820,153,-153.0
1821,151,-151.0
1822,148,-148.0
1823,105,-105.0
1824,89,-89.0
1825,143,-143.0
1826,94,-94.0
1827,163,-163.0
1828,153,-153.0
1829,155,-155.0
1830,155,-155.0
1831,165,-165.0
1832,142,-142.0
1833,117,-117.0
1834,90,-90.0
1835,147,-147.0
1836,163,-163.0
1837,200,-200.0
1838,96,-96.0
1839,148,-148.0
1840,147,-147.0
1841,181,-181.0
1842,144,-144.0
1843,147,-147.0
1844,144,-144.0
1845,156,-156.0
1846,190,-190.0
1847,149,-149.0
1848,146,-146.0
1849,141,-141.0
1850,200,-200.0
1851,150,-150.0
1852,153,-153.0
1853,153,-153.0
1854,147,-147.0
1855,142,-142.0
1856,142,-142.0
1857,141,-141.0
1858,141,-141.0
1859,138,-138.0
1860,136,-136.0
1861,144,-144.0
1862,138,-138.0
1863,137,-137.0
1864,155,-155.0
1865,141,-141.0
1866,140,-140.0
1867,146,-146.0
1868,152,-152.0
1869,149,-149.0
1870,152,-152.0
1871,149,-149.0
1872,153,-153.0
1873,157,-157.0
1874,151,-151.0
1875,200,-200.0
1876,157,-157.0
1877,144,-144.0
1878,149,-149.0
1879,144,-144.0
1880,149,-149.0
1881,146,-146.0
1882,145,-145.0
1883,146,-146.0
1884,163,-163.0
1885,147,-147.0
1886,148,-148.0
1887,166,-166.0
1888,142,-142.0
1889,160,-160.0
1890,99,-99.0
1891,200,-200.0
1892,148,-148.0
1893,149,-149.0
1894,177,-177.0
1895,200,-200.0
1896,200,-200.0
1897,165,-165.0
1898,200,-200.0
1899,200,-200.0
1900,200,-200.0
1901,165,-165.0
1902,200,-200.0
1903,200,-200.0
1904,200,-200.0
1905,200,-200.0
1906,200,-200.0
1907,153,-153.0
1908,149,-149.0
1909,140,-140.0
1910,146,-146.0
1911,200,-200.0
1912,200,-200.0
1913,200,-200.0
1914,200,-200.0
1915,200,-200.0
1916,200,-200.0
1917,156,-156.0
1918,200,-200.0
1919,158,-158.0
1920,149,-149.0
1921,153,-153.0
1922,152,-152.0
1923,200,-200.0
1924,149,-149.0
1925,150,-150.0
1926,155,-155.0
1927,160,-160.0
1928,200,-200.0
1929,200,-200.0
1930,200,-200.0
1931,148,-148.0
1932,144,-144.0
1933,145,-145.0
1934,149,-149.0
1935,151,-151.0
1936,200,-200.0
1937,151,-151.0
1938,149,-149.0
1939,138,-138.0
1940,147,-147.0
1941,147,-147.0
1942,192,-192.0
1943,140,-140.0
1944,146,-146.0
1945,149,-149.0
1946,137,-137.0
1947,148,-148.0
1948,139,-139.0
1949,149,-149.0
1950,147,-147.0
1951,146,-146.0
1952,148,-148.0
1953,143,-143.0
1954,151,-151.0
1955,200,-200.0
1956,150,-150.0
1957,154,-154.0
1958,149,-149.0
1959,147,-147.0
1960,151,-151.0
1961,152,-152.0
1962,147,-147.0
1963,145,-145.0
1964,142,-142.0
1965,147,-147.0
1966,143,-143.0
1967,147,-147.0
1968,149,-149.0
1969,148,-148.0
1970,147,-147.0
1971,149,-149.0
1972,149,-149.0
1973,200,-200.0
1974,143,-143.0
1975,145,-145.0
1976,163,-163.0
1977,145,-145.0
1978,200,-200.0
1979,147,-147.0
1980,153,-153.0
1981,154,-154.0
1982,148,-148.0
1983,144,-144.0
1984,148,-148.0
1985,151,-151.0
1986,200,-200.0
1987,200,-200.0
1988,145,-145.0
1989,142,-142.0
1990,142,-142.0
1991,141,-141.0
1992,143,-143.0
1993,200,-200.0
1994,145,-145.0
1995,152,-152.0
1996,144,-144.0
1997,142,-142.0
1998,144,-144.0
1999,145,-145.0
2000,161,-161.0
2001,143,-143.0
2002,157,-157.0
2003,141,-141.0
2004,140,-140.0
2005,90,-90.0
2006,165,-165.0
2007,142,-142.0
2008,139,-139.0
2009,141,-141.0
2010,139,-139.0
2011,200,-200.0
2012,200,-200.0
2013,149,-149.0
2014,153,-153.0
2015,146,-146.0
2016,172,-172.0
2017,150,-150.0
2018,96,-96.0
2019,144,-144.0
2020,200,-200.0
2021,200,-200.0
2022,116,-116.0
2023,200,-200.0
2024,145,-145.0
2025,200,-200.0
2026,200,-200.0
2027,141,-141.0
2028,200,-200.0
2029,200,-200.0
2030,146,-146.0
2031,200,-200.0
2032,200,-200.0
2033,145,-145.0
2034,200,-200.0
2035,175,-175.0
2036,145,-145.0
2037,175,-175.0
2038,153,-153.0
2039,200,-200.0
2040,163,-163.0
2041,200,-200.0
2042,160,-160.0
2043,109,-109.0
2044,200,-200.0
2045,186,-186.0
2046,160,-160.0
2047,200,-200.0
2048,200,-200.0
2049,161,-161.0
2050,200,-200.0
2051,168,-168.0
2052,147,-147.0
2053,155,-155.0
2054,178,-178.0
2055,107,-107.0
2056,108,-108.0
2057,166,-166.0
2058,200,-200.0
2059,89,-89.0
2060,107,-107.0
2061,167,-167.0
2062,161,-161.0
2063,155,-155.0
2064,200,-200.0
2065,110,-110.0
2066,107,-107.0
2067,111,-111.0
2068,156,-156.0
2069,110,-110.0
2070,93,-93.0
2071,109,-109.0
2072,164,-164.0
2073,108,-108.0
2074,153,-153.0
2075,153,-153.0
2076,150,-150.0
2077,170,-170.0
2078,179,-179.0
2079,89,-89.0
2080,160,-160.0
2081,164,-164.0
2082,164,-164.0
2083,114,-114.0
2084,123,-123.0
2085,166,-166.0
2086,86,-86.0
2087,91,-91.0
2088,155,-155.0
2089,109,-109.0
2090,178,-178.0
2091,154,-154.0
2092,162,-162.0
2093,153,-153.0
2094,156,-156.0
2095,161,-161.0
2096,160,-160.0
2097,153,-153.0
2098,171,-171.0
2099,153,-153.0
2100,97,-97.0
2101,95,-95.0
2102,88,-88.0
2103,172,-172.0
2104,165,-165.0
2105,148,-148.0
2106,176,-176.0
2107,144,-144.0
2108,161,-161.0
2109,91,-91.0
2110,150,-150.0
2111,147,-147.0
2112,143,-143.0
2113,145,-145.0
2114,104,-104.0
2115,160,-160.0
2116,154,-154.0
2117,148,-148.0
2118,94,-94.0
2119,146,-146.0
2120,146,-146.0
2121,108,-108.0
2122,146,-146.0
2123,144,-144.0
2124,167,-167.0
2125,158,-158.0
2126,200,-200.0
2127,127,-127.0
2128,186,-186.0
2129,103,-103.0
2130,159,-159.0
2131,167,-167.0
2132,200,-200.0
2133,145,-145.0
2134,176,-176.0
2135,144,-144.0
2136,144,-144.0
2137,151,-151.0
2138,102,-102.0
2139,162,-162.0
2140,89,-89.0
2141,87,-87.0
2142,108,-108.0
2143,111,-111.0
2144,106,-106.0
2145,101,-101.0
2146,93,-93.0
2147,89,-89.0
2148,154,-154.0
2149,187,-187.0
2150,88,-88.0
2151,119,-119.0
2152,94,-94.0
2153,87,-87.0
2154,105,-105.0
2155,121,-121.0
2156,125,-125.0
2157,126,-126.0
2158,113,-113.0
2159,160,-160.0
2160,103,-103.0
2161,151,-151.0
2162,90,-90.0
2163,120,-120.0
2164,101,-101.0
2165,148,-148.0
2166,162,-162.0
2167,150,-150.0
2168,86,-86.0
2169,88,-88.0
2170,150,-150.0
2171,144,-144.0
2172,141,-141.0
2173,179,-179.0
2174,183,-183.0
2175,150,-150.0
2176,142,-142.0
2177,154,-154.0
2178,174,-174.0
2179,140,-140.0
2180,98,-98.0
2181,92,-92.0
2182,119,-119.0
2183,174,-174.0
2184,86,-86.0
2185,153,-153.0
2186,136,-136.0
2187,144,-144.0
2188,149,-149.0
2189,139,-139.0
2190,108,-108.0
2191,137,-137.0
2192,180,-180.0
2193,163,-163.0
2194,148,-148.0
2195,200,-200.0
2196,164,-164.0
2197,88,-88.0
2198,90,-90.0
2199,138,-138.0
2200,151,-151.0
2201,199,-199.0
2202,161,-161.0
2203,85,-85.0
2204,145,-145.0
2205,136,-136.0
2206,86,-86.0
2207,89,-89.0
2208,185,-185.0
2209,136,-136.0
2210,144,-144.0
2211,133,-133.0
2212,136,-136.0
2213,145,-145.0
2214,129,-129.0
2215,135,-135.0
2216,140,-140.0
2217,132,-132.0
2218,128,-128.0
2219,133,-133.0
2220,185,-185.0
2221,185,-185.0
2222,131,-131.0
2223,148,-148.0
2224,129,-129.0
2225,149,-149.0
2226,138,-138.0
2227,148,-148.0
2228,173,-173.0
2229,138,-138.0
2230,136,-136.0
2231,127,-127.0
2232,145,-145.0
2233,117,-117.0
2234,164,-164.0
2235,150,-150.0
2236,170,-170.0
2237,176,-176.0
2238,155,-155.0
2239,200,-200.0
2240,106,-106.0
2241,106,-106.0
2242,147,-147.0
2243,141,-141.0
2244,146,-146.0
2245,170,-170.0
2246,178,-178.0
2247,112,-112.0
2248,147,-147.0
2249,136,-136.0
2250,154,-154.0
2251,139,-139.0
2252,186,-186.0
2253,136,-136.0
2254,141,-141.0
2255,135,-135.0
2256,140,-140.0
2257,134,-134.0
2258,144,-144.0
2259,141,-141.0
2260,192,-192.0
2261,146,-146.0
2262,200,-200.0
2263,138,-138.0
2264,136,-136.0
2265,137,-137.0
2266,141,-141.0
2267,136,-136.0
2268,135,-135.0
2269,133,-133.0
2270,135,-135.0
2271,138,-138.0
2272,166,-166.0
2273,150,-150.0
2274,139,-139.0
2275,137,-137.0
2276,136,-136.0
2277,141,-141.0
2278,136,-136.0
2279,135,-135.0
2280,136,-136.0
2281,146,-146.0
2282,135,-135.0
2283,142,-142.0
2284,136,-136.0
2285,137,-137.0
2286,200,-200.0
2287,149,-149.0
2288,136,-136.0
2289,137,-137.0
2290,158,-158.0
2291,200,-200.0
2292,139,-139.0
2293,161,-161.0
2294,147,-147.0
2295,163,-163.0
2296,153,-153.0
2297,148,-148.0
2298,145,-145.0
2299,144,-144.0
2300,200,-200.0
2301,200,-200.0
2302,200,-200.0
2303,200,-200.0
2304,200,-200.0
2305,200,-200.0
2306,200,-200.0
2307,200,-200.0
2308,200,-200.0
2309,200,-200.0
2310,200,-200.0
2311,200,-200.0
2312,140,-140.0
2313,197,-197.0
2314,138,-138.0
2315,123,-123.0
2316,158,-158.0
2317,200,-200.0
2318,200,-200.0
2319,200,-200.0
2320,175,-175.0
2321,167,-167.0
2322,172,-172.0
2323,173,-173.0
2324,189,-189.0
2325,164,-164.0
2326,169,-169.0
2327,148,-148.0
2328,140,-140.0
2329,200,-200.0
2330,147,-147.0
2331,200,-200.0
2332,164,-164.0
2333,166,-166.0
2334,169,-169.0
2335,157,-157.0
2336,156,-156.0
2337,147,-147.0
2338,148,-148.0
2339,145,-145.0
2340,147,-147.0
2341,144,-144.0
2342,156,-156.0
2343,152,-152.0
2344,154,-154.0
2345,147,-147.0
2346,162,-162.0
2347,146,-146.0
2348,151,-151.0
2349,152,-152.0
2350,144,-144.0
2351,138,-138.0
2352,177,-177.0
2353,200,-200.0
2354,145,-145.0
2355,145,-145.0
2356,141,-141.0
2357,87,-87.0
2358,174,-174.0
2359,200,-200.0
2360,200,-200.0
2361,156,-156.0
2362,152,-152.0
2363,146,-146.0
2364,144,-144.0
2365,142,-142.0
2366,162,-162.0
2367,143,-143.0
2368,138,-138.0
2369,138,-138.0
2370,95,-95.0
2371,142,-142.0
2372,140,-140.0
2373,104,-104.0
2374,143,-143.0
2375,145,-145.0
2376,158,-158.0
2377,144,-144.0
2378,145,-145.0
2379,158,-158.0
2380,155,-155.0
2381,151,-151.0
2382,141,-141.0
2383,151,-151.0
2384,105,-105.0
2385,142,-142.0
2386,144,-144.0
2387,95,-95.0
2388,146,-146.0
2389,141,-141.0
2390,117,-117.0
2391,158,-158.0
2392,155,-155.0
2393,167,-167.0
2394,200,-200.0
2395,182,-182.0
2396,145,-145.0
2397,189,-189.0
2398,141,-141.0
2399,141,-141.0
2400,142,-142.0
2401,134,-134.0
2402,148,-148.0
2403,137,-137.0
2404,133,-133.0
2405,137,-137.0
2406,140,-140.0
2407,141,-141.0
2408,125,-125.0
2409,110,-110.0
2410,135,-135.0
2411,138,-138.0
2412,139,-139.0
2413,140,-140.0
2414,174,-174.0
2415,143,-143.0
2416,137,-137.0
2417,136,-136.0
2418,136,-136.0
2419,137,-137.0
2420,140,-140.0
2421,144,-144.0
2422,149,-149.0
2423,94,-94.0
2424,101,-101.0
2425,141,-141.0
2426,140,-140.0
2427,157,-157.0
2428,133,-133.0
2429,147,-147.0
2430,107,-107.0
2431,156,-156.0
2432,88,-88.0
2433,148,-148.0
2434,200,-200.0
2435,93,-93.0
2436,87,-87.0
2437,200,-200.0
2438,138,-138.0
2439,87,-87.0
2440,200,-200.0
2441,88,-88.0
2442,107,-107.0
2443,145,-145.0
2444,143,-143.0
2445,147,-147.0
2446,160,-160.0
2447,144,-144.0
2448,145,-145.0
2449,146,-146.0
2450,146,-146.0
2451,142,-142.0
2452,145,-145.0
2453,147,-147.0
2454,173,-173.0
2455,171,-171.0
2456,145,-145.0
2457,146,-146.0
2458,107,-107.0
2459,169,-169.0
2460,146,-146.0
2461,200,-200.0
2462,166,-166.0
2463,139,-139.0
2464,141,-141.0
2465,150,-150.0
2466,158,-158.0
2467,142,-142.0
2468,143,-143.0
2469,143,-143.0
2470,147,-147.0
2471,140,-140.0
2472,168,-168.0
2473,152,-152.0
2474,154,-154.0
2475,146,-146.0
2476,165,-165.0
2477,144,-144.0
2478,160,-160.0
2479,95,-95.0
2480,146,-146.0
2481,148,-148.0
2482,149,-149.0
2483,200,-200.0
2484,174,-174.0
2485,96,-96.0
2486,200,-200.0
2487,200,-200.0
2488,168,-168.0
2489,98,-98.0
2490,168,-168.0
2491,156,-156.0
2492,146,-146.0
2493,103,-103.0
2494,100,-100.0
2495,144,-144.0
2496,200,-200.0
2497,189,-189.0
2498,160,-160.0
2499,139,-139.0
2500,171,-171.0
2501,151,-151.0
2502,172,-172.0
2503,150,-150.0
2504,200,-200.0
2505,184,-184.0
2506,167,-167.0
2507,109,-109.0
2508,94,-94.0
2509,137,-137.0
2510,144,-144.0
2511,145,-145.0
2512,142,-142.0
2513,140,-140.0
2514,140,-140.0
2515,143,-143.0
2516,160,-160.0
2517,90,-90.0
2518,93,-93.0
2519,154,-154.0
2520,166,-166.0
2521,156,-156.0
2522,186,-186.0
2523,200,-200.0
2524,176,-176.0
2525,191,-191.0
2526,167,-167.0
2527,111,-111.0
2528,171,-171.0
2529,108,-108.0
2530,92,-92.0
2531,168,-168.0
2532,170,-170.0
2533,88,-88.0
2534,122,-122.0
2535,109,-109.0
2536,129,-129.0
2537,95,-95.0
2538,185,-185.0
2539,87,-87.0
2540,200,-200.0
2541,161,-161.0
2542,166,-166.0
2543,102,-102.0
2544,166,-166.0
2545,105,-105.0
2546,169,-169.0
2547,200,-200.0
2548,157,-157.0
2549,113,-113.0
2550,188,-188.0
2551,145,-145.0
2552,152,-152.0
2553,151,-151.0
2554,95,-95.0
2555,102,-102.0
2556,146,-146.0
2557,102,-102.0
2558,175,-175.0
2559,200,-200.0
2560,113,-113.0
2561,158,-158.0
2562,105,-105.0
2563,200,-200.0
2564,153,-153.0
2565,159,-159.0
2566,164,-164.0
2567,199,-199.0
2568,200,-200.0
2569,153,-153.0
2570,149,-149.0
2571,200,-200.0
2572,157,-157.0
2573,94,-94.0
2574,95,-95.0
2575,145,-145.0
2576,143,-143.0
2577,88,-88.0
2578,155,-155.0
2579,165,-165.0
2580,170,-170.0
2581,200,-200.0
2582,159,-159.0
2583,168,-168.0
2584,147,-147.0
2585,93,-93.0
2586,98,-98.0
2587,176,-176.0
2588,200,-200.0
2589,164,-164.0
2590,89,-89.0
2591,181,-181.0
2592,162,-162.0
2593,89,-89.0
2594,147,-147.0
2595,161,-161.0
2596,87,-87.0
2597,154,-154.0
2598,147,-147.0
2599,148,-148.0
2600,87,-87.0
2601,91,-91.0
2602,101,-101.0
2603,156,-156.0
2604,155,-155.0
2605,93,-93.0
2606,149,-149.0
2607,149,-149.0
2608,159,-159.0
2609,185,-185.0
2610,155,-155.0
2611,93,-93.0
2612,159,-159.0
2613,87,-87.0
2614,151,-151.0
2615,149,-149.0
2616,94,-94.0
2617,148,-148.0
2618,88,-88.0
2619,147,-147.0
2620,110,-110.0
2621,110,-110.0
2622,108,-108.0
2623,110,-110.0
2624,107,-107.0
2625,108,-108.0
2626,108,-108.0
2627,108,-108.0
2628,109,-109.0
2629,111,-111.0
2630,200,-200.0
2631,151,-151.0
2632,106,-106.0
2633,107,-107.0
2634,106,-106.0
2635,109,-109.0
2636,109,-109.0
2637,188,-188.0
2638,105,-105.0
2639,104,-104.0
2640,107,-107.0
2641,108,-108.0
2642,112,-112.0
2643,103,-103.0
2644,147,-147.0
2645,106,-106.0
2646,103,-103.0
2647,152,-152.0
2648,104,-104.0
2649,105,-105.0
2650,108,-108.0
2651,106,-106.0
2652,107,-107.0
2653,114,-114.0
2654,111,-111.0
2655,144,-144.0
2656,145,-145.0
2657,144,-144.0
2658,86,-86.0
2659,145,-145.0
2660,151,-151.0
2661,147,-147.0
2662,175,-175.0
2663,105,-105.0
2664,104,-104.0
2665,105,-105.0
2666,105,-105.0
2667,105,-105.0
2668,106,-106.0
2669,105,-105.0
2670,111,-111.0
2671,105,-105.0
2672,105,-105.0
2673,110,-110.0
2674,108,-108.0
2675,106,-106.0
2676,107,-107.0
2677,107,-107.0
2678,107,-107.0
2679,107,-107.0
2680,108,-108.0
2681,112,-112.0
2682,108,-108.0
2683,106,-106.0
2684,105,-105.0
2685,148,-148.0
2686,108,-108.0
2687,106,-106.0
2688,110,-110.0
2689,106,-106.0
2690,169,-169.0
2691,106,-106.0
2692,110,-110.0
2693,108,-108.0
2694,153,-153.0
2695,105,-105.0
2696,107,-107.0
2697,89,-89.0
2698,156,-156.0
2699,147,-147.0
2700,108,-108.0
2701,109,-109.0
2702,110,-110.0
2703,108,-108.0
2704,110,-110.0
2705,108,-108.0
2706,111,-111.0
2707,102,-102.0
2708,108,-108.0
2709,103,-103.0
2710,108,-108.0
2711,114,-114.0
2712,173,-173.0
2713,108,-108.0
2714,109,-109.0
2715,114,-114.0
2716,110,-110.0
2717,103,-103.0
2718,106,-106.0
2719,84,-84.0
2720,109,-109.0
2721,102,-102.0
2722,147,-147.0
2723,155,-155.0
2724,104,-104.0
2725,108,-108.0
2726,108,-108.0
2727,144,-144.0
2728,106,-106.0
2729,87,-87.0
2730,187,-187.0
2731,200,-200.0
2732,172,-172.0
2733,98,-98.0
2734,105,-105.0
2735,116,-116.0
2736,116,-116.0
2737,118,-118.0
2738,144,-144.0
2739,143,-143.0
2740,111,-111.0
2741,187,-187.0
2742,106,-106.0
2743,140,-140.0
2744,136,-136.0
2745,132,-132.0
2746,97,-97.0
2747,136,-136.0
2748,137,-137.0
2749,139,-139.0
2750,162,-162.0
2751,156,-156.0
2752,175,-175.0
2753,142,-142.0
2754,139,-139.0
2755,91,-91.0
2756,136,-136.0
2757,152,-152.0
2758,162,-162.0
2759,140,-140.0
2760,136,-136.0
2761,105,-105.0
2762,142,-142.0
2763,145,-145.0
2764,144,-144.0
2765,88,-88.0
2766,105,-105.0
2767,143,-143.0
2768,97,-97.0
2769,86,-86.0
2770,164,-164.0
2771,167,-167.0
2772,165,-165.0
2773,141,-141.0
2774,147,-147.0
2775,144,-144.0
2776,166,-166.0
2777,143,-143.0
2778,200,-200.0
2779,96,-96.0
2780,89,-89.0
2781,143,-143.0
2782,147,-147.0
2783,145,-145.0
2784,148,-148.0
2785,136,-136.0
2786,146,-146.0
2787,90,-90.0
2788,146,-146.0
2789,140,-140.0
2790,91,-91.0
2791,144,-144.0
2792,164,-164.0
2793,143,-143.0
2794,92,-92.0
2795,154,-154.0
2796,142,-142.0
2797,163,-163.0
2798,162,-162.0
2799,170,-170.0
2800,140,-140.0
2801,144,-144.0
2802,90,-90.0
2803,94,-94.0
2804,143,-143.0
2805,145,-145.0
2806,140,-140.0
2807,144,-144.0
2808,143,-143.0
2809,145,-145.0
2810,146,-146.0
2811,147,-147.0
2812,172,-172.0
2813,174,-174.0
2814,95,-95.0
2815,142,-142.0
2816,89,-89.0
2817,98,-98.0
2818,139,-139.0
2819,143,-143.0
2820,167,-167.0
2821,138,-138.0
2822,91,-91.0
2823,174,-174.0
2824,141,-141.0
2825,145,-145.0
2826,143,-143.0
2827,198,-198.0
2828,140,-140.0
2829,139,-139.0
2830,104,-104.0
2831,138,-138.0
2832,96,-96.0
2833,143,-143.0
2834,156,-156.0
2835,161,-161.0
2836,156,-156.0
2837,153,-153.0
2838,92,-92.0
2839,151,-151.0
2840,162,-162.0
2841,143,-143.0
2842,140,-140.0
2843,140,-140.0
2844,139,-139.0
2845,142,-142.0
2846,141,-141.0
2847,156,-156.0
2848,114,-114.0
2849,140,-140.0
2850,181,-181.0
2851,105,-105.0
2852,98,-98.0
2853,141,-141.0
2854,138,-138.0
2855,142,-142.0
2856,168,-168.0
2857,138,-138.0
2858,138,-138.0
2859,143,-143.0
2860,140,-140.0
2861,142,-142.0
2862,139,-139.0
2863,141,-141.0
2864,146,-146.0
2865,145,-145.0
2866,140,-140.0
2867,142,-142.0
2868,139,-139.0
2869,143,-143.0
2870,139,-139.0
2871,141,-141.0
2872,176,-176.0
2873,83,-83.0
2874,166,-166.0
2875,154,-154.0
2876,97,-97.0
2877,91,-91.0
2878,85,-85.0
2879,153,-153.0
2880,139,-139.0
2881,93,-93.0
2882,162,-162.0
2883,140,-140.0
2884,141,-141.0
2885,138,-138.0
2886,84,-84.0
2887,140,-140.0
2888,149,-149.0
2889,145,-145.0
2890,157,-157.0
2891,199,-199.0
2892,132,-132.0
2893,85,-85.0
2894,141,-141.0
2895,87,-87.0
2896,142,-142.0
2897,108,-108.0
2898,90,-90.0
2899,84,-84.0
2900,137,-137.0
2901,138,-138.0
2902,173,-173.0
2903,85,-85.0
2904,146,-146.0
2905,89,-89.0
2906,143,-143.0
2907,143,-143.0
2908,154,-154.0
2909,149,-149.0
2910,86,-86.0
2911,165,-165.0
2912,145,-145.0
2913,139,-139.0
2914,164,-164.0
2915,140,-140.0
2916,173,-173.0
2917,150,-150.0
2918,200,-200.0
2919,144,-144.0
2920,109,-109.0
2921,145,-145.0
2922,83,-83.0
2923,93,-93.0
2924,200,-200.0
2925,200,-200.0
2926,138,-138.0
2927,142,-142.0
2928,189,-189.0
2929,140,-140.0
2930,138,-138.0
2931,140,-140.0
2932,85,-85.0
2933,200,-200.0
2934,140,-140.0
2935,141,-141.0
2936,112,-112.0
2937,140,-140.0
2938,138,-138.0
2939,139,-139.0
2940,140,-140.0
2941,153,-153.0
2942,154,-154.0
2943,136,-136.0
2944,192,-192.0
2945,139,-139.0
2946,139,-139.0
2947,102,-102.0
2948,173,-173.0
2949,138,-138.0
2950,200,-200.0
