episodes,steps,rewards
0,200,-200.0
1,200,-200.0
2,200,-200.0
3,200,-200.0
4,200,-200.0
5,200,-200.0
6,200,-200.0
7,200,-200.0
8,200,-200.0
9,200,-200.0
10,185,-185.0
11,200,-200.0
12,200,-200.0
13,200,-200.0
14,200,-200.0
15,200,-200.0
16,200,-200.0
17,200,-200.0
18,200,-200.0
19,190,-190.0
20,200,-200.0
21,200,-200.0
22,200,-200.0
23,200,-200.0
24,200,-200.0
25,162,-162.0
26,200,-200.0
27,200,-200.0
28,200,-200.0
29,200,-200.0
30,200,-200.0
31,200,-200.0
32,200,-200.0
33,200,-200.0
34,200,-200.0
35,200,-200.0
36,200,-200.0
37,200,-200.0
38,200,-200.0
39,200,-200.0
40,200,-200.0
41,200,-200.0
42,200,-200.0
43,200,-200.0
44,200,-200.0
45,200,-200.0
46,200,-200.0
47,200,-200.0
48,200,-200.0
49,200,-200.0
50,200,-200.0
51,200,-200.0
52,200,-200.0
53,200,-200.0
54,200,-200.0
55,200,-200.0
56,200,-200.0
57,158,-158.0
58,200,-200.0
59,196,-196.0
60,200,-200.0
61,200,-200.0
62,200,-200.0
63,200,-200.0
64,200,-200.0
65,196,-196.0
66,200,-200.0
67,115,-115.0
68,179,-179.0
69,146,-146.0
70,179,-179.0
71,200,-200.0
72,200,-200.0
73,200,-200.0
74,101,-101.0
75,163,-163.0
76,93,-93.0
77,171,-171.0
78,200,-200.0
79,166,-166.0
80,200,-200.0
81,86,-86.0
82,195,-195.0
83,199,-199.0
84,200,-200.0
85,177,-177.0
86,200,-200.0
87,102,-102.0
88,198,-198.0
89,183,-183.0
90,154,-154.0
91,200,-200.0
92,188,-188.0
93,84,-84.0
94,200,-200.0
95,200,-200.0
96,200,-200.0
97,160,-160.0
98,200,-200.0
99,119,-119.0
100,192,-192.0
101,197,-197.0
102,119,-119.0
103,190,-190.0
104,193,-193.0
105,158,-158.0
106,200,-200.0
107,192,-192.0
108,128,-128.0
109,159,-159.0
110,175,-175.0
111,169,-169.0
112,200,-200.0
113,200,-200.0
114,200,-200.0
115,200,-200.0
116,150,-150.0
117,200,-200.0
118,180,-180.0
119,200,-200.0
120,187,-187.0
121,178,-178.0
122,153,-153.0
123,186,-186.0
124,87,-87.0
125,152,-152.0
126,114,-114.0
127,120,-120.0
128,106,-106.0
129,162,-162.0
130,147,-147.0
131,124,-124.0
132,168,-168.0
133,91,-91.0
134,168,-168.0
135,92,-92.0
136,165,-165.0
137,93,-93.0
138,171,-171.0
139,112,-112.0
140,174,-174.0
141,128,-128.0
142,170,-170.0
143,167,-167.0
144,173,-173.0
145,165,-165.0
146,155,-155.0
147,106,-106.0
148,119,-119.0
149,108,-108.0
150,131,-131.0
151,174,-174.0
152,190,-190.0
153,127,-127.0
154,130,-130.0
155,113,-113.0
156,144,-144.0
157,120,-120.0
158,140,-140.0
159,157,-157.0
160,107,-107.0
161,178,-178.0
162,89,-89.0
163,106,-106.0
164,115,-115.0
165,151,-151.0
166,124,-124.0
167,154,-154.0
168,116,-116.0
169,156,-156.0
170,152,-152.0
171,114,-114.0
172,140,-140.0
173,116,-116.0
174,157,-157.0
175,166,-166.0
176,109,-109.0
177,147,-147.0
178,121,-121.0
179,152,-152.0
180,156,-156.0
181,148,-148.0
182,110,-110.0
183,149,-149.0
184,147,-147.0
185,88,-88.0
186,146,-146.0
187,149,-149.0
188,144,-144.0
189,83,-83.0
190,86,-86.0
191,90,-90.0
192,152,-152.0
193,161,-161.0
194,143,-143.0
195,151,-151.0
196,161,-161.0
197,155,-155.0
198,139,-139.0
199,148,-148.0
200,139,-139.0
201,176,-176.0
202,155,-155.0
203,148,-148.0
204,165,-165.0
205,137,-137.0
206,175,-175.0
207,147,-147.0
208,157,-157.0
209,154,-154.0
210,146,-146.0
211,153,-153.0
212,195,-195.0
213,158,-158.0
214,138,-138.0
215,98,-98.0
216,162,-162.0
217,148,-148.0
218,135,-135.0
219,148,-148.0
220,175,-175.0
221,154,-154.0
222,94,-94.0
223,132,-132.0
224,95,-95.0
225,102,-102.0
226,158,-158.0
227,161,-161.0
228,87,-87.0
229,141,-141.0
230,175,-175.0
231,175,-175.0
232,157,-157.0
233,99,-99.0
234,142,-142.0
235,166,-166.0
236,163,-163.0
237,87,-87.0
238,146,-146.0
239,158,-158.0
240,159,-159.0
241,98,-98.0
242,172,-172.0
243,151,-151.0
244,156,-156.0
245,150,-150.0
246,85,-85.0
247,182,-182.0
248,149,-149.0
249,182,-182.0
250,149,-149.0
251,155,-155.0
252,155,-155.0
253,200,-200.0
254,91,-91.0
255,151,-151.0
256,110,-110.0
257,167,-167.0
258,111,-111.0
259,87,-87.0
260,107,-107.0
261,92,-92.0
262,145,-145.0
263,106,-106.0
264,180,-180.0
265,168,-168.0
266,151,-151.0
267,87,-87.0
268,87,-87.0
269,141,-141.0
270,154,-154.0
271,104,-104.0
272,85,-85.0
273,137,-137.0
274,85,-85.0
275,156,-156.0
276,87,-87.0
277,108,-108.0
278,152,-152.0
279,164,-164.0
280,158,-158.0
281,87,-87.0
282,165,-165.0
283,151,-151.0
284,86,-86.0
285,138,-138.0
286,86,-86.0
287,95,-95.0
288,169,-169.0
289,155,-155.0
290,94,-94.0
291,93,-93.0
292,100,-100.0
293,161,-161.0
294,135,-135.0
295,156,-156.0
296,142,-142.0
297,89,-89.0
298,85,-85.0
299,127,-127.0
300,93,-93.0
301,85,-85.0
302,155,-155.0
303,158,-158.0
304,113,-113.0
305,91,-91.0
306,102,-102.0
307,87,-87.0
308,138,-138.0
309,86,-86.0
310,90,-90.0
311,125,-125.0
312,157,-157.0
313,142,-142.0
314,96,-96.0
315,158,-158.0
316,135,-135.0
317,144,-144.0
318,138,-138.0
319,150,-150.0
320,88,-88.0
321,87,-87.0
322,153,-153.0
323,131,-131.0
324,85,-85.0
325,144,-144.0
326,87,-87.0
327,115,-115.0
328,200,-200.0
329,169,-169.0
330,91,-91.0
331,145,-145.0
332,148,-148.0
333,146,-146.0
334,154,-154.0
335,90,-90.0
336,171,-171.0
337,133,-133.0
338,100,-100.0
339,142,-142.0
340,147,-147.0
341,154,-154.0
342,85,-85.0
343,104,-104.0
344,112,-112.0
345,153,-153.0
346,169,-169.0
347,148,-148.0
348,139,-139.0
349,200,-200.0
350,146,-146.0
351,142,-142.0
352,142,-142.0
353,200,-200.0
354,165,-165.0
355,147,-147.0
356,148,-148.0
357,139,-139.0
358,175,-175.0
359,173,-173.0
360,102,-102.0
361,155,-155.0
362,91,-91.0
363,168,-168.0
364,134,-134.0
365,165,-165.0
366,137,-137.0
367,159,-159.0
368,149,-149.0
369,168,-168.0
370,150,-150.0
371,181,-181.0
372,186,-186.0
373,131,-131.0
374,108,-108.0
375,136,-136.0
376,137,-137.0
377,106,-106.0
378,89,-89.0
379,132,-132.0
380,83,-83.0
381,137,-137.0
382,84,-84.0
383,174,-174.0
384,121,-121.0
385,145,-145.0
386,147,-147.0
387,86,-86.0
388,131,-131.0
389,175,-175.0
390,120,-120.0
391,131,-131.0
392,175,-175.0
393,155,-155.0
394,98,-98.0
395,156,-156.0
396,200,-200.0
397,146,-146.0
398,84,-84.0
399,146,-146.0
400,94,-94.0
401,142,-142.0
402,129,-129.0
403,84,-84.0
404,108,-108.0
405,96,-96.0
406,160,-160.0
407,112,-112.0
408,90,-90.0
409,167,-167.0
410,131,-131.0
411,108,-108.0
412,150,-150.0
413,107,-107.0
414,104,-104.0
415,107,-107.0
416,161,-161.0
417,108,-108.0
418,168,-168.0
419,92,-92.0
420,88,-88.0
421,92,-92.0
422,107,-107.0
423,158,-158.0
424,147,-147.0
425,189,-189.0
426,102,-102.0
427,91,-91.0
428,104,-104.0
429,152,-152.0
430,110,-110.0
431,104,-104.0
432,107,-107.0
433,106,-106.0
434,85,-85.0
435,104,-104.0
436,108,-108.0
437,138,-138.0
438,106,-106.0
439,105,-105.0
440,106,-106.0
441,86,-86.0
442,105,-105.0
443,89,-89.0
444,177,-177.0
445,105,-105.0
446,106,-106.0
447,85,-85.0
448,139,-139.0
449,93,-93.0
450,130,-130.0
451,96,-96.0
452,106,-106.0
453,119,-119.0
454,137,-137.0
455,134,-134.0
456,138,-138.0
457,105,-105.0
458,158,-158.0
459,124,-124.0
460,141,-141.0
461,86,-86.0
462,105,-105.0
463,106,-106.0
464,107,-107.0
465,150,-150.0
466,133,-133.0
467,153,-153.0
468,173,-173.0
469,169,-169.0
470,110,-110.0
471,135,-135.0
472,124,-124.0
473,112,-112.0
474,175,-175.0
475,108,-108.0
476,111,-111.0
477,104,-104.0
478,89,-89.0
479,111,-111.0
480,109,-109.0
481,88,-88.0
482,111,-111.0
483,93,-93.0
484,107,-107.0
485,149,-149.0
486,171,-171.0
487,141,-141.0
488,103,-103.0
489,136,-136.0
490,107,-107.0
491,138,-138.0
492,86,-86.0
493,85,-85.0
494,155,-155.0
495,87,-87.0
496,86,-86.0
497,160,-160.0
498,94,-94.0
499,146,-146.0
500,83,-83.0
501,143,-143.0
502,86,-86.0
503,145,-145.0
504,142,-142.0
505,86,-86.0
506,141,-141.0
507,134,-134.0
508,116,-116.0
509,109,-109.0
510,147,-147.0
511,110,-110.0
512,85,-85.0
513,160,-160.0
514,111,-111.0
515,107,-107.0
516,111,-111.0
517,114,-114.0
518,93,-93.0
519,166,-166.0
520,156,-156.0
521,146,-146.0
522,161,-161.0
523,110,-110.0
524,87,-87.0
525,155,-155.0
526,99,-99.0
527,84,-84.0
528,98,-98.0
529,138,-138.0
530,109,-109.0
531,150,-150.0
532,145,-145.0
533,101,-101.0
534,143,-143.0
535,95,-95.0
536,144,-144.0
537,84,-84.0
538,142,-142.0
539,145,-145.0
540,141,-141.0
541,84,-84.0
542,109,-109.0
543,101,-101.0
544,153,-153.0
545,136,-136.0
546,161,-161.0
547,149,-149.0
548,88,-88.0
549,110,-110.0
550,156,-156.0
551,147,-147.0
552,140,-140.0
553,85,-85.0
554,97,-97.0
555,139,-139.0
556,87,-87.0
557,105,-105.0
558,107,-107.0
559,92,-92.0
560,161,-161.0
561,89,-89.0
562,109,-109.0
563,90,-90.0
564,140,-140.0
565,137,-137.0
566,140,-140.0
567,85,-85.0
568,139,-139.0
569,102,-102.0
570,95,-95.0
571,106,-106.0
572,136,-136.0
573,136,-136.0
574,138,-138.0
575,140,-140.0
576,139,-139.0
577,160,-160.0
578,136,-136.0
579,135,-135.0
580,139,-139.0
581,138,-138.0
582,139,-139.0
583,141,-141.0
584,141,-141.0
585,137,-137.0
586,104,-104.0
587,139,-139.0
588,140,-140.0
589,139,-139.0
590,167,-167.0
591,138,-138.0
592,188,-188.0
593,189,-189.0
594,92,-92.0
595,138,-138.0
596,136,-136.0
597,92,-92.0
598,140,-140.0
599,91,-91.0
600,104,-104.0
601,92,-92.0
602,86,-86.0
603,87,-87.0
604,88,-88.0
605,135,-135.0
606,137,-137.0
607,92,-92.0
608,107,-107.0
609,132,-132.0
610,106,-106.0
611,88,-88.0
612,137,-137.0
613,97,-97.0
614,90,-90.0
615,137,-137.0
616,107,-107.0
617,103,-103.0
618,146,-146.0
619,83,-83.0
620,85,-85.0
621,137,-137.0
622,141,-141.0
623,87,-87.0
624,137,-137.0
625,93,-93.0
626,139,-139.0
627,94,-94.0
628,90,-90.0
629,83,-83.0
630,108,-108.0
631,139,-139.0
632,152,-152.0
633,147,-147.0
634,138,-138.0
635,87,-87.0
636,110,-110.0
637,86,-86.0
638,183,-183.0
639,141,-141.0
640,138,-138.0
641,88,-88.0
642,138,-138.0
643,135,-135.0
644,106,-106.0
645,200,-200.0
646,139,-139.0
647,114,-114.0
648,108,-108.0
649,105,-105.0
650,87,-87.0
651,140,-140.0
652,98,-98.0
653,164,-164.0
654,105,-105.0
655,176,-176.0
656,85,-85.0
657,134,-134.0
658,136,-136.0
659,86,-86.0
660,92,-92.0
661,125,-125.0
662,177,-177.0
663,94,-94.0
664,159,-159.0
665,110,-110.0
666,137,-137.0
667,138,-138.0
668,86,-86.0
669,104,-104.0
670,87,-87.0
671,107,-107.0
672,137,-137.0
673,112,-112.0
674,143,-143.0
675,88,-88.0
676,140,-140.0
677,180,-180.0
678,137,-137.0
679,125,-125.0
680,110,-110.0
681,84,-84.0
682,139,-139.0
683,138,-138.0
684,169,-169.0
685,140,-140.0
686,136,-136.0
687,138,-138.0
688,84,-84.0
689,84,-84.0
690,106,-106.0
691,168,-168.0
692,124,-124.0
693,137,-137.0
694,90,-90.0
695,133,-133.0
696,86,-86.0
697,134,-134.0
698,110,-110.0
699,99,-99.0
700,133,-133.0
701,137,-137.0
702,87,-87.0
703,138,-138.0
704,115,-115.0
705,109,-109.0
706,87,-87.0
707,107,-107.0
708,83,-83.0
709,138,-138.0
710,150,-150.0
711,140,-140.0
712,113,-113.0
713,137,-137.0
714,114,-114.0
715,99,-99.0
716,108,-108.0
717,93,-93.0
718,110,-110.0
719,109,-109.0
720,96,-96.0
721,110,-110.0
722,91,-91.0
723,86,-86.0
724,100,-100.0
725,168,-168.0
726,86,-86.0
727,168,-168.0
728,107,-107.0
729,114,-114.0
730,141,-141.0
731,173,-173.0
732,136,-136.0
733,114,-114.0
734,99,-99.0
735,141,-141.0
736,138,-138.0
737,86,-86.0
738,96,-96.0
739,135,-135.0
740,141,-141.0
741,141,-141.0
742,135,-135.0
743,147,-147.0
744,92,-92.0
745,145,-145.0
746,136,-136.0
747,142,-142.0
748,180,-180.0
749,122,-122.0
750,144,-144.0
751,130,-130.0
752,129,-129.0
753,136,-136.0
754,91,-91.0
755,146,-146.0
756,85,-85.0
757,140,-140.0
758,97,-97.0
759,134,-134.0
760,96,-96.0
761,187,-187.0
762,182,-182.0
763,139,-139.0
764,97,-97.0
765,97,-97.0
766,132,-132.0
767,142,-142.0
768,143,-143.0
769,139,-139.0
770,142,-142.0
771,83,-83.0
772,148,-148.0
773,90,-90.0
774,94,-94.0
775,88,-88.0
776,192,-192.0
777,135,-135.0
778,88,-88.0
779,87,-87.0
780,200,-200.0
781,143,-143.0
782,162,-162.0
783,145,-145.0
784,89,-89.0
785,88,-88.0
786,85,-85.0
787,166,-166.0
788,144,-144.0
789,155,-155.0
790,85,-85.0
791,91,-91.0
792,141,-141.0
793,87,-87.0
794,135,-135.0
795,144,-144.0
796,87,-87.0
797,139,-139.0
798,90,-90.0
799,147,-147.0
800,140,-140.0
801,151,-151.0
802,91,-91.0
803,138,-138.0
804,138,-138.0
805,97,-97.0
806,141,-141.0
807,148,-148.0
808,140,-140.0
809,113,-113.0
810,114,-114.0
811,89,-89.0
812,149,-149.0
813,84,-84.0
814,142,-142.0
815,95,-95.0
816,143,-143.0
817,139,-139.0
818,91,-91.0
819,159,-159.0
820,141,-141.0
821,139,-139.0
822,99,-99.0
823,87,-87.0
824,142,-142.0
825,138,-138.0
826,138,-138.0
827,85,-85.0
828,138,-138.0
829,138,-138.0
830,90,-90.0
831,152,-152.0
832,89,-89.0
833,115,-115.0
834,138,-138.0
835,136,-136.0
836,136,-136.0
837,137,-137.0
838,139,-139.0
839,85,-85.0
840,135,-135.0
841,132,-132.0
842,115,-115.0
843,115,-115.0
844,160,-160.0
845,141,-141.0
846,163,-163.0
847,110,-110.0
848,88,-88.0
849,91,-91.0
850,87,-87.0
851,97,-97.0
852,155,-155.0
853,136,-136.0
854,137,-137.0
855,144,-144.0
856,135,-135.0
857,89,-89.0
858,88,-88.0
859,142,-142.0
860,97,-97.0
861,160,-160.0
862,116,-116.0
863,139,-139.0
864,146,-146.0
865,155,-155.0
866,145,-145.0
867,83,-83.0
868,87,-87.0
869,145,-145.0
870,83,-83.0
871,147,-147.0
872,137,-137.0
873,148,-148.0
874,154,-154.0
875,88,-88.0
876,145,-145.0
877,146,-146.0
878,137,-137.0
879,98,-98.0
880,96,-96.0
881,146,-146.0
882,91,-91.0
883,139,-139.0
884,144,-144.0
885,89,-89.0
886,85,-85.0
887,99,-99.0
888,85,-85.0
889,144,-144.0
890,154,-154.0
891,107,-107.0
892,87,-87.0
893,89,-89.0
894,88,-88.0
895,142,-142.0
896,102,-102.0
897,86,-86.0
898,144,-144.0
899,148,-148.0
900,143,-143.0
901,141,-141.0
902,97,-97.0
903,143,-143.0
904,91,-91.0
905,91,-91.0
906,147,-147.0
907,154,-154.0
908,155,-155.0
909,152,-152.0
910,95,-95.0
911,95,-95.0
912,143,-143.0
913,144,-144.0
914,144,-144.0
915,145,-145.0
916,145,-145.0
917,93,-93.0
918,140,-140.0
919,148,-148.0
920,151,-151.0
921,92,-92.0
922,145,-145.0
923,147,-147.0
924,83,-83.0
925,138,-138.0
926,143,-143.0
927,144,-144.0
928,142,-142.0
929,146,-146.0
930,83,-83.0
931,140,-140.0
932,142,-142.0
933,142,-142.0
934,141,-141.0
935,159,-159.0
936,142,-142.0
937,105,-105.0
938,145,-145.0
939,109,-109.0
940,154,-154.0
941,146,-146.0
942,89,-89.0
943,145,-145.0
944,104,-104.0
945,159,-159.0
946,95,-95.0
947,145,-145.0
948,138,-138.0
949,141,-141.0
950,142,-142.0
951,83,-83.0
952,139,-139.0
953,140,-140.0
954,107,-107.0
955,88,-88.0
956,144,-144.0
957,95,-95.0
958,85,-85.0
959,154,-154.0
960,99,-99.0
961,145,-145.0
962,86,-86.0
963,158,-158.0
964,140,-140.0
965,143,-143.0
966,138,-138.0
967,170,-170.0
968,148,-148.0
969,170,-170.0
970,168,-168.0
971,98,-98.0
972,151,-151.0
973,142,-142.0
974,148,-148.0
975,83,-83.0
976,180,-180.0
977,151,-151.0
978,151,-151.0
979,148,-148.0
980,125,-125.0
981,92,-92.0
982,200,-200.0
983,93,-93.0
984,91,-91.0
985,172,-172.0
986,86,-86.0
987,88,-88.0
988,148,-148.0
989,90,-90.0
990,86,-86.0
991,167,-167.0
992,147,-147.0
993,142,-142.0
994,154,-154.0
995,151,-151.0
996,102,-102.0
997,154,-154.0
998,86,-86.0
999,96,-96.0
1000,86,-86.0
1001,154,-154.0
1002,94,-94.0
1003,200,-200.0
1004,147,-147.0
1005,98,-98.0
1006,97,-97.0
1007,90,-90.0
1008,148,-148.0
1009,150,-150.0
1010,147,-147.0
1011,87,-87.0
1012,147,-147.0
1013,94,-94.0
1014,151,-151.0
1015,141,-141.0
1016,142,-142.0
1017,83,-83.0
1018,143,-143.0
1019,146,-146.0
1020,108,-108.0
1021,138,-138.0
1022,88,-88.0
1023,144,-144.0
1024,149,-149.0
1025,150,-150.0
1026,87,-87.0
1027,142,-142.0
1028,89,-89.0
1029,87,-87.0
1030,150,-150.0
1031,142,-142.0
1032,144,-144.0
1033,84,-84.0
1034,89,-89.0
1035,150,-150.0
1036,84,-84.0
1037,86,-86.0
1038,85,-85.0
1039,85,-85.0
1040,144,-144.0
1041,157,-157.0
1042,153,-153.0
1043,149,-149.0
1044,90,-90.0
1045,144,-144.0
1046,148,-148.0
1047,141,-141.0
1048,143,-143.0
1049,141,-141.0
1050,150,-150.0
1051,156,-156.0
1052,139,-139.0
1053,143,-143.0
1054,191,-191.0
1055,142,-142.0
1056,138,-138.0
1057,86,-86.0
1058,140,-140.0
1059,140,-140.0
1060,140,-140.0
1061,89,-89.0
1062,138,-138.0
1063,91,-91.0
1064,165,-165.0
1065,144,-144.0
1066,137,-137.0
1067,87,-87.0
1068,87,-87.0
1069,200,-200.0
1070,150,-150.0
1071,146,-146.0
1072,140,-140.0
1073,149,-149.0
1074,91,-91.0
1075,89,-89.0
1076,141,-141.0
1077,83,-83.0
1078,148,-148.0
1079,146,-146.0
1080,151,-151.0
1081,89,-89.0
1082,84,-84.0
1083,147,-147.0
1084,83,-83.0
1085,87,-87.0
1086,85,-85.0
1087,146,-146.0
1088,85,-85.0
1089,150,-150.0
1090,153,-153.0
1091,200,-200.0
1092,141,-141.0
1093,143,-143.0
1094,139,-139.0
1095,85,-85.0
1096,89,-89.0
1097,86,-86.0
1098,150,-150.0
1099,169,-169.0
1100,147,-147.0
1101,140,-140.0
1102,92,-92.0
1103,149,-149.0
1104,150,-150.0
1105,142,-142.0
1106,146,-146.0
1107,88,-88.0
1108,176,-176.0
1109,141,-141.0
1110,90,-90.0
1111,142,-142.0
1112,161,-161.0
1113,145,-145.0
1114,149,-149.0
1115,141,-141.0
1116,146,-146.0
1117,146,-146.0
1118,153,-153.0
1119,90,-90.0
1120,200,-200.0
1121,143,-143.0
1122,145,-145.0
1123,180,-180.0
1124,84,-84.0
1125,141,-141.0
1126,86,-86.0
1127,138,-138.0
1128,142,-142.0
1129,138,-138.0
1130,140,-140.0
1131,135,-135.0
1132,92,-92.0
1133,139,-139.0
1134,140,-140.0
1135,92,-92.0
1136,144,-144.0
1137,89,-89.0
1138,92,-92.0
1139,145,-145.0
1140,97,-97.0
1141,149,-149.0
1142,145,-145.0
1143,142,-142.0
1144,88,-88.0
1145,200,-200.0
1146,147,-147.0
1147,148,-148.0
1148,91,-91.0
1149,84,-84.0
1150,200,-200.0
1151,143,-143.0
1152,92,-92.0
1153,143,-143.0
1154,141,-141.0
1155,143,-143.0
1156,85,-85.0
1157,141,-141.0
1158,147,-147.0
1159,140,-140.0
1160,84,-84.0
1161,141,-141.0
1162,200,-200.0
1163,200,-200.0
1164,160,-160.0
1165,168,-168.0
1166,100,-100.0
1167,154,-154.0
1168,200,-200.0
1169,141,-141.0
1170,94,-94.0
1171,200,-200.0
1172,200,-200.0
1173,142,-142.0
1174,145,-145.0
1175,142,-142.0
1176,97,-97.0
1177,147,-147.0
1178,137,-137.0
1179,139,-139.0
1180,139,-139.0
1181,137,-137.0
1182,136,-136.0
1183,90,-90.0
1184,144,-144.0
1185,137,-137.0
1186,134,-134.0
1187,140,-140.0
1188,86,-86.0
1189,154,-154.0
1190,141,-141.0
1191,200,-200.0
1192,147,-147.0
1193,140,-140.0
1194,135,-135.0
1195,143,-143.0
1196,136,-136.0
1197,139,-139.0
1198,166,-166.0
1199,90,-90.0
1200,200,-200.0
1201,143,-143.0
1202,139,-139.0
1203,140,-140.0
1204,89,-89.0
1205,146,-146.0
1206,178,-178.0
1207,200,-200.0
1208,100,-100.0
1209,152,-152.0
1210,163,-163.0
1211,147,-147.0
1212,155,-155.0
1213,93,-93.0
1214,139,-139.0
1215,136,-136.0
1216,140,-140.0
1217,134,-134.0
1218,105,-105.0
1219,151,-151.0
1220,90,-90.0
1221,157,-157.0
1222,134,-134.0
1223,92,-92.0
1224,142,-142.0
1225,96,-96.0
1226,106,-106.0
1227,136,-136.0
1228,146,-146.0
1229,149,-149.0
1230,162,-162.0
1231,138,-138.0
1232,187,-187.0
1233,138,-138.0
1234,153,-153.0
1235,87,-87.0
1236,144,-144.0
1237,88,-88.0
1238,95,-95.0
1239,92,-92.0
1240,149,-149.0
1241,91,-91.0
1242,155,-155.0
1243,144,-144.0
1244,103,-103.0
1245,146,-146.0
1246,111,-111.0
1247,149,-149.0
1248,167,-167.0
1249,149,-149.0
1250,146,-146.0
1251,103,-103.0
1252,151,-151.0
1253,92,-92.0
1254,152,-152.0
1255,160,-160.0
1256,108,-108.0
1257,133,-133.0
1258,141,-141.0
1259,85,-85.0
1260,143,-143.0
1261,94,-94.0
1262,166,-166.0
1263,165,-165.0
1264,143,-143.0
1265,89,-89.0
1266,138,-138.0
1267,99,-99.0
1268,87,-87.0
1269,165,-165.0
1270,144,-144.0
1271,92,-92.0
1272,150,-150.0
1273,90,-90.0
1274,85,-85.0
1275,134,-134.0
1276,88,-88.0
1277,118,-118.0
1278,92,-92.0
1279,143,-143.0
1280,140,-140.0
1281,148,-148.0
1282,145,-145.0
1283,148,-148.0
1284,130,-130.0
1285,145,-145.0
1286,178,-178.0
1287,94,-94.0
1288,96,-96.0
1289,93,-93.0
1290,150,-150.0
1291,97,-97.0
1292,156,-156.0
1293,157,-157.0
1294,152,-152.0
1295,103,-103.0
1296,171,-171.0
1297,143,-143.0
1298,196,-196.0
1299,167,-167.0
1300,142,-142.0
1301,146,-146.0
1302,88,-88.0
1303,142,-142.0
1304,92,-92.0
1305,145,-145.0
1306,97,-97.0
1307,170,-170.0
1308,146,-146.0
1309,99,-99.0
1310,165,-165.0
1311,92,-92.0
1312,139,-139.0
1313,200,-200.0
1314,163,-163.0
1315,142,-142.0
1316,110,-110.0
1317,139,-139.0
1318,141,-141.0
1319,147,-147.0
1320,146,-146.0
1321,144,-144.0
1322,150,-150.0
1323,141,-141.0
1324,143,-143.0
1325,90,-90.0
1326,97,-97.0
1327,165,-165.0
1328,146,-146.0
1329,89,-89.0
1330,90,-90.0
1331,145,-145.0
1332,149,-149.0
1333,200,-200.0
1334,200,-200.0
1335,96,-96.0
1336,151,-151.0
1337,135,-135.0
1338,137,-137.0
1339,152,-152.0
1340,132,-132.0
1341,151,-151.0
1342,145,-145.0
1343,91,-91.0
1344,144,-144.0
1345,163,-163.0
1346,143,-143.0
1347,170,-170.0
1348,102,-102.0
1349,143,-143.0
1350,200,-200.0
1351,136,-136.0
1352,115,-115.0
1353,145,-145.0
1354,163,-163.0
1355,140,-140.0
1356,109,-109.0
1357,89,-89.0
1358,162,-162.0
1359,158,-158.0
1360,93,-93.0
1361,159,-159.0
1362,90,-90.0
1363,140,-140.0
1364,95,-95.0
1365,153,-153.0
1366,131,-131.0
1367,97,-97.0
1368,158,-158.0
1369,88,-88.0
1370,97,-97.0
1371,118,-118.0
1372,146,-146.0
1373,88,-88.0
1374,145,-145.0
1375,95,-95.0
1376,147,-147.0
1377,146,-146.0
1378,141,-141.0
1379,141,-141.0
1380,144,-144.0
1381,146,-146.0
1382,151,-151.0
1383,143,-143.0
1384,86,-86.0
1385,140,-140.0
1386,138,-138.0
1387,139,-139.0
1388,152,-152.0
1389,96,-96.0
1390,139,-139.0
1391,146,-146.0
1392,91,-91.0
1393,94,-94.0
1394,168,-168.0
1395,98,-98.0
1396,133,-133.0
1397,151,-151.0
1398,171,-171.0
1399,87,-87.0
1400,143,-143.0
1401,145,-145.0
1402,140,-140.0
1403,133,-133.0
1404,135,-135.0
1405,142,-142.0
1406,176,-176.0
1407,150,-150.0
1408,95,-95.0
1409,143,-143.0
1410,158,-158.0
1411,84,-84.0
1412,127,-127.0
1413,88,-88.0
1414,87,-87.0
1415,88,-88.0
1416,143,-143.0
1417,145,-145.0
1418,102,-102.0
1419,157,-157.0
1420,88,-88.0
1421,86,-86.0
1422,146,-146.0
1423,144,-144.0
1424,137,-137.0
1425,142,-142.0
1426,89,-89.0
1427,89,-89.0
1428,169,-169.0
1429,138,-138.0
1430,192,-192.0
1431,140,-140.0
1432,129,-129.0
1433,138,-138.0
1434,86,-86.0
1435,152,-152.0
1436,140,-140.0
1437,90,-90.0
1438,104,-104.0
1439,138,-138.0
1440,143,-143.0
1441,144,-144.0
1442,146,-146.0
1443,142,-142.0
1444,139,-139.0
1445,87,-87.0
1446,157,-157.0
1447,145,-145.0
1448,88,-88.0
1449,149,-149.0
1450,141,-141.0
1451,131,-131.0
1452,145,-145.0
1453,139,-139.0
1454,91,-91.0
1455,133,-133.0
1456,147,-147.0
1457,86,-86.0
1458,145,-145.0
1459,99,-99.0
1460,125,-125.0
1461,145,-145.0
1462,99,-99.0
1463,136,-136.0
1464,89,-89.0
1465,86,-86.0
1466,139,-139.0
1467,139,-139.0
1468,93,-93.0
1469,139,-139.0
1470,93,-93.0
1471,146,-146.0
1472,154,-154.0
1473,89,-89.0
1474,185,-185.0
1475,86,-86.0
1476,145,-145.0
1477,143,-143.0
1478,102,-102.0
1479,86,-86.0
1480,90,-90.0
1481,147,-147.0
1482,135,-135.0
1483,85,-85.0
1484,154,-154.0
1485,145,-145.0
1486,140,-140.0
1487,143,-143.0
1488,104,-104.0
1489,133,-133.0
1490,138,-138.0
1491,139,-139.0
1492,152,-152.0
1493,99,-99.0
1494,143,-143.0
1495,90,-90.0
1496,142,-142.0
1497,146,-146.0
1498,152,-152.0
1499,193,-193.0
1500,140,-140.0
1501,146,-146.0
1502,187,-187.0
1503,143,-143.0
1504,87,-87.0
1505,142,-142.0
1506,95,-95.0
1507,142,-142.0
1508,148,-148.0
1509,131,-131.0
1510,92,-92.0
1511,119,-119.0
1512,147,-147.0
1513,94,-94.0
1514,142,-142.0
1515,93,-93.0
1516,97,-97.0
1517,147,-147.0
1518,145,-145.0
1519,95,-95.0
1520,89,-89.0
1521,91,-91.0
1522,148,-148.0
1523,151,-151.0
1524,101,-101.0
1525,91,-91.0
1526,143,-143.0
1527,181,-181.0
1528,137,-137.0
1529,86,-86.0
1530,87,-87.0
1531,93,-93.0
1532,127,-127.0
1533,111,-111.0
1534,141,-141.0
1535,147,-147.0
1536,187,-187.0
1537,125,-125.0
1538,96,-96.0
1539,135,-135.0
1540,142,-142.0
1541,92,-92.0
1542,132,-132.0
1543,142,-142.0
1544,123,-123.0
1545,91,-91.0
1546,90,-90.0
1547,144,-144.0
1548,143,-143.0
1549,102,-102.0
1550,177,-177.0
1551,148,-148.0
1552,93,-93.0
1553,88,-88.0
1554,139,-139.0
1555,87,-87.0
1556,132,-132.0
1557,143,-143.0
1558,139,-139.0
1559,110,-110.0
1560,134,-134.0
1561,138,-138.0
1562,169,-169.0
1563,87,-87.0
1564,167,-167.0
1565,134,-134.0
1566,129,-129.0
1567,162,-162.0
1568,126,-126.0
1569,109,-109.0
1570,110,-110.0
1571,148,-148.0
1572,96,-96.0
1573,98,-98.0
1574,106,-106.0
1575,139,-139.0
1576,144,-144.0
1577,143,-143.0
1578,91,-91.0
1579,96,-96.0
1580,185,-185.0
1581,144,-144.0
1582,142,-142.0
1583,87,-87.0
1584,110,-110.0
1585,145,-145.0
1586,90,-90.0
1587,109,-109.0
1588,186,-186.0
1589,141,-141.0
1590,88,-88.0
1591,140,-140.0
1592,138,-138.0
1593,144,-144.0
1594,138,-138.0
1595,145,-145.0
1596,132,-132.0
1597,136,-136.0
1598,133,-133.0
1599,135,-135.0
1600,84,-84.0
1601,144,-144.0
1602,144,-144.0
1603,166,-166.0
1604,138,-138.0
1605,89,-89.0
1606,153,-153.0
1607,144,-144.0
1608,87,-87.0
1609,87,-87.0
1610,84,-84.0
1611,97,-97.0
1612,101,-101.0
1613,146,-146.0
1614,176,-176.0
1615,150,-150.0
1616,162,-162.0
1617,154,-154.0
1618,162,-162.0
1619,159,-159.0
1620,185,-185.0
1621,155,-155.0
1622,171,-171.0
1623,161,-161.0
1624,109,-109.0
1625,164,-164.0
1626,148,-148.0
1627,182,-182.0
1628,146,-146.0
1629,93,-93.0
1630,147,-147.0
1631,145,-145.0
1632,178,-178.0
1633,152,-152.0
1634,86,-86.0
1635,134,-134.0
1636,137,-137.0
1637,152,-152.0
1638,197,-197.0
1639,151,-151.0
1640,91,-91.0
1641,138,-138.0
1642,159,-159.0
1643,106,-106.0
1644,143,-143.0
1645,143,-143.0
1646,136,-136.0
1647,142,-142.0
1648,137,-137.0
1649,86,-86.0
1650,137,-137.0
1651,135,-135.0
1652,111,-111.0
1653,149,-149.0
1654,200,-200.0
1655,144,-144.0
1656,140,-140.0
1657,136,-136.0
1658,156,-156.0
1659,137,-137.0
1660,152,-152.0
1661,137,-137.0
1662,164,-164.0
1663,142,-142.0
1664,147,-147.0
1665,200,-200.0
1666,150,-150.0
1667,149,-149.0
1668,112,-112.0
1669,102,-102.0
1670,172,-172.0
1671,140,-140.0
1672,108,-108.0
1673,113,-113.0
1674,140,-140.0
1675,143,-143.0
1676,145,-145.0
1677,142,-142.0
1678,150,-150.0
1679,143,-143.0
1680,135,-135.0
1681,138,-138.0
1682,148,-148.0
1683,140,-140.0
1684,136,-136.0
1685,141,-141.0
1686,140,-140.0
1687,161,-161.0
1688,139,-139.0
1689,133,-133.0
1690,141,-141.0
1691,115,-115.0
1692,133,-133.0
1693,133,-133.0
1694,135,-135.0
1695,139,-139.0
1696,135,-135.0
1697,138,-138.0
1698,169,-169.0
1699,143,-143.0
1700,136,-136.0
1701,152,-152.0
1702,115,-115.0
1703,150,-150.0
1704,136,-136.0
1705,145,-145.0
1706,137,-137.0
1707,141,-141.0
1708,137,-137.0
1709,157,-157.0
1710,142,-142.0
1711,200,-200.0
1712,97,-97.0
1713,111,-111.0
1714,166,-166.0
1715,158,-158.0
1716,114,-114.0
1717,110,-110.0
1718,110,-110.0
1719,107,-107.0
1720,120,-120.0
1721,177,-177.0
1722,109,-109.0
1723,154,-154.0
1724,105,-105.0
1725,98,-98.0
1726,152,-152.0
1727,163,-163.0
1728,115,-115.0
1729,164,-164.0
1730,150,-150.0
1731,169,-169.0
1732,147,-147.0
1733,89,-89.0
1734,83,-83.0
1735,110,-110.0
1736,200,-200.0
1737,154,-154.0
1738,200,-200.0
1739,85,-85.0
1740,155,-155.0
1741,162,-162.0
1742,164,-164.0
1743,93,-93.0
1744,151,-151.0
1745,147,-147.0
1746,147,-147.0
1747,146,-146.0
1748,158,-158.0
1749,90,-90.0
1750,90,-90.0
1751,168,-168.0
1752,94,-94.0
1753,99,-99.0
1754,163,-163.0
1755,169,-169.0
1756,145,-145.0
1757,98,-98.0
1758,146,-146.0
1759,146,-146.0
1760,140,-140.0
1761,159,-159.0
1762,200,-200.0
1763,162,-162.0
1764,168,-168.0
1765,147,-147.0
1766,188,-188.0
1767,107,-107.0
1768,98,-98.0
1769,95,-95.0
1770,163,-163.0
1771,156,-156.0
1772,91,-91.0
1773,182,-182.0
1774,156,-156.0
1775,149,-149.0
1776,200,-200.0
1777,157,-157.0
1778,97,-97.0
1779,200,-200.0
1780,173,-173.0
1781,173,-173.0
1782,87,-87.0
1783,156,-156.0
1784,179,-179.0
1785,153,-153.0
1786,113,-113.0
1787,103,-103.0
1788,108,-108.0
1789,151,-151.0
1790,170,-170.0
1791,113,-113.0
1792,168,-168.0
1793,149,-149.0
1794,160,-160.0
1795,150,-150.0
1796,166,-166.0
1797,93,-93.0
1798,189,-189.0
1799,148,-148.0
1800,166,-166.0
1801,90,-90.0
1802,162,-162.0
1803,168,-168.0
1804,151,-151.0
1805,177,-177.0
1806,163,-163.0
1807,154,-154.0
1808,96,-96.0
1809,92,-92.0
1810,200,-200.0
1811,182,-182.0
1812,145,-145.0
1813,168,-168.0
1814,200,-200.0
1815,163,-163.0
1816,107,-107.0
1817,156,-156.0
1818,162,-162.0
1819,156,-156.0
1820,150,-150.0
1821,142,-142.0
1822,148,-148.0
1823,152,-152.0
1824,153,-153.0
1825,191,-191.0
1826,142,-142.0
1827,151,-151.0
1828,149,-149.0
1829,145,-145.0
1830,142,-142.0
1831,139,-139.0
1832,200,-200.0
1833,143,-143.0
1834,157,-157.0
1835,163,-163.0
1836,144,-144.0
1837,200,-200.0
1838,138,-138.0
1839,148,-148.0
1840,166,-166.0
1841,200,-200.0
1842,153,-153.0
1843,200,-200.0
1844,157,-157.0
1845,168,-168.0
1846,96,-96.0
1847,150,-150.0
1848,164,-164.0
1849,200,-200.0
1850,151,-151.0
1851,175,-175.0
1852,200,-200.0
1853,152,-152.0
1854,169,-169.0
1855,112,-112.0
1856,151,-151.0
1857,137,-137.0
1858,90,-90.0
1859,184,-184.0
1860,200,-200.0
1861,163,-163.0
1862,118,-118.0
1863,141,-141.0
1864,151,-151.0
1865,158,-158.0
1866,166,-166.0
1867,140,-140.0
1868,156,-156.0
1869,200,-200.0
1870,149,-149.0
1871,151,-151.0
1872,145,-145.0
1873,166,-166.0
1874,142,-142.0
1875,106,-106.0
1876,144,-144.0
1877,166,-166.0
1878,166,-166.0
1879,154,-154.0
1880,146,-146.0
1881,139,-139.0
1882,149,-149.0
1883,100,-100.0
1884,180,-180.0
1885,145,-145.0
1886,200,-200.0
1887,142,-142.0
1888,200,-200.0
1889,143,-143.0
1890,99,-99.0
1891,148,-148.0
1892,154,-154.0
1893,150,-150.0
1894,147,-147.0
1895,200,-200.0
1896,148,-148.0
1897,153,-153.0
1898,157,-157.0
1899,166,-166.0
1900,149,-149.0
1901,142,-142.0
1902,142,-142.0
1903,149,-149.0
1904,140,-140.0
1905,147,-147.0
1906,147,-147.0
1907,87,-87.0
1908,163,-163.0
1909,93,-93.0
1910,187,-187.0
1911,96,-96.0
1912,153,-153.0
1913,92,-92.0
1914,147,-147.0
1915,153,-153.0
1916,176,-176.0
1917,164,-164.0
1918,142,-142.0
1919,158,-158.0
1920,200,-200.0
1921,151,-151.0
1922,140,-140.0
1923,145,-145.0
1924,162,-162.0
1925,151,-151.0
1926,90,-90.0
1927,150,-150.0
1928,159,-159.0
1929,85,-85.0
1930,158,-158.0
1931,146,-146.0
1932,152,-152.0
1933,88,-88.0
1934,93,-93.0
1935,144,-144.0
1936,88,-88.0
1937,152,-152.0
1938,148,-148.0
1939,165,-165.0
1940,137,-137.0
1941,200,-200.0
1942,145,-145.0
1943,163,-163.0
1944,100,-100.0
1945,167,-167.0
1946,100,-100.0
1947,200,-200.0
1948,99,-99.0
1949,143,-143.0
1950,86,-86.0
1951,148,-148.0
1952,193,-193.0
1953,152,-152.0
1954,89,-89.0
1955,182,-182.0
1956,147,-147.0
1957,97,-97.0
1958,90,-90.0
1959,148,-148.0
1960,137,-137.0
1961,137,-137.0
1962,144,-144.0
1963,158,-158.0
1964,143,-143.0
1965,153,-153.0
1966,148,-148.0
1967,141,-141.0
1968,155,-155.0
1969,150,-150.0
1970,90,-90.0
1971,147,-147.0
1972,151,-151.0
1973,146,-146.0
1974,157,-157.0
1975,158,-158.0
1976,148,-148.0
1977,149,-149.0
1978,102,-102.0
1979,158,-158.0
1980,200,-200.0
1981,150,-150.0
1982,161,-161.0
1983,146,-146.0
1984,91,-91.0
1985,155,-155.0
1986,150,-150.0
1987,153,-153.0
1988,84,-84.0
1989,155,-155.0
1990,151,-151.0
1991,91,-91.0
1992,171,-171.0
1993,150,-150.0
1994,175,-175.0
1995,143,-143.0
1996,145,-145.0
1997,154,-154.0
1998,144,-144.0
1999,142,-142.0
2000,200,-200.0
2001,146,-146.0
2002,86,-86.0
2003,101,-101.0
2004,153,-153.0
2005,163,-163.0
2006,200,-200.0
2007,84,-84.0
2008,183,-183.0
2009,107,-107.0
2010,155,-155.0
2011,104,-104.0
2012,160,-160.0
2013,99,-99.0
2014,86,-86.0
2015,88,-88.0
2016,175,-175.0
2017,200,-200.0
2018,182,-182.0
2019,149,-149.0
2020,172,-172.0
2021,83,-83.0
2022,85,-85.0
2023,200,-200.0
2024,135,-135.0
2025,146,-146.0
2026,85,-85.0
2027,200,-200.0
2028,91,-91.0
2029,151,-151.0
2030,161,-161.0
2031,156,-156.0
2032,200,-200.0
2033,200,-200.0
2034,157,-157.0
2035,153,-153.0
2036,160,-160.0
2037,92,-92.0
2038,162,-162.0
2039,166,-166.0
2040,200,-200.0
2041,96,-96.0
2042,200,-200.0
2043,144,-144.0
2044,171,-171.0
2045,90,-90.0
2046,200,-200.0
2047,168,-168.0
2048,98,-98.0
2049,120,-120.0
2050,200,-200.0
2051,139,-139.0
2052,89,-89.0
2053,139,-139.0
2054,149,-149.0
2055,151,-151.0
2056,86,-86.0
2057,84,-84.0
2058,180,-180.0
2059,151,-151.0
2060,200,-200.0
2061,169,-169.0
2062,98,-98.0
2063,182,-182.0
2064,169,-169.0
2065,185,-185.0
2066,155,-155.0
2067,99,-99.0
2068,190,-190.0
2069,142,-142.0
2070,170,-170.0
2071,86,-86.0
2072,200,-200.0
2073,153,-153.0
2074,93,-93.0
2075,115,-115.0
2076,111,-111.0
2077,143,-143.0
2078,94,-94.0
2079,174,-174.0
2080,200,-200.0
2081,158,-158.0
2082,148,-148.0
2083,150,-150.0
2084,85,-85.0
2085,145,-145.0
2086,156,-156.0
2087,170,-170.0
2088,165,-165.0
2089,100,-100.0
2090,141,-141.0
2091,98,-98.0
2092,200,-200.0
2093,144,-144.0
2094,200,-200.0
2095,162,-162.0
2096,150,-150.0
2097,106,-106.0
2098,136,-136.0
2099,167,-167.0
2100,200,-200.0
2101,188,-188.0
2102,160,-160.0
2103,87,-87.0
2104,144,-144.0
2105,89,-89.0
2106,133,-133.0
2107,152,-152.0
2108,136,-136.0
2109,154,-154.0
2110,196,-196.0
2111,177,-177.0
2112,149,-149.0
2113,176,-176.0
2114,91,-91.0
2115,158,-158.0
2116,150,-150.0
2117,149,-149.0
2118,162,-162.0
2119,87,-87.0
2120,164,-164.0
2121,156,-156.0
2122,175,-175.0
2123,200,-200.0
2124,200,-200.0
2125,164,-164.0
2126,164,-164.0
2127,158,-158.0
2128,109,-109.0
2129,155,-155.0
2130,96,-96.0
2131,104,-104.0
2132,161,-161.0
2133,159,-159.0
2134,169,-169.0
2135,164,-164.0
2136,110,-110.0
2137,101,-101.0
2138,200,-200.0
2139,159,-159.0
2140,158,-158.0
2141,94,-94.0
2142,156,-156.0
2143,168,-168.0
2144,102,-102.0
2145,158,-158.0
2146,153,-153.0
2147,97,-97.0
2148,153,-153.0
2149,148,-148.0
2150,143,-143.0
2151,161,-161.0
2152,140,-140.0
2153,152,-152.0
2154,149,-149.0
2155,164,-164.0
2156,153,-153.0
2157,148,-148.0
2158,110,-110.0
2159,118,-118.0
2160,176,-176.0
2161,151,-151.0
2162,147,-147.0
2163,150,-150.0
2164,158,-158.0
2165,146,-146.0
2166,148,-148.0
2167,146,-146.0
2168,140,-140.0
2169,149,-149.0
2170,152,-152.0
2171,152,-152.0
2172,192,-192.0
2173,180,-180.0
2174,107,-107.0
2175,154,-154.0
2176,164,-164.0
2177,145,-145.0
2178,156,-156.0
2179,151,-151.0
2180,173,-173.0
2181,170,-170.0
2182,121,-121.0
2183,153,-153.0
2184,156,-156.0
2185,200,-200.0
2186,149,-149.0
2187,166,-166.0
2188,148,-148.0
2189,200,-200.0
2190,157,-157.0
2191,200,-200.0
2192,200,-200.0
2193,158,-158.0
2194,148,-148.0
2195,189,-189.0
2196,200,-200.0
2197,147,-147.0
2198,144,-144.0
2199,142,-142.0
2200,200,-200.0
2201,144,-144.0
2202,147,-147.0
2203,200,-200.0
2204,200,-200.0
2205,148,-148.0
2206,200,-200.0
2207,163,-163.0
2208,200,-200.0
2209,141,-141.0
2210,200,-200.0
2211,156,-156.0
2212,162,-162.0
2213,155,-155.0
2214,184,-184.0
2215,153,-153.0
2216,164,-164.0
2217,200,-200.0
2218,150,-150.0
2219,151,-151.0
2220,154,-154.0
2221,140,-140.0
2222,154,-154.0
2223,160,-160.0
2224,164,-164.0
2225,155,-155.0
2226,153,-153.0
2227,200,-200.0
2228,157,-157.0
2229,171,-171.0
2230,169,-169.0
2231,189,-189.0
2232,186,-186.0
2233,150,-150.0
2234,146,-146.0
2235,154,-154.0
2236,135,-135.0
2237,137,-137.0
2238,147,-147.0
2239,143,-143.0
2240,125,-125.0
2241,177,-177.0
2242,158,-158.0
2243,167,-167.0
2244,171,-171.0
2245,153,-153.0
2246,174,-174.0
2247,143,-143.0
2248,159,-159.0
2249,154,-154.0
2250,149,-149.0
2251,116,-116.0
2252,145,-145.0
2253,182,-182.0
2254,113,-113.0
2255,150,-150.0
2256,142,-142.0
2257,118,-118.0
2258,136,-136.0
2259,157,-157.0
2260,143,-143.0
2261,128,-128.0
2262,169,-169.0
2263,119,-119.0
2264,154,-154.0
2265,150,-150.0
2266,154,-154.0
2267,162,-162.0
2268,153,-153.0
2269,178,-178.0
2270,162,-162.0
2271,152,-152.0
2272,131,-131.0
2273,162,-162.0
2274,193,-193.0
2275,155,-155.0
2276,182,-182.0
2277,116,-116.0
2278,127,-127.0
2279,162,-162.0
2280,141,-141.0
2281,161,-161.0
2282,123,-123.0
2283,104,-104.0
2284,154,-154.0
2285,191,-191.0
2286,146,-146.0
2287,200,-200.0
2288,152,-152.0
2289,168,-168.0
2290,169,-169.0
2291,91,-91.0
2292,151,-151.0
2293,172,-172.0
2294,169,-169.0
2295,172,-172.0
2296,173,-173.0
2297,172,-172.0
2298,144,-144.0
2299,91,-91.0
2300,147,-147.0
2301,180,-180.0
2302,119,-119.0
2303,121,-121.0
2304,144,-144.0
2305,150,-150.0
2306,162,-162.0
2307,85,-85.0
2308,140,-140.0
2309,165,-165.0
2310,90,-90.0
2311,161,-161.0
2312,104,-104.0
2313,153,-153.0
2314,153,-153.0
2315,156,-156.0
2316,141,-141.0
2317,148,-148.0
2318,168,-168.0
2319,174,-174.0
2320,163,-163.0
2321,169,-169.0
2322,103,-103.0
2323,175,-175.0
2324,170,-170.0
2325,155,-155.0
2326,159,-159.0
2327,172,-172.0
2328,151,-151.0
2329,163,-163.0
2330,170,-170.0
2331,102,-102.0
2332,167,-167.0
2333,156,-156.0
2334,155,-155.0
2335,170,-170.0
2336,179,-179.0
2337,172,-172.0
2338,151,-151.0
2339,147,-147.0
2340,158,-158.0
2341,138,-138.0
2342,92,-92.0
2343,156,-156.0
2344,97,-97.0
2345,147,-147.0
2346,150,-150.0
2347,93,-93.0
2348,157,-157.0
2349,159,-159.0
2350,159,-159.0
2351,90,-90.0
2352,154,-154.0
2353,179,-179.0
2354,200,-200.0
2355,200,-200.0
2356,160,-160.0
2357,164,-164.0
2358,89,-89.0
2359,162,-162.0
2360,153,-153.0
2361,86,-86.0
2362,186,-186.0
2363,162,-162.0
2364,153,-153.0
2365,176,-176.0
2366,91,-91.0
2367,113,-113.0
2368,166,-166.0
2369,163,-163.0
2370,152,-152.0
2371,166,-166.0
2372,163,-163.0
2373,87,-87.0
2374,154,-154.0
2375,157,-157.0
2376,165,-165.0
2377,153,-153.0
2378,163,-163.0
2379,149,-149.0
2380,149,-149.0
2381,154,-154.0
2382,174,-174.0
2383,90,-90.0
2384,146,-146.0
2385,100,-100.0
2386,154,-154.0
2387,148,-148.0
2388,170,-170.0
2389,170,-170.0
2390,155,-155.0
2391,146,-146.0
2392,86,-86.0
2393,150,-150.0
2394,86,-86.0
2395,164,-164.0
2396,90,-90.0
2397,115,-115.0
2398,94,-94.0
2399,174,-174.0
2400,148,-148.0
2401,200,-200.0
2402,147,-147.0
2403,157,-157.0
2404,154,-154.0
2405,151,-151.0
2406,161,-161.0
2407,178,-178.0
2408,155,-155.0
2409,193,-193.0
2410,148,-148.0
2411,150,-150.0
2412,91,-91.0
2413,159,-159.0
2414,141,-141.0
2415,93,-93.0
2416,163,-163.0
2417,89,-89.0
2418,162,-162.0
2419,169,-169.0
2420,89,-89.0
2421,185,-185.0
2422,163,-163.0
2423,184,-184.0
2424,87,-87.0
2425,143,-143.0
2426,144,-144.0
2427,98,-98.0
2428,164,-164.0
2429,153,-153.0
2430,141,-141.0
2431,144,-144.0
2432,138,-138.0
2433,95,-95.0
2434,145,-145.0
2435,144,-144.0
2436,145,-145.0
2437,173,-173.0
2438,146,-146.0
2439,138,-138.0
2440,99,-99.0
2441,149,-149.0
2442,169,-169.0
2443,150,-150.0
2444,142,-142.0
2445,144,-144.0
2446,137,-137.0
2447,159,-159.0
2448,142,-142.0
2449,169,-169.0
2450,168,-168.0
2451,161,-161.0
2452,158,-158.0
2453,93,-93.0
2454,171,-171.0
2455,185,-185.0
2456,187,-187.0
2457,138,-138.0
2458,175,-175.0
2459,99,-99.0
2460,140,-140.0
2461,150,-150.0
2462,146,-146.0
2463,137,-137.0
2464,151,-151.0
2465,145,-145.0
2466,165,-165.0
2467,194,-194.0
2468,159,-159.0
2469,137,-137.0
2470,136,-136.0
2471,139,-139.0
2472,137,-137.0
2473,140,-140.0
2474,133,-133.0
2475,99,-99.0
2476,88,-88.0
2477,139,-139.0
2478,135,-135.0
2479,96,-96.0
2480,102,-102.0
2481,136,-136.0
2482,140,-140.0
2483,143,-143.0
2484,174,-174.0
2485,142,-142.0
2486,99,-99.0
2487,133,-133.0
2488,96,-96.0
2489,147,-147.0
2490,130,-130.0
2491,88,-88.0
2492,176,-176.0
2493,84,-84.0
2494,142,-142.0
2495,167,-167.0
2496,143,-143.0
2497,146,-146.0
2498,88,-88.0
2499,87,-87.0
2500,160,-160.0
2501,143,-143.0
2502,102,-102.0
2503,143,-143.0
2504,85,-85.0
2505,140,-140.0
2506,144,-144.0
2507,85,-85.0
2508,88,-88.0
2509,87,-87.0
2510,141,-141.0
2511,168,-168.0
2512,193,-193.0
2513,86,-86.0
2514,147,-147.0
2515,85,-85.0
2516,153,-153.0
2517,85,-85.0
2518,97,-97.0
2519,138,-138.0
2520,120,-120.0
2521,100,-100.0
2522,100,-100.0
2523,92,-92.0
2524,158,-158.0
2525,125,-125.0
2526,160,-160.0
2527,150,-150.0
2528,142,-142.0
2529,146,-146.0
2530,148,-148.0
2531,157,-157.0
2532,86,-86.0
2533,144,-144.0
2534,154,-154.0
2535,159,-159.0
2536,88,-88.0
2537,85,-85.0
2538,151,-151.0
2539,147,-147.0
2540,146,-146.0
2541,85,-85.0
2542,147,-147.0
2543,155,-155.0
2544,110,-110.0
2545,115,-115.0
2546,86,-86.0
2547,89,-89.0
2548,152,-152.0
2549,164,-164.0
2550,94,-94.0
2551,196,-196.0
2552,116,-116.0
2553,177,-177.0
2554,150,-150.0
2555,147,-147.0
2556,87,-87.0
2557,152,-152.0
2558,154,-154.0
2559,163,-163.0
2560,148,-148.0
2561,161,-161.0
2562,96,-96.0
2563,113,-113.0
2564,193,-193.0
2565,166,-166.0
2566,152,-152.0
2567,92,-92.0
2568,151,-151.0
2569,110,-110.0
2570,151,-151.0
2571,161,-161.0
2572,85,-85.0
2573,95,-95.0
2574,112,-112.0
2575,156,-156.0
2576,149,-149.0
2577,142,-142.0
2578,123,-123.0
2579,89,-89.0
2580,156,-156.0
2581,160,-160.0
2582,157,-157.0
2583,164,-164.0
2584,145,-145.0
2585,152,-152.0
2586,95,-95.0
2587,141,-141.0
2588,87,-87.0
2589,151,-151.0
2590,150,-150.0
2591,144,-144.0
2592,194,-194.0
2593,84,-84.0
2594,156,-156.0
2595,167,-167.0
2596,184,-184.0
2597,180,-180.0
2598,148,-148.0
2599,160,-160.0
2600,149,-149.0
2601,200,-200.0
2602,144,-144.0
2603,84,-84.0
2604,166,-166.0
2605,184,-184.0
2606,156,-156.0
2607,187,-187.0
2608,98,-98.0
2609,146,-146.0
2610,198,-198.0
2611,139,-139.0
2612,91,-91.0
2613,87,-87.0
2614,146,-146.0
2615,147,-147.0
2616,149,-149.0
2617,185,-185.0
2618,176,-176.0
2619,114,-114.0
2620,93,-93.0
2621,143,-143.0
2622,156,-156.0
2623,141,-141.0
2624,151,-151.0
2625,145,-145.0
2626,150,-150.0
2627,155,-155.0
2628,147,-147.0
2629,87,-87.0
2630,141,-141.0
2631,88,-88.0
2632,89,-89.0
2633,148,-148.0
2634,93,-93.0
2635,147,-147.0
2636,96,-96.0
2637,141,-141.0
2638,134,-134.0
2639,171,-171.0
2640,200,-200.0
2641,146,-146.0
2642,141,-141.0
2643,141,-141.0
2644,140,-140.0
2645,104,-104.0
2646,148,-148.0
2647,137,-137.0
2648,158,-158.0
2649,199,-199.0
2650,153,-153.0
2651,92,-92.0
2652,141,-141.0
2653,150,-150.0
2654,169,-169.0
2655,87,-87.0
2656,144,-144.0
2657,171,-171.0
2658,189,-189.0
2659,97,-97.0
2660,136,-136.0
2661,140,-140.0
2662,88,-88.0
2663,92,-92.0
2664,134,-134.0
2665,137,-137.0
2666,151,-151.0
2667,139,-139.0
2668,147,-147.0
2669,91,-91.0
2670,144,-144.0
2671,142,-142.0
2672,111,-111.0
2673,142,-142.0
2674,140,-140.0
2675,149,-149.0
2676,142,-142.0
2677,152,-152.0
2678,140,-140.0
2679,175,-175.0
2680,155,-155.0
2681,92,-92.0
2682,94,-94.0
2683,134,-134.0
2684,143,-143.0
2685,200,-200.0
2686,106,-106.0
2687,143,-143.0
2688,154,-154.0
2689,168,-168.0
2690,166,-166.0
2691,86,-86.0
2692,132,-132.0
2693,137,-137.0
2694,149,-149.0
2695,142,-142.0
2696,144,-144.0
2697,134,-134.0
2698,149,-149.0
2699,148,-148.0
2700,87,-87.0
2701,149,-149.0
2702,121,-121.0
2703,141,-141.0
2704,89,-89.0
2705,98,-98.0
2706,138,-138.0
2707,146,-146.0
2708,98,-98.0
2709,96,-96.0
2710,101,-101.0
2711,89,-89.0
2712,135,-135.0
2713,149,-149.0
2714,89,-89.0
2715,145,-145.0
2716,137,-137.0
2717,111,-111.0
2718,88,-88.0
2719,145,-145.0
2720,146,-146.0
2721,148,-148.0
2722,84,-84.0
2723,137,-137.0
2724,146,-146.0
2725,87,-87.0
2726,102,-102.0
2727,107,-107.0
2728,141,-141.0
2729,151,-151.0
2730,136,-136.0
2731,141,-141.0
2732,155,-155.0
2733,95,-95.0
2734,94,-94.0
2735,143,-143.0
2736,88,-88.0
2737,159,-159.0
2738,89,-89.0
2739,146,-146.0
2740,138,-138.0
2741,86,-86.0
2742,146,-146.0
2743,152,-152.0
2744,150,-150.0
2745,96,-96.0
2746,154,-154.0
2747,86,-86.0
2748,105,-105.0
2749,166,-166.0
2750,149,-149.0
2751,129,-129.0
2752,112,-112.0
2753,188,-188.0
2754,139,-139.0
2755,109,-109.0
2756,86,-86.0
2757,159,-159.0
2758,90,-90.0
2759,150,-150.0
2760,146,-146.0
2761,85,-85.0
2762,140,-140.0
2763,101,-101.0
2764,148,-148.0
2765,85,-85.0
2766,152,-152.0
2767,147,-147.0
2768,149,-149.0
2769,173,-173.0
2770,171,-171.0
2771,96,-96.0
2772,92,-92.0
2773,101,-101.0
2774,86,-86.0
2775,185,-185.0
2776,90,-90.0
2777,87,-87.0
2778,147,-147.0
2779,187,-187.0
2780,144,-144.0
2781,149,-149.0
2782,85,-85.0
2783,88,-88.0
2784,176,-176.0
2785,166,-166.0
2786,148,-148.0
2787,152,-152.0
2788,163,-163.0
2789,172,-172.0
2790,117,-117.0
2791,155,-155.0
2792,97,-97.0
2793,88,-88.0
2794,90,-90.0
2795,153,-153.0
2796,158,-158.0
2797,149,-149.0
2798,95,-95.0
2799,157,-157.0
2800,150,-150.0
2801,159,-159.0
2802,156,-156.0
2803,169,-169.0
2804,171,-171.0
2805,200,-200.0
2806,181,-181.0
2807,151,-151.0
2808,104,-104.0
2809,151,-151.0
2810,200,-200.0
2811,87,-87.0
2812,174,-174.0
2813,149,-149.0
2814,154,-154.0
2815,90,-90.0
2816,154,-154.0
2817,150,-150.0
2818,149,-149.0
2819,200,-200.0
2820,150,-150.0
2821,144,-144.0
2822,153,-153.0
2823,200,-200.0
2824,152,-152.0
2825,88,-88.0
2826,85,-85.0
2827,166,-166.0
2828,152,-152.0
2829,99,-99.0
2830,86,-86.0
2831,149,-149.0
2832,159,-159.0
2833,151,-151.0
2834,151,-151.0
2835,158,-158.0
2836,100,-100.0
2837,147,-147.0
2838,149,-149.0
2839,154,-154.0
2840,150,-150.0
2841,163,-163.0
2842,145,-145.0
2843,148,-148.0
2844,161,-161.0
2845,111,-111.0
2846,96,-96.0
2847,153,-153.0
2848,153,-153.0
2849,152,-152.0
2850,87,-87.0
2851,101,-101.0
2852,158,-158.0
2853,106,-106.0
2854,200,-200.0
2855,87,-87.0
2856,160,-160.0
2857,148,-148.0
2858,104,-104.0
2859,200,-200.0
2860,108,-108.0
2861,200,-200.0
2862,200,-200.0
2863,147,-147.0
2864,155,-155.0
2865,97,-97.0
2866,117,-117.0
2867,99,-99.0
2868,200,-200.0
2869,148,-148.0
2870,155,-155.0
2871,96,-96.0
2872,192,-192.0
2873,152,-152.0
2874,179,-179.0
2875,156,-156.0
2876,149,-149.0
2877,200,-200.0
2878,89,-89.0
2879,172,-172.0
2880,91,-91.0
2881,200,-200.0
2882,200,-200.0
2883,200,-200.0
2884,200,-200.0
2885,147,-147.0
2886,150,-150.0
2887,200,-200.0
2888,153,-153.0
2889,110,-110.0
2890,142,-142.0
2891,148,-148.0
2892,144,-144.0
2893,143,-143.0
2894,162,-162.0
2895,154,-154.0
2896,171,-171.0
2897,149,-149.0
2898,114,-114.0
2899,89,-89.0
2900,161,-161.0
2901,157,-157.0
2902,89,-89.0
2903,144,-144.0
2904,159,-159.0
2905,154,-154.0
2906,155,-155.0
2907,92,-92.0
2908,150,-150.0
2909,84,-84.0
2910,145,-145.0
2911,151,-151.0
2912,161,-161.0
2913,146,-146.0
2914,142,-142.0
2915,147,-147.0
2916,145,-145.0
2917,148,-148.0
2918,148,-148.0
2919,151,-151.0
2920,144,-144.0
2921,150,-150.0
2922,145,-145.0
2923,200,-200.0
2924,181,-181.0
2925,89,-89.0
2926,200,-200.0
2927,103,-103.0
2928,148,-148.0
2929,153,-153.0
2930,119,-119.0
2931,151,-151.0
2932,151,-151.0
2933,168,-168.0
2934,144,-144.0
2935,200,-200.0
2936,164,-164.0
2937,153,-153.0
2938,149,-149.0
2939,153,-153.0
2940,200,-200.0
2941,164,-164.0
2942,85,-85.0
2943,200,-200.0
2944,159,-159.0
2945,113,-113.0
2946,188,-188.0
2947,166,-166.0
2948,97,-97.0
2949,151,-151.0
2950,200,-200.0
2951,200,-200.0
2952,92,-92.0
2953,164,-164.0
2954,161,-161.0
2955,155,-155.0
2956,89,-89.0
2957,109,-109.0
2958,87,-87.0
2959,92,-92.0
2960,159,-159.0
2961,200,-200.0
2962,200,-200.0
2963,200,-200.0
2964,158,-158.0
2965,96,-96.0
2966,200,-200.0
2967,148,-148.0
2968,88,-88.0
2969,109,-109.0
2970,114,-114.0
2971,200,-200.0
2972,200,-200.0
2973,101,-101.0
2974,200,-200.0
2975,92,-92.0
2976,94,-94.0
2977,107,-107.0
2978,200,-200.0
2979,158,-158.0
2980,155,-155.0
2981,152,-152.0
2982,153,-153.0
2983,91,-91.0
2984,200,-200.0
2985,200,-200.0
2986,179,-179.0
2987,156,-156.0
2988,200,-200.0
2989,93,-93.0
2990,200,-200.0
2991,200,-200.0
2992,200,-200.0
2993,106,-106.0
2994,160,-160.0
2995,154,-154.0
2996,150,-150.0
2997,135,-135.0
2998,93,-93.0
2999,200,-200.0
3000,145,-145.0
3001,86,-86.0
3002,200,-200.0
3003,88,-88.0
3004,146,-146.0
3005,200,-200.0
3006,97,-97.0
3007,154,-154.0
3008,144,-144.0
3009,112,-112.0
3010,156,-156.0
3011,90,-90.0
3012,144,-144.0
3013,148,-148.0
3014,200,-200.0
3015,164,-164.0
3016,138,-138.0
3017,155,-155.0
3018,165,-165.0
3019,159,-159.0
3020,85,-85.0
3021,158,-158.0
3022,143,-143.0
3023,154,-154.0
3024,200,-200.0
3025,133,-133.0
3026,103,-103.0
3027,155,-155.0
3028,200,-200.0
3029,149,-149.0
3030,87,-87.0
3031,117,-117.0
3032,151,-151.0
3033,163,-163.0
3034,200,-200.0
3035,87,-87.0
3036,200,-200.0
3037,161,-161.0
3038,161,-161.0
3039,154,-154.0
3040,141,-141.0
3041,86,-86.0
3042,153,-153.0
3043,152,-152.0
3044,200,-200.0
3045,90,-90.0
3046,85,-85.0
3047,157,-157.0
3048,162,-162.0
3049,160,-160.0
3050,200,-200.0
3051,155,-155.0
3052,161,-161.0
3053,101,-101.0
3054,184,-184.0
3055,84,-84.0
3056,153,-153.0
3057,167,-167.0
3058,154,-154.0
3059,151,-151.0
3060,104,-104.0
3061,159,-159.0
3062,164,-164.0
3063,180,-180.0
3064,200,-200.0
3065,147,-147.0
3066,164,-164.0
3067,200,-200.0
3068,95,-95.0
3069,151,-151.0
3070,160,-160.0
3071,155,-155.0
3072,149,-149.0
3073,161,-161.0
3074,155,-155.0
3075,98,-98.0
3076,160,-160.0
3077,200,-200.0
3078,177,-177.0
3079,155,-155.0
3080,152,-152.0
3081,160,-160.0
3082,155,-155.0
3083,93,-93.0
3084,169,-169.0
3085,87,-87.0
3086,98,-98.0
3087,200,-200.0
3088,155,-155.0
3089,155,-155.0
3090,200,-200.0
3091,200,-200.0
3092,101,-101.0
3093,153,-153.0
3094,104,-104.0
3095,150,-150.0
3096,160,-160.0
3097,94,-94.0
3098,178,-178.0
3099,147,-147.0
3100,149,-149.0
3101,149,-149.0
3102,200,-200.0
3103,152,-152.0
3104,168,-168.0
3105,153,-153.0
3106,149,-149.0
3107,149,-149.0
3108,161,-161.0
3109,94,-94.0
3110,154,-154.0
3111,151,-151.0
3112,145,-145.0
3113,86,-86.0
3114,164,-164.0
3115,176,-176.0
3116,165,-165.0
3117,151,-151.0
3118,151,-151.0
3119,147,-147.0
3120,166,-166.0
3121,148,-148.0
3122,170,-170.0
3123,200,-200.0
3124,149,-149.0
3125,171,-171.0
3126,148,-148.0
3127,153,-153.0
3128,166,-166.0
3129,105,-105.0
3130,159,-159.0
3131,99,-99.0
3132,145,-145.0
3133,177,-177.0
3134,157,-157.0
3135,150,-150.0
3136,175,-175.0
3137,162,-162.0
3138,163,-163.0
3139,146,-146.0
3140,162,-162.0
3141,148,-148.0
3142,153,-153.0
3143,149,-149.0
3144,159,-159.0
3145,159,-159.0
3146,95,-95.0
3147,97,-97.0
3148,158,-158.0
3149,167,-167.0
3150,147,-147.0
3151,156,-156.0
3152,164,-164.0
3153,154,-154.0
3154,142,-142.0
3155,148,-148.0
3156,154,-154.0
3157,200,-200.0
3158,152,-152.0
3159,152,-152.0
3160,192,-192.0
3161,167,-167.0
3162,148,-148.0
3163,101,-101.0
3164,97,-97.0
3165,103,-103.0
3166,150,-150.0
3167,163,-163.0
3168,157,-157.0
3169,162,-162.0
3170,166,-166.0
3171,168,-168.0
3172,164,-164.0
3173,184,-184.0
3174,148,-148.0
3175,151,-151.0
3176,110,-110.0
3177,158,-158.0
3178,157,-157.0
3179,159,-159.0
3180,168,-168.0
3181,153,-153.0
3182,162,-162.0
3183,157,-157.0
3184,97,-97.0
3185,155,-155.0
3186,154,-154.0
3187,128,-128.0
3188,148,-148.0
3189,152,-152.0
3190,173,-173.0
3191,148,-148.0
3192,90,-90.0
3193,167,-167.0
3194,154,-154.0
3195,100,-100.0
3196,149,-149.0
3197,200,-200.0
3198,164,-164.0
3199,179,-179.0
3200,152,-152.0
3201,145,-145.0
3202,86,-86.0
3203,200,-200.0
3204,85,-85.0
3205,158,-158.0
3206,115,-115.0
3207,83,-83.0
3208,98,-98.0
3209,153,-153.0
3210,154,-154.0
3211,86,-86.0
3212,176,-176.0
3213,153,-153.0
3214,85,-85.0
3215,87,-87.0
3216,151,-151.0
3217,153,-153.0
3218,163,-163.0
3219,152,-152.0
3220,154,-154.0
3221,174,-174.0
3222,165,-165.0
3223,149,-149.0
3224,159,-159.0
3225,150,-150.0
3226,108,-108.0
3227,117,-117.0
3228,89,-89.0
3229,158,-158.0
3230,146,-146.0
3231,145,-145.0
3232,146,-146.0
3233,147,-147.0
3234,115,-115.0
3235,164,-164.0
3236,96,-96.0
3237,93,-93.0
3238,95,-95.0
3239,105,-105.0
3240,108,-108.0
3241,111,-111.0
3242,155,-155.0
3243,94,-94.0
3244,182,-182.0
3245,166,-166.0
3246,105,-105.0
3247,90,-90.0
3248,154,-154.0
3249,150,-150.0
3250,109,-109.0
3251,87,-87.0
3252,171,-171.0
3253,146,-146.0
3254,160,-160.0
3255,161,-161.0
3256,179,-179.0
3257,153,-153.0
3258,146,-146.0
3259,96,-96.0
3260,92,-92.0
3261,140,-140.0
3262,146,-146.0
3263,150,-150.0
3264,88,-88.0
3265,155,-155.0
3266,157,-157.0
3267,151,-151.0
3268,157,-157.0
3269,84,-84.0
3270,98,-98.0
3271,148,-148.0
3272,86,-86.0
3273,166,-166.0
3274,106,-106.0
3275,136,-136.0
3276,87,-87.0
3277,86,-86.0
3278,93,-93.0
3279,155,-155.0
3280,140,-140.0
3281,144,-144.0
3282,95,-95.0
3283,140,-140.0
3284,139,-139.0
3285,151,-151.0
3286,159,-159.0
3287,96,-96.0
3288,142,-142.0
3289,146,-146.0
3290,151,-151.0
3291,85,-85.0
3292,154,-154.0
3293,151,-151.0
3294,148,-148.0
3295,113,-113.0
3296,154,-154.0
3297,145,-145.0
3298,146,-146.0
3299,145,-145.0
3300,132,-132.0
3301,137,-137.0
3302,155,-155.0
3303,159,-159.0
3304,147,-147.0
3305,141,-141.0
3306,141,-141.0
3307,92,-92.0
3308,104,-104.0
3309,171,-171.0
3310,87,-87.0
3311,157,-157.0
3312,145,-145.0
3313,146,-146.0
3314,141,-141.0
3315,138,-138.0
3316,146,-146.0
3317,145,-145.0
3318,144,-144.0
3319,161,-161.0
3320,170,-170.0
3321,87,-87.0
3322,156,-156.0
3323,139,-139.0
3324,149,-149.0
3325,107,-107.0
3326,149,-149.0
3327,85,-85.0
3328,142,-142.0
3329,145,-145.0
3330,87,-87.0
3331,84,-84.0
3332,147,-147.0
3333,107,-107.0
3334,161,-161.0
3335,143,-143.0
3336,148,-148.0
3337,144,-144.0
3338,95,-95.0
3339,84,-84.0
3340,144,-144.0
3341,94,-94.0
3342,141,-141.0
3343,90,-90.0
3344,200,-200.0
3345,90,-90.0
3346,200,-200.0
3347,141,-141.0
3348,90,-90.0
3349,92,-92.0
3350,92,-92.0
3351,154,-154.0
3352,100,-100.0
3353,161,-161.0
3354,200,-200.0
3355,143,-143.0
3356,142,-142.0
3357,155,-155.0
3358,200,-200.0
3359,145,-145.0
3360,143,-143.0
3361,138,-138.0
3362,163,-163.0
3363,172,-172.0
3364,121,-121.0
3365,101,-101.0
3366,138,-138.0
3367,106,-106.0
3368,105,-105.0
3369,139,-139.0
3370,146,-146.0
3371,149,-149.0
3372,164,-164.0
3373,88,-88.0
3374,164,-164.0
3375,110,-110.0
3376,142,-142.0
3377,86,-86.0
3378,101,-101.0
3379,105,-105.0
3380,109,-109.0
3381,91,-91.0
3382,200,-200.0
3383,200,-200.0
3384,109,-109.0
3385,91,-91.0
3386,108,-108.0
3387,114,-114.0
3388,148,-148.0
3389,130,-130.0
3390,151,-151.0
3391,188,-188.0
3392,148,-148.0
3393,135,-135.0
3394,136,-136.0
3395,108,-108.0
3396,181,-181.0
3397,151,-151.0
3398,131,-131.0
3399,141,-141.0
3400,91,-91.0
3401,141,-141.0
3402,155,-155.0
3403,167,-167.0
3404,143,-143.0
3405,92,-92.0
3406,107,-107.0
3407,115,-115.0
3408,89,-89.0
3409,160,-160.0
3410,141,-141.0
3411,156,-156.0
3412,152,-152.0
3413,141,-141.0
3414,88,-88.0
3415,95,-95.0
3416,115,-115.0
3417,177,-177.0
3418,124,-124.0
3419,107,-107.0
3420,140,-140.0
3421,147,-147.0
3422,163,-163.0
3423,166,-166.0
3424,152,-152.0
3425,192,-192.0
3426,157,-157.0
3427,114,-114.0
3428,145,-145.0
3429,138,-138.0
3430,153,-153.0
3431,87,-87.0
3432,88,-88.0
3433,200,-200.0
3434,97,-97.0
3435,85,-85.0
3436,168,-168.0
3437,140,-140.0
3438,162,-162.0
3439,148,-148.0
3440,167,-167.0
3441,137,-137.0
3442,104,-104.0
3443,158,-158.0
3444,146,-146.0
3445,164,-164.0
3446,147,-147.0
3447,154,-154.0
3448,200,-200.0
3449,87,-87.0
3450,149,-149.0
3451,85,-85.0
3452,149,-149.0
3453,109,-109.0
3454,118,-118.0
3455,102,-102.0
3456,174,-174.0
3457,155,-155.0
3458,160,-160.0
3459,171,-171.0
3460,171,-171.0
3461,160,-160.0
3462,109,-109.0
3463,157,-157.0
3464,155,-155.0
3465,92,-92.0
3466,147,-147.0
3467,172,-172.0
3468,200,-200.0
3469,85,-85.0
3470,91,-91.0
3471,89,-89.0
3472,169,-169.0
3473,110,-110.0
3474,170,-170.0
3475,156,-156.0
3476,87,-87.0
3477,91,-91.0
3478,96,-96.0
3479,169,-169.0
3480,94,-94.0
3481,155,-155.0
3482,96,-96.0
3483,90,-90.0
3484,97,-97.0
3485,164,-164.0
3486,142,-142.0
3487,143,-143.0
3488,161,-161.0
3489,102,-102.0
3490,142,-142.0
3491,90,-90.0
3492,105,-105.0
3493,161,-161.0
3494,149,-149.0
3495,163,-163.0
3496,93,-93.0
3497,84,-84.0
3498,142,-142.0
3499,148,-148.0
3500,141,-141.0
3501,117,-117.0
3502,97,-97.0
3503,158,-158.0
3504,147,-147.0
3505,189,-189.0
3506,149,-149.0
3507,200,-200.0
3508,152,-152.0
3509,200,-200.0
3510,153,-153.0
3511,155,-155.0
3512,179,-179.0
3513,155,-155.0
3514,145,-145.0
3515,148,-148.0
3516,150,-150.0
3517,152,-152.0
3518,151,-151.0
3519,187,-187.0
3520,86,-86.0
3521,178,-178.0
3522,158,-158.0
3523,182,-182.0
3524,200,-200.0
3525,93,-93.0
3526,155,-155.0
3527,161,-161.0
3528,200,-200.0
3529,171,-171.0
3530,144,-144.0
3531,153,-153.0
3532,200,-200.0
3533,163,-163.0
3534,88,-88.0
3535,163,-163.0
3536,158,-158.0
3537,147,-147.0
3538,89,-89.0
3539,91,-91.0
3540,200,-200.0
3541,84,-84.0
3542,145,-145.0
3543,144,-144.0
3544,157,-157.0
3545,86,-86.0
3546,140,-140.0
3547,160,-160.0
3548,149,-149.0
3549,147,-147.0
3550,200,-200.0
3551,163,-163.0
3552,167,-167.0
3553,170,-170.0
3554,155,-155.0
3555,155,-155.0
3556,200,-200.0
3557,155,-155.0
3558,92,-92.0
3559,200,-200.0
3560,150,-150.0
3561,171,-171.0
3562,161,-161.0
3563,154,-154.0
3564,144,-144.0
3565,200,-200.0
3566,200,-200.0
3567,133,-133.0
3568,200,-200.0
3569,145,-145.0
3570,200,-200.0
3571,200,-200.0
3572,93,-93.0
3573,158,-158.0
3574,155,-155.0
3575,139,-139.0
3576,153,-153.0
3577,164,-164.0
3578,138,-138.0
3579,138,-138.0
3580,143,-143.0
3581,164,-164.0
3582,157,-157.0
3583,160,-160.0
3584,134,-134.0
3585,154,-154.0
3586,200,-200.0
3587,86,-86.0
3588,142,-142.0
3589,200,-200.0
3590,200,-200.0
3591,149,-149.0
3592,111,-111.0
3593,200,-200.0
3594,167,-167.0
3595,104,-104.0
3596,152,-152.0
3597,166,-166.0
3598,153,-153.0
3599,151,-151.0
3600,145,-145.0
3601,85,-85.0
3602,149,-149.0
3603,119,-119.0
3604,175,-175.0
3605,161,-161.0
3606,116,-116.0
3607,173,-173.0
3608,102,-102.0
3609,156,-156.0
3610,148,-148.0
3611,176,-176.0
3612,160,-160.0
3613,106,-106.0
3614,164,-164.0
3615,157,-157.0
3616,160,-160.0
3617,200,-200.0
3618,169,-169.0
3619,100,-100.0
3620,150,-150.0
3621,180,-180.0
3622,160,-160.0
3623,174,-174.0
3624,178,-178.0
3625,148,-148.0
3626,156,-156.0
3627,105,-105.0
3628,148,-148.0
3629,145,-145.0
3630,156,-156.0
3631,159,-159.0
3632,149,-149.0
3633,156,-156.0
3634,160,-160.0
3635,92,-92.0
3636,150,-150.0
3637,151,-151.0
3638,200,-200.0
3639,155,-155.0
3640,153,-153.0
3641,150,-150.0
3642,150,-150.0
3643,142,-142.0
3644,200,-200.0
3645,167,-167.0
3646,200,-200.0
3647,115,-115.0
3648,144,-144.0
3649,177,-177.0
3650,153,-153.0
3651,148,-148.0
3652,147,-147.0
3653,156,-156.0
3654,149,-149.0
3655,101,-101.0
3656,157,-157.0
3657,171,-171.0
3658,146,-146.0
3659,148,-148.0
3660,152,-152.0
3661,182,-182.0
3662,147,-147.0
3663,154,-154.0
3664,151,-151.0
3665,146,-146.0
3666,100,-100.0
3667,159,-159.0
3668,148,-148.0
3669,200,-200.0
3670,104,-104.0
3671,153,-153.0
3672,150,-150.0
3673,171,-171.0
3674,155,-155.0
3675,97,-97.0
3676,157,-157.0
3677,147,-147.0
3678,168,-168.0
3679,152,-152.0
3680,153,-153.0
3681,152,-152.0
3682,151,-151.0
3683,154,-154.0
3684,148,-148.0
3685,200,-200.0
3686,155,-155.0
3687,150,-150.0
3688,147,-147.0
3689,113,-113.0
3690,151,-151.0
3691,161,-161.0
3692,159,-159.0
3693,161,-161.0
3694,151,-151.0
3695,151,-151.0
3696,177,-177.0
3697,156,-156.0
3698,146,-146.0
3699,152,-152.0
3700,147,-147.0
3701,185,-185.0
3702,156,-156.0
3703,151,-151.0
3704,155,-155.0
3705,151,-151.0
3706,155,-155.0
3707,149,-149.0
3708,145,-145.0
3709,151,-151.0
3710,155,-155.0
3711,158,-158.0
3712,151,-151.0
3713,150,-150.0
3714,150,-150.0
3715,150,-150.0
3716,160,-160.0
3717,200,-200.0
3718,154,-154.0
3719,105,-105.0
3720,148,-148.0
3721,145,-145.0
3722,149,-149.0
3723,151,-151.0
3724,149,-149.0
3725,99,-99.0
3726,148,-148.0
3727,161,-161.0
3728,154,-154.0
3729,146,-146.0
3730,101,-101.0
3731,94,-94.0
3732,153,-153.0
3733,145,-145.0
3734,163,-163.0
3735,156,-156.0
3736,147,-147.0
3737,148,-148.0
3738,193,-193.0
3739,144,-144.0
3740,105,-105.0
3741,149,-149.0
3742,145,-145.0
3743,154,-154.0
3744,163,-163.0
3745,101,-101.0
3746,144,-144.0
3747,150,-150.0
3748,147,-147.0
3749,148,-148.0
3750,96,-96.0
3751,166,-166.0
3752,150,-150.0
3753,152,-152.0
3754,166,-166.0
3755,144,-144.0
3756,151,-151.0
3757,156,-156.0
3758,151,-151.0
3759,150,-150.0
3760,149,-149.0
3761,143,-143.0
3762,152,-152.0
3763,161,-161.0
3764,150,-150.0
3765,191,-191.0
3766,200,-200.0
3767,144,-144.0
3768,146,-146.0
3769,188,-188.0
3770,89,-89.0
3771,94,-94.0
3772,148,-148.0
3773,145,-145.0
3774,112,-112.0
3775,152,-152.0
3776,163,-163.0
3777,100,-100.0
3778,148,-148.0
3779,147,-147.0
3780,93,-93.0
3781,89,-89.0
3782,150,-150.0
3783,98,-98.0
3784,174,-174.0
3785,200,-200.0
3786,157,-157.0
3787,158,-158.0
3788,153,-153.0
3789,149,-149.0
3790,86,-86.0
3791,153,-153.0
3792,90,-90.0
3793,151,-151.0
3794,164,-164.0
3795,145,-145.0
3796,179,-179.0
3797,150,-150.0
3798,155,-155.0
3799,152,-152.0
3800,162,-162.0
3801,157,-157.0
3802,166,-166.0
3803,156,-156.0
3804,190,-190.0
3805,167,-167.0
3806,150,-150.0
3807,100,-100.0
3808,155,-155.0
3809,91,-91.0
3810,148,-148.0
3811,160,-160.0
3812,104,-104.0
3813,163,-163.0
3814,93,-93.0
3815,147,-147.0
3816,170,-170.0
3817,200,-200.0
3818,148,-148.0
3819,155,-155.0
3820,200,-200.0
3821,166,-166.0
3822,154,-154.0
3823,159,-159.0
3824,119,-119.0
3825,148,-148.0
3826,147,-147.0
3827,159,-159.0
3828,158,-158.0
3829,147,-147.0
3830,152,-152.0
3831,158,-158.0
3832,111,-111.0
3833,151,-151.0
3834,159,-159.0
3835,162,-162.0
3836,147,-147.0
3837,160,-160.0
3838,152,-152.0
3839,154,-154.0
3840,149,-149.0
3841,90,-90.0
3842,152,-152.0
3843,158,-158.0
3844,145,-145.0
3845,150,-150.0
3846,160,-160.0
3847,150,-150.0
3848,156,-156.0
3849,102,-102.0
3850,91,-91.0
3851,104,-104.0
3852,160,-160.0
3853,99,-99.0
3854,147,-147.0
3855,172,-172.0
3856,180,-180.0
3857,95,-95.0
3858,174,-174.0
3859,169,-169.0
3860,159,-159.0
3861,155,-155.0
3862,200,-200.0
3863,87,-87.0
3864,150,-150.0
3865,200,-200.0
3866,155,-155.0
3867,165,-165.0
3868,186,-186.0
3869,156,-156.0
3870,149,-149.0
3871,90,-90.0
3872,157,-157.0
3873,154,-154.0
3874,159,-159.0
3875,152,-152.0
3876,199,-199.0
3877,147,-147.0
3878,200,-200.0
3879,163,-163.0
3880,86,-86.0
3881,155,-155.0
3882,89,-89.0
3883,152,-152.0
3884,155,-155.0
3885,87,-87.0
3886,89,-89.0
3887,152,-152.0
3888,148,-148.0
3889,153,-153.0
3890,151,-151.0
3891,155,-155.0
3892,91,-91.0
3893,94,-94.0
3894,200,-200.0
3895,150,-150.0
3896,158,-158.0
3897,165,-165.0
3898,88,-88.0
3899,173,-173.0
3900,162,-162.0
3901,146,-146.0
3902,152,-152.0
3903,160,-160.0
3904,85,-85.0
3905,89,-89.0
3906,147,-147.0
3907,200,-200.0
3908,155,-155.0
3909,149,-149.0
3910,200,-200.0
3911,150,-150.0
3912,200,-200.0
3913,157,-157.0
3914,162,-162.0
3915,159,-159.0
3916,200,-200.0
3917,160,-160.0
3918,105,-105.0
3919,200,-200.0
3920,93,-93.0
3921,200,-200.0
3922,200,-200.0
3923,183,-183.0
3924,123,-123.0
3925,136,-136.0
3926,154,-154.0
3927,87,-87.0
3928,163,-163.0
3929,95,-95.0
3930,158,-158.0
3931,94,-94.0
3932,165,-165.0
3933,89,-89.0
3934,97,-97.0
3935,101,-101.0
3936,200,-200.0
3937,85,-85.0
3938,200,-200.0
3939,200,-200.0
3940,148,-148.0
3941,147,-147.0
3942,92,-92.0
3943,96,-96.0
3944,162,-162.0
3945,165,-165.0
3946,87,-87.0
3947,200,-200.0
3948,200,-200.0
3949,87,-87.0
3950,88,-88.0
3951,150,-150.0
3952,91,-91.0
3953,200,-200.0
3954,200,-200.0
3955,200,-200.0
3956,116,-116.0
3957,90,-90.0
3958,176,-176.0
3959,85,-85.0
3960,152,-152.0
3961,85,-85.0
3962,150,-150.0
3963,162,-162.0
3964,100,-100.0
3965,160,-160.0
3966,158,-158.0
3967,150,-150.0
3968,154,-154.0
3969,85,-85.0
3970,151,-151.0
3971,200,-200.0
3972,95,-95.0
3973,113,-113.0
3974,97,-97.0
3975,86,-86.0
3976,95,-95.0
3977,90,-90.0
3978,89,-89.0
3979,94,-94.0
3980,114,-114.0
3981,96,-96.0
3982,200,-200.0
3983,86,-86.0
3984,85,-85.0
3985,143,-143.0
3986,94,-94.0
3987,177,-177.0
3988,159,-159.0
3989,200,-200.0
3990,158,-158.0
3991,153,-153.0
3992,170,-170.0
3993,159,-159.0
3994,92,-92.0
3995,156,-156.0
3996,200,-200.0
3997,150,-150.0
3998,162,-162.0
3999,166,-166.0
4000,158,-158.0
4001,191,-191.0
4002,200,-200.0
4003,200,-200.0
4004,200,-200.0
4005,164,-164.0
4006,200,-200.0
4007,200,-200.0
4008,93,-93.0
4009,200,-200.0
4010,97,-97.0
4011,93,-93.0
4012,87,-87.0
4013,200,-200.0
4014,100,-100.0
4015,162,-162.0
4016,104,-104.0
4017,158,-158.0
4018,190,-190.0
4019,98,-98.0
4020,159,-159.0
4021,125,-125.0
4022,159,-159.0
4023,171,-171.0
4024,178,-178.0
4025,169,-169.0
4026,200,-200.0
4027,200,-200.0
4028,158,-158.0
4029,162,-162.0
4030,95,-95.0
4031,185,-185.0
4032,200,-200.0
4033,180,-180.0
4034,200,-200.0
4035,99,-99.0
4036,200,-200.0
4037,200,-200.0
4038,200,-200.0
4039,165,-165.0
4040,189,-189.0
4041,158,-158.0
4042,191,-191.0
4043,161,-161.0
4044,156,-156.0
4045,91,-91.0
4046,175,-175.0
4047,178,-178.0
4048,200,-200.0
4049,160,-160.0
4050,188,-188.0
4051,183,-183.0
4052,123,-123.0
4053,200,-200.0
4054,200,-200.0
4055,123,-123.0
4056,104,-104.0
4057,191,-191.0
4058,175,-175.0
4059,86,-86.0
4060,167,-167.0
4061,170,-170.0
4062,150,-150.0
4063,200,-200.0
4064,167,-167.0
4065,170,-170.0
4066,189,-189.0
4067,162,-162.0
4068,200,-200.0
4069,128,-128.0
4070,132,-132.0
4071,175,-175.0
4072,171,-171.0
4073,200,-200.0
4074,160,-160.0
4075,161,-161.0
4076,166,-166.0
4077,93,-93.0
4078,186,-186.0
4079,183,-183.0
4080,87,-87.0
4081,92,-92.0
4082,200,-200.0
4083,89,-89.0
4084,95,-95.0
4085,166,-166.0
4086,170,-170.0
4087,159,-159.0
4088,113,-113.0
4089,191,-191.0
4090,106,-106.0
4091,198,-198.0
4092,184,-184.0
4093,156,-156.0
4094,89,-89.0
4095,181,-181.0
4096,162,-162.0
4097,200,-200.0
4098,155,-155.0
4099,117,-117.0
4100,173,-173.0
4101,200,-200.0
4102,161,-161.0
4103,159,-159.0
4104,175,-175.0
4105,183,-183.0
4106,186,-186.0
4107,200,-200.0
4108,200,-200.0
4109,200,-200.0
4110,177,-177.0
4111,200,-200.0
4112,200,-200.0
4113,200,-200.0
4114,200,-200.0
4115,200,-200.0
4116,200,-200.0
4117,200,-200.0
4118,200,-200.0
4119,200,-200.0
4120,187,-187.0
4121,114,-114.0
4122,170,-170.0
4123,160,-160.0
4124,149,-149.0
4125,185,-185.0
4126,163,-163.0
4127,151,-151.0
4128,164,-164.0
4129,168,-168.0
4130,200,-200.0
4131,195,-195.0
4132,162,-162.0
4133,200,-200.0
4134,175,-175.0
4135,200,-200.0
4136,200,-200.0
4137,200,-200.0
4138,200,-200.0
4139,200,-200.0
4140,200,-200.0
4141,200,-200.0
4142,200,-200.0
4143,200,-200.0
4144,200,-200.0
4145,200,-200.0
4146,200,-200.0
4147,200,-200.0
4148,200,-200.0
4149,200,-200.0
4150,200,-200.0
4151,200,-200.0
4152,200,-200.0
4153,162,-162.0
4154,200,-200.0
4155,200,-200.0
4156,104,-104.0
4157,121,-121.0
4158,146,-146.0
4159,178,-178.0
4160,136,-136.0
4161,137,-137.0
4162,191,-191.0
4163,180,-180.0
4164,200,-200.0
4165,124,-124.0
4166,113,-113.0
4167,136,-136.0
4168,174,-174.0
4169,148,-148.0
4170,199,-199.0
4171,175,-175.0
4172,128,-128.0
4173,144,-144.0
4174,170,-170.0
4175,135,-135.0
4176,126,-126.0
4177,133,-133.0
4178,172,-172.0
4179,171,-171.0
4180,109,-109.0
4181,120,-120.0
4182,169,-169.0
4183,121,-121.0
4184,165,-165.0
4185,200,-200.0
4186,110,-110.0
4187,137,-137.0
4188,127,-127.0
4189,200,-200.0
4190,185,-185.0
4191,153,-153.0
4192,145,-145.0
4193,170,-170.0
4194,157,-157.0
4195,181,-181.0
4196,130,-130.0
4197,114,-114.0
4198,170,-170.0
4199,129,-129.0
4200,124,-124.0
4201,199,-199.0
4202,163,-163.0
4203,196,-196.0
4204,191,-191.0
4205,162,-162.0
4206,168,-168.0
4207,104,-104.0
4208,136,-136.0
4209,195,-195.0
4210,182,-182.0
4211,181,-181.0
4212,180,-180.0
4213,177,-177.0
4214,200,-200.0
4215,187,-187.0
4216,200,-200.0
4217,200,-200.0
4218,171,-171.0
4219,109,-109.0
4220,162,-162.0
4221,158,-158.0
4222,190,-190.0
4223,170,-170.0
4224,184,-184.0
4225,200,-200.0
4226,184,-184.0
4227,200,-200.0
4228,200,-200.0
4229,152,-152.0
4230,200,-200.0
4231,118,-118.0
4232,185,-185.0
4233,200,-200.0
4234,200,-200.0
4235,194,-194.0
4236,200,-200.0
4237,159,-159.0
4238,91,-91.0
4239,139,-139.0
4240,109,-109.0
4241,187,-187.0
4242,117,-117.0
4243,191,-191.0
4244,188,-188.0
4245,176,-176.0
4246,143,-143.0
4247,149,-149.0
4248,152,-152.0
4249,164,-164.0
4250,189,-189.0
4251,102,-102.0
4252,157,-157.0
4253,200,-200.0
4254,155,-155.0
4255,177,-177.0
4256,156,-156.0
4257,200,-200.0
4258,132,-132.0
4259,200,-200.0
4260,200,-200.0
4261,200,-200.0
4262,155,-155.0
4263,196,-196.0
4264,106,-106.0
4265,169,-169.0
4266,166,-166.0
4267,112,-112.0
4268,107,-107.0
4269,200,-200.0
4270,130,-130.0
4271,186,-186.0
4272,200,-200.0
4273,179,-179.0
4274,162,-162.0
4275,186,-186.0
4276,169,-169.0
4277,169,-169.0
4278,143,-143.0
4279,95,-95.0
4280,200,-200.0
4281,109,-109.0
4282,200,-200.0
4283,147,-147.0
4284,163,-163.0
4285,166,-166.0
4286,164,-164.0
4287,144,-144.0
4288,161,-161.0
4289,109,-109.0
4290,153,-153.0
4291,188,-188.0
4292,200,-200.0
4293,173,-173.0
4294,200,-200.0
4295,90,-90.0
4296,141,-141.0
4297,112,-112.0
4298,133,-133.0
4299,111,-111.0
4300,113,-113.0
4301,167,-167.0
4302,90,-90.0
4303,148,-148.0
4304,171,-171.0
4305,131,-131.0
4306,117,-117.0
4307,110,-110.0
4308,129,-129.0
4309,156,-156.0
4310,173,-173.0
4311,157,-157.0
4312,161,-161.0
4313,144,-144.0
4314,150,-150.0
4315,146,-146.0
4316,170,-170.0
4317,146,-146.0
4318,160,-160.0
4319,163,-163.0
4320,107,-107.0
4321,157,-157.0
4322,157,-157.0
4323,156,-156.0
4324,115,-115.0
4325,194,-194.0
4326,172,-172.0
4327,174,-174.0
4328,163,-163.0
4329,149,-149.0
4330,159,-159.0
4331,153,-153.0
4332,195,-195.0
4333,148,-148.0
4334,150,-150.0
4335,123,-123.0
4336,92,-92.0
4337,112,-112.0
4338,160,-160.0
4339,164,-164.0
4340,159,-159.0
4341,184,-184.0
4342,158,-158.0
4343,126,-126.0
4344,167,-167.0
4345,91,-91.0
4346,107,-107.0
4347,149,-149.0
4348,95,-95.0
4349,177,-177.0
4350,191,-191.0
4351,170,-170.0
4352,145,-145.0
4353,169,-169.0
4354,154,-154.0
4355,156,-156.0
4356,158,-158.0
4357,153,-153.0
4358,109,-109.0
4359,119,-119.0
4360,158,-158.0
4361,157,-157.0
4362,160,-160.0
4363,165,-165.0
4364,88,-88.0
4365,200,-200.0
4366,160,-160.0
4367,159,-159.0
4368,190,-190.0
4369,148,-148.0
4370,110,-110.0
4371,173,-173.0
4372,89,-89.0
4373,164,-164.0
4374,139,-139.0
4375,141,-141.0
4376,88,-88.0
4377,140,-140.0
4378,169,-169.0
4379,110,-110.0
4380,151,-151.0
4381,157,-157.0
4382,175,-175.0
4383,180,-180.0
4384,92,-92.0
4385,119,-119.0
4386,182,-182.0
4387,179,-179.0
4388,161,-161.0
4389,157,-157.0
4390,147,-147.0
4391,177,-177.0
4392,153,-153.0
4393,177,-177.0
4394,154,-154.0
4395,108,-108.0
4396,92,-92.0
4397,200,-200.0
4398,200,-200.0
4399,152,-152.0
4400,200,-200.0
4401,200,-200.0
4402,169,-169.0
4403,200,-200.0
4404,172,-172.0
4405,156,-156.0
4406,155,-155.0
4407,200,-200.0
4408,200,-200.0
4409,200,-200.0
4410,126,-126.0
4411,90,-90.0
4412,147,-147.0
4413,200,-200.0
4414,200,-200.0
4415,200,-200.0
4416,199,-199.0
4417,144,-144.0
4418,102,-102.0
4419,162,-162.0
4420,168,-168.0
4421,156,-156.0
4422,164,-164.0
4423,200,-200.0
4424,172,-172.0
4425,200,-200.0
4426,158,-158.0
4427,162,-162.0
4428,173,-173.0
4429,152,-152.0
4430,144,-144.0
4431,170,-170.0
4432,200,-200.0
4433,171,-171.0
4434,161,-161.0
4435,141,-141.0
4436,200,-200.0
4437,200,-200.0
4438,178,-178.0
4439,144,-144.0
4440,110,-110.0
4441,123,-123.0
4442,148,-148.0
4443,180,-180.0
4444,157,-157.0
4445,157,-157.0
4446,170,-170.0
4447,151,-151.0
4448,187,-187.0
4449,176,-176.0
4450,186,-186.0
4451,147,-147.0
4452,155,-155.0
4453,198,-198.0
4454,170,-170.0
4455,153,-153.0
4456,172,-172.0
4457,200,-200.0
4458,189,-189.0
4459,200,-200.0
4460,178,-178.0
4461,169,-169.0
4462,200,-200.0
4463,153,-153.0
4464,168,-168.0
4465,171,-171.0
4466,149,-149.0
4467,158,-158.0
4468,158,-158.0
4469,101,-101.0
4470,165,-165.0
4471,151,-151.0
4472,200,-200.0
4473,168,-168.0
4474,139,-139.0
4475,165,-165.0
4476,149,-149.0
4477,90,-90.0
4478,155,-155.0
4479,103,-103.0
4480,138,-138.0
4481,168,-168.0
4482,200,-200.0
4483,174,-174.0
4484,146,-146.0
4485,198,-198.0
4486,170,-170.0
4487,164,-164.0
4488,198,-198.0
4489,146,-146.0
4490,165,-165.0
4491,169,-169.0
4492,95,-95.0
4493,159,-159.0
4494,184,-184.0
4495,111,-111.0
4496,179,-179.0
4497,166,-166.0
4498,170,-170.0
4499,148,-148.0
4500,144,-144.0
4501,149,-149.0
4502,173,-173.0
4503,144,-144.0
4504,146,-146.0
4505,137,-137.0
4506,178,-178.0
4507,128,-128.0
4508,124,-124.0
4509,91,-91.0
4510,135,-135.0
4511,143,-143.0
4512,167,-167.0
4513,168,-168.0
4514,132,-132.0
4515,162,-162.0
4516,173,-173.0
4517,140,-140.0
4518,175,-175.0
4519,143,-143.0
4520,163,-163.0
4521,143,-143.0
4522,92,-92.0
4523,94,-94.0
4524,128,-128.0
4525,112,-112.0
4526,139,-139.0
4527,147,-147.0
4528,86,-86.0
4529,125,-125.0
4530,167,-167.0
4531,138,-138.0
4532,162,-162.0
4533,162,-162.0
4534,157,-157.0
4535,135,-135.0
4536,159,-159.0
4537,157,-157.0
4538,143,-143.0
4539,94,-94.0
4540,147,-147.0
4541,101,-101.0
4542,96,-96.0
4543,93,-93.0
4544,176,-176.0
4545,156,-156.0
4546,139,-139.0
4547,154,-154.0
4548,164,-164.0
4549,92,-92.0
4550,89,-89.0
4551,166,-166.0
4552,84,-84.0
4553,170,-170.0
4554,191,-191.0
4555,90,-90.0
4556,200,-200.0
4557,150,-150.0
4558,96,-96.0
4559,171,-171.0
4560,97,-97.0
4561,94,-94.0
4562,86,-86.0
4563,163,-163.0
4564,200,-200.0
4565,114,-114.0
4566,162,-162.0
4567,200,-200.0
4568,190,-190.0
4569,190,-190.0
4570,90,-90.0
4571,98,-98.0
4572,130,-130.0
4573,156,-156.0
4574,157,-157.0
4575,163,-163.0
4576,93,-93.0
4577,155,-155.0
4578,136,-136.0
4579,100,-100.0
4580,112,-112.0
4581,88,-88.0
4582,149,-149.0
4583,185,-185.0
4584,167,-167.0
4585,180,-180.0
4586,123,-123.0
4587,102,-102.0
4588,162,-162.0
4589,153,-153.0
4590,122,-122.0
4591,164,-164.0
4592,98,-98.0
4593,88,-88.0
4594,162,-162.0
4595,200,-200.0
4596,86,-86.0
4597,86,-86.0
4598,98,-98.0
4599,183,-183.0
4600,179,-179.0
4601,149,-149.0
4602,156,-156.0
4603,169,-169.0
4604,168,-168.0
4605,145,-145.0
4606,136,-136.0
4607,152,-152.0
4608,150,-150.0
4609,149,-149.0
4610,176,-176.0
4611,136,-136.0
4612,151,-151.0
4613,149,-149.0
4614,145,-145.0
4615,146,-146.0
4616,150,-150.0
4617,158,-158.0
4618,146,-146.0
4619,165,-165.0
4620,175,-175.0
4621,146,-146.0
4622,159,-159.0
4623,183,-183.0
4624,146,-146.0
4625,142,-142.0
4626,152,-152.0
4627,146,-146.0
4628,148,-148.0
4629,166,-166.0
4630,174,-174.0
4631,139,-139.0
4632,165,-165.0
4633,157,-157.0
4634,89,-89.0
4635,107,-107.0
4636,139,-139.0
4637,150,-150.0
4638,148,-148.0
4639,99,-99.0
4640,154,-154.0
4641,96,-96.0
4642,142,-142.0
4643,148,-148.0
4644,144,-144.0
4645,159,-159.0
4646,163,-163.0
4647,163,-163.0
4648,146,-146.0
4649,144,-144.0
4650,113,-113.0
4651,132,-132.0
4652,110,-110.0
4653,182,-182.0
4654,112,-112.0
4655,113,-113.0
4656,141,-141.0
4657,155,-155.0
4658,152,-152.0
4659,142,-142.0
4660,138,-138.0
4661,189,-189.0
4662,167,-167.0
4663,155,-155.0
4664,193,-193.0
4665,116,-116.0
4666,173,-173.0
4667,191,-191.0
4668,153,-153.0
4669,149,-149.0
4670,168,-168.0
4671,200,-200.0
4672,156,-156.0
4673,114,-114.0
4674,103,-103.0
4675,161,-161.0
4676,200,-200.0
4677,157,-157.0
4678,89,-89.0
4679,161,-161.0
4680,159,-159.0
4681,159,-159.0
4682,144,-144.0
4683,152,-152.0
4684,147,-147.0
4685,148,-148.0
4686,94,-94.0
4687,163,-163.0
4688,183,-183.0
4689,90,-90.0
4690,142,-142.0
4691,162,-162.0
4692,200,-200.0
4693,145,-145.0
4694,88,-88.0
4695,146,-146.0
4696,173,-173.0
4697,92,-92.0
4698,162,-162.0
4699,89,-89.0
4700,94,-94.0
4701,162,-162.0
4702,156,-156.0
4703,184,-184.0
4704,173,-173.0
4705,167,-167.0
4706,144,-144.0
4707,161,-161.0
4708,89,-89.0
4709,156,-156.0
4710,161,-161.0
4711,89,-89.0
4712,150,-150.0
4713,147,-147.0
4714,144,-144.0
4715,163,-163.0
4716,150,-150.0
4717,87,-87.0
4718,172,-172.0
4719,158,-158.0
4720,107,-107.0
4721,152,-152.0
4722,200,-200.0
4723,150,-150.0
4724,159,-159.0
4725,105,-105.0
4726,161,-161.0
4727,160,-160.0
4728,158,-158.0
4729,174,-174.0
4730,159,-159.0
4731,92,-92.0
4732,183,-183.0
4733,92,-92.0
4734,156,-156.0
4735,200,-200.0
4736,200,-200.0
4737,174,-174.0
4738,153,-153.0
4739,94,-94.0
4740,146,-146.0
4741,150,-150.0
4742,154,-154.0
4743,155,-155.0
4744,157,-157.0
4745,148,-148.0
4746,146,-146.0
4747,95,-95.0
4748,150,-150.0
4749,156,-156.0
4750,170,-170.0
