episodes,steps,rewards
0,200,-200.0
1,200,-200.0
2,200,-200.0
3,200,-200.0
4,200,-200.0
5,200,-200.0
6,200,-200.0
7,200,-200.0
8,200,-200.0
9,200,-200.0
10,200,-200.0
11,185,-185.0
12,200,-200.0
13,200,-200.0
14,200,-200.0
15,200,-200.0
16,200,-200.0
17,200,-200.0
18,200,-200.0
19,200,-200.0
20,200,-200.0
21,200,-200.0
22,200,-200.0
23,200,-200.0
24,200,-200.0
25,200,-200.0
26,200,-200.0
27,200,-200.0
28,200,-200.0
29,200,-200.0
30,200,-200.0
31,200,-200.0
32,200,-200.0
33,200,-200.0
34,200,-200.0
35,200,-200.0
36,200,-200.0
37,200,-200.0
38,200,-200.0
39,200,-200.0
40,200,-200.0
41,200,-200.0
42,200,-200.0
43,200,-200.0
44,200,-200.0
45,200,-200.0
46,200,-200.0
47,200,-200.0
48,200,-200.0
49,200,-200.0
50,200,-200.0
51,200,-200.0
52,200,-200.0
53,200,-200.0
54,200,-200.0
55,200,-200.0
56,200,-200.0
57,200,-200.0
58,184,-184.0
59,200,-200.0
60,200,-200.0
61,200,-200.0
62,200,-200.0
63,200,-200.0
64,200,-200.0
65,178,-178.0
66,200,-200.0
67,200,-200.0
68,200,-200.0
69,175,-175.0
70,200,-200.0
71,200,-200.0
72,200,-200.0
73,105,-105.0
74,200,-200.0
75,200,-200.0
76,200,-200.0
77,200,-200.0
78,200,-200.0
79,200,-200.0
80,200,-200.0
81,200,-200.0
82,193,-193.0
83,200,-200.0
84,173,-173.0
85,200,-200.0
86,200,-200.0
87,192,-192.0
88,200,-200.0
89,200,-200.0
90,200,-200.0
91,183,-183.0
92,200,-200.0
93,191,-191.0
94,125,-125.0
95,134,-134.0
96,200,-200.0
97,181,-181.0
98,188,-188.0
99,200,-200.0
100,200,-200.0
101,188,-188.0
102,200,-200.0
103,154,-154.0
104,200,-200.0
105,159,-159.0
106,167,-167.0
107,200,-200.0
108,182,-182.0
109,193,-193.0
110,164,-164.0
111,124,-124.0
112,171,-171.0
113,143,-143.0
114,184,-184.0
115,172,-172.0
116,200,-200.0
117,184,-184.0
118,164,-164.0
119,149,-149.0
120,161,-161.0
121,132,-132.0
122,167,-167.0
123,180,-180.0
124,199,-199.0
125,159,-159.0
126,152,-152.0
127,176,-176.0
128,200,-200.0
129,171,-171.0
130,179,-179.0
131,171,-171.0
132,169,-169.0
133,108,-108.0
134,200,-200.0
135,167,-167.0
136,177,-177.0
137,157,-157.0
138,182,-182.0
139,200,-200.0
140,153,-153.0
141,103,-103.0
142,162,-162.0
143,135,-135.0
144,92,-92.0
145,105,-105.0
146,171,-171.0
147,177,-177.0
148,148,-148.0
149,178,-178.0
150,167,-167.0
151,143,-143.0
152,153,-153.0
153,143,-143.0
154,170,-170.0
155,197,-197.0
156,193,-193.0
157,200,-200.0
158,153,-153.0
159,131,-131.0
160,170,-170.0
161,189,-189.0
162,121,-121.0
163,147,-147.0
164,146,-146.0
165,146,-146.0
166,145,-145.0
167,134,-134.0
168,157,-157.0
169,137,-137.0
170,142,-142.0
171,200,-200.0
172,147,-147.0
173,116,-116.0
174,190,-190.0
175,174,-174.0
176,144,-144.0
177,146,-146.0
178,144,-144.0
179,84,-84.0
180,185,-185.0
181,142,-142.0
182,200,-200.0
183,140,-140.0
184,188,-188.0
185,147,-147.0
186,149,-149.0
187,132,-132.0
188,125,-125.0
189,146,-146.0
190,118,-118.0
191,200,-200.0
192,200,-200.0
193,168,-168.0
194,155,-155.0
195,166,-166.0
196,175,-175.0
197,171,-171.0
198,146,-146.0
199,151,-151.0
200,157,-157.0
201,156,-156.0
202,179,-179.0
203,200,-200.0
204,161,-161.0
205,200,-200.0
206,166,-166.0
207,158,-158.0
208,163,-163.0
209,148,-148.0
210,151,-151.0
211,149,-149.0
212,146,-146.0
213,154,-154.0
214,159,-159.0
215,149,-149.0
216,116,-116.0
217,149,-149.0
218,116,-116.0
219,119,-119.0
220,147,-147.0
221,115,-115.0
222,114,-114.0
223,150,-150.0
224,146,-146.0
225,141,-141.0
226,155,-155.0
227,155,-155.0
228,157,-157.0
229,153,-153.0
230,170,-170.0
231,162,-162.0
232,161,-161.0
233,118,-118.0
234,124,-124.0
235,154,-154.0
236,169,-169.0
237,126,-126.0
238,129,-129.0
239,121,-121.0
240,185,-185.0
241,163,-163.0
242,200,-200.0
243,158,-158.0
244,122,-122.0
245,128,-128.0
246,155,-155.0
247,130,-130.0
248,152,-152.0
249,116,-116.0
250,117,-117.0
251,118,-118.0
252,120,-120.0
253,151,-151.0
254,154,-154.0
255,145,-145.0
256,155,-155.0
257,145,-145.0
258,143,-143.0
259,162,-162.0
260,169,-169.0
261,162,-162.0
262,158,-158.0
263,147,-147.0
264,151,-151.0
265,157,-157.0
266,200,-200.0
267,156,-156.0
268,90,-90.0
269,147,-147.0
270,150,-150.0
271,155,-155.0
272,168,-168.0
273,160,-160.0
274,124,-124.0
275,171,-171.0
276,152,-152.0
277,145,-145.0
278,169,-169.0
279,99,-99.0
280,158,-158.0
281,170,-170.0
282,145,-145.0
283,147,-147.0
284,143,-143.0
285,150,-150.0
286,140,-140.0
287,147,-147.0
288,175,-175.0
289,182,-182.0
290,154,-154.0
291,105,-105.0
292,149,-149.0
293,154,-154.0
294,150,-150.0
295,200,-200.0
296,156,-156.0
297,156,-156.0
298,166,-166.0
299,155,-155.0
300,150,-150.0
301,142,-142.0
302,152,-152.0
303,154,-154.0
304,145,-145.0
305,153,-153.0
306,101,-101.0
307,146,-146.0
308,143,-143.0
309,145,-145.0
310,162,-162.0
311,168,-168.0
312,149,-149.0
313,173,-173.0
314,158,-158.0
315,91,-91.0
316,112,-112.0
317,145,-145.0
318,166,-166.0
319,157,-157.0
320,148,-148.0
321,149,-149.0
322,147,-147.0
323,92,-92.0
324,139,-139.0
325,145,-145.0
326,154,-154.0
327,150,-150.0
328,157,-157.0
329,141,-141.0
330,140,-140.0
331,170,-170.0
332,89,-89.0
333,139,-139.0
334,144,-144.0
335,151,-151.0
336,147,-147.0
337,157,-157.0
338,150,-150.0
339,152,-152.0
340,193,-193.0
341,163,-163.0
342,142,-142.0
343,95,-95.0
344,141,-141.0
345,158,-158.0
346,135,-135.0
347,157,-157.0
348,165,-165.0
349,158,-158.0
350,161,-161.0
351,146,-146.0
352,89,-89.0
353,105,-105.0
354,157,-157.0
355,143,-143.0
356,84,-84.0
357,99,-99.0
358,142,-142.0
359,162,-162.0
360,89,-89.0
361,141,-141.0
362,143,-143.0
363,105,-105.0
364,149,-149.0
365,147,-147.0
366,88,-88.0
367,140,-140.0
368,168,-168.0
369,160,-160.0
370,146,-146.0
371,99,-99.0
372,142,-142.0
373,142,-142.0
374,171,-171.0
375,141,-141.0
376,116,-116.0
377,113,-113.0
378,112,-112.0
379,114,-114.0
380,94,-94.0
381,91,-91.0
382,143,-143.0
383,143,-143.0
384,148,-148.0
385,99,-99.0
386,176,-176.0
387,120,-120.0
388,167,-167.0
389,87,-87.0
390,119,-119.0
391,154,-154.0
392,104,-104.0
393,117,-117.0
394,88,-88.0
395,113,-113.0
396,93,-93.0
397,156,-156.0
398,182,-182.0
399,155,-155.0
400,154,-154.0
401,157,-157.0
402,145,-145.0
403,164,-164.0
404,158,-158.0
405,88,-88.0
406,90,-90.0
407,180,-180.0
408,133,-133.0
409,148,-148.0
410,142,-142.0
411,84,-84.0
412,144,-144.0
413,151,-151.0
414,143,-143.0
415,93,-93.0
416,162,-162.0
417,146,-146.0
418,84,-84.0
419,145,-145.0
420,93,-93.0
421,150,-150.0
422,110,-110.0
423,93,-93.0
424,99,-99.0
425,144,-144.0
426,95,-95.0
427,91,-91.0
428,154,-154.0
429,94,-94.0
430,200,-200.0
431,155,-155.0
432,148,-148.0
433,147,-147.0
434,160,-160.0
435,97,-97.0
436,91,-91.0
437,147,-147.0
438,87,-87.0
439,84,-84.0
440,144,-144.0
441,160,-160.0
442,169,-169.0
443,151,-151.0
444,152,-152.0
445,87,-87.0
446,152,-152.0
447,200,-200.0
448,143,-143.0
449,138,-138.0
450,147,-147.0
451,146,-146.0
452,147,-147.0
453,143,-143.0
454,147,-147.0
455,158,-158.0
456,167,-167.0
457,84,-84.0
458,144,-144.0
459,169,-169.0
460,142,-142.0
461,146,-146.0
462,145,-145.0
463,148,-148.0
464,90,-90.0
465,156,-156.0
466,89,-89.0
467,98,-98.0
468,145,-145.0
469,142,-142.0
470,96,-96.0
471,150,-150.0
472,143,-143.0
473,141,-141.0
474,144,-144.0
475,140,-140.0
476,143,-143.0
477,142,-142.0
478,147,-147.0
479,143,-143.0
480,148,-148.0
481,158,-158.0
482,152,-152.0
483,141,-141.0
484,87,-87.0
485,141,-141.0
486,145,-145.0
487,140,-140.0
488,86,-86.0
489,84,-84.0
490,186,-186.0
491,137,-137.0
492,141,-141.0
493,101,-101.0
494,146,-146.0
495,146,-146.0
496,136,-136.0
497,93,-93.0
498,93,-93.0
499,151,-151.0
500,92,-92.0
501,192,-192.0
502,168,-168.0
503,88,-88.0
504,87,-87.0
505,92,-92.0
506,138,-138.0
507,129,-129.0
508,92,-92.0
509,153,-153.0
510,86,-86.0
511,92,-92.0
512,174,-174.0
513,145,-145.0
514,144,-144.0
515,148,-148.0
516,137,-137.0
517,151,-151.0
518,94,-94.0
519,142,-142.0
520,97,-97.0
521,180,-180.0
522,132,-132.0
523,94,-94.0
524,116,-116.0
525,86,-86.0
526,144,-144.0
527,88,-88.0
528,149,-149.0
529,102,-102.0
530,87,-87.0
531,179,-179.0
532,168,-168.0
533,200,-200.0
534,87,-87.0
535,85,-85.0
536,163,-163.0
537,92,-92.0
538,114,-114.0
539,146,-146.0
540,87,-87.0
541,160,-160.0
542,87,-87.0
543,124,-124.0
544,147,-147.0
545,113,-113.0
546,97,-97.0
547,128,-128.0
548,140,-140.0
549,183,-183.0
550,133,-133.0
551,121,-121.0
552,84,-84.0
553,158,-158.0
554,154,-154.0
555,146,-146.0
556,85,-85.0
557,99,-99.0
558,170,-170.0
559,143,-143.0
560,90,-90.0
561,87,-87.0
562,85,-85.0
563,150,-150.0
564,131,-131.0
565,192,-192.0
566,188,-188.0
567,188,-188.0
568,152,-152.0
569,144,-144.0
570,152,-152.0
571,90,-90.0
572,138,-138.0
573,144,-144.0
574,146,-146.0
575,151,-151.0
576,148,-148.0
577,87,-87.0
578,91,-91.0
579,142,-142.0
580,159,-159.0
581,140,-140.0
582,148,-148.0
583,139,-139.0
584,94,-94.0
585,142,-142.0
586,143,-143.0
587,142,-142.0
588,136,-136.0
589,164,-164.0
590,137,-137.0
591,134,-134.0
592,135,-135.0
593,138,-138.0
594,92,-92.0
595,87,-87.0
596,140,-140.0
597,143,-143.0
598,92,-92.0
599,146,-146.0
600,128,-128.0
601,85,-85.0
602,134,-134.0
603,105,-105.0
604,131,-131.0
605,108,-108.0
606,142,-142.0
607,136,-136.0
608,92,-92.0
609,155,-155.0
610,173,-173.0
611,139,-139.0
612,148,-148.0
613,126,-126.0
614,152,-152.0
615,137,-137.0
616,151,-151.0
617,96,-96.0
618,87,-87.0
619,138,-138.0
620,154,-154.0
621,143,-143.0
622,161,-161.0
623,147,-147.0
624,167,-167.0
625,94,-94.0
626,159,-159.0
627,99,-99.0
628,196,-196.0
629,105,-105.0
630,100,-100.0
631,166,-166.0
632,101,-101.0
633,200,-200.0
634,150,-150.0
635,90,-90.0
636,88,-88.0
637,97,-97.0
638,200,-200.0
639,157,-157.0
640,151,-151.0
641,200,-200.0
642,151,-151.0
643,150,-150.0
644,200,-200.0
645,200,-200.0
646,143,-143.0
647,153,-153.0
648,100,-100.0
649,86,-86.0
650,137,-137.0
651,154,-154.0
652,200,-200.0
653,182,-182.0
654,178,-178.0
655,89,-89.0
656,200,-200.0
657,200,-200.0
658,140,-140.0
659,86,-86.0
660,154,-154.0
661,141,-141.0
662,148,-148.0
663,157,-157.0
664,136,-136.0
665,141,-141.0
666,148,-148.0
667,112,-112.0
668,138,-138.0
669,200,-200.0
670,93,-93.0
671,147,-147.0
672,112,-112.0
673,87,-87.0
674,136,-136.0
675,133,-133.0
676,150,-150.0
677,142,-142.0
678,161,-161.0
679,149,-149.0
680,138,-138.0
681,200,-200.0
682,168,-168.0
683,158,-158.0
684,154,-154.0
685,141,-141.0
686,162,-162.0
687,200,-200.0
688,160,-160.0
689,138,-138.0
690,200,-200.0
691,200,-200.0
692,157,-157.0
693,154,-154.0
694,141,-141.0
695,157,-157.0
696,184,-184.0
697,150,-150.0
698,154,-154.0
699,139,-139.0
700,144,-144.0
701,140,-140.0
702,144,-144.0
703,135,-135.0
704,168,-168.0
705,149,-149.0
706,175,-175.0
707,200,-200.0
708,165,-165.0
709,158,-158.0
710,147,-147.0
711,137,-137.0
712,149,-149.0
713,156,-156.0
714,149,-149.0
715,140,-140.0
716,154,-154.0
717,144,-144.0
718,149,-149.0
719,192,-192.0
720,153,-153.0
721,140,-140.0
722,195,-195.0
723,156,-156.0
724,187,-187.0
725,147,-147.0
726,136,-136.0
727,144,-144.0
728,83,-83.0
729,100,-100.0
730,145,-145.0
731,140,-140.0
732,157,-157.0
733,200,-200.0
734,145,-145.0
735,200,-200.0
736,166,-166.0
737,153,-153.0
738,166,-166.0
739,110,-110.0
740,160,-160.0
741,135,-135.0
742,153,-153.0
743,174,-174.0
744,170,-170.0
745,140,-140.0
746,133,-133.0
747,164,-164.0
748,164,-164.0
749,165,-165.0
750,142,-142.0
751,143,-143.0
752,142,-142.0
753,139,-139.0
754,141,-141.0
755,141,-141.0
756,147,-147.0
757,154,-154.0
758,88,-88.0
759,137,-137.0
760,147,-147.0
761,142,-142.0
762,151,-151.0
763,144,-144.0
764,141,-141.0
765,153,-153.0
766,153,-153.0
767,142,-142.0
768,200,-200.0
769,136,-136.0
770,158,-158.0
771,200,-200.0
772,94,-94.0
773,154,-154.0
774,166,-166.0
775,158,-158.0
776,157,-157.0
777,147,-147.0
778,194,-194.0
779,97,-97.0
780,103,-103.0
781,199,-199.0
782,186,-186.0
783,90,-90.0
784,153,-153.0
785,153,-153.0
786,157,-157.0
787,98,-98.0
788,105,-105.0
789,85,-85.0
790,153,-153.0
791,152,-152.0
792,200,-200.0
793,142,-142.0
794,140,-140.0
795,148,-148.0
796,148,-148.0
797,90,-90.0
798,150,-150.0
799,143,-143.0
800,142,-142.0
801,102,-102.0
802,93,-93.0
803,152,-152.0
804,149,-149.0
805,83,-83.0
806,145,-145.0
807,153,-153.0
808,155,-155.0
809,142,-142.0
810,145,-145.0
811,158,-158.0
812,145,-145.0
813,142,-142.0
814,141,-141.0
815,144,-144.0
816,150,-150.0
817,200,-200.0
818,139,-139.0
819,144,-144.0
820,144,-144.0
821,106,-106.0
822,167,-167.0
823,92,-92.0
824,174,-174.0
825,143,-143.0
826,145,-145.0
827,153,-153.0
828,143,-143.0
829,142,-142.0
830,176,-176.0
831,142,-142.0
832,146,-146.0
833,141,-141.0
834,143,-143.0
835,144,-144.0
836,143,-143.0
837,106,-106.0
838,145,-145.0
839,180,-180.0
840,86,-86.0
841,103,-103.0
842,141,-141.0
843,97,-97.0
844,144,-144.0
845,137,-137.0
846,143,-143.0
847,145,-145.0
848,143,-143.0
849,157,-157.0
850,141,-141.0
851,147,-147.0
852,139,-139.0
853,200,-200.0
854,94,-94.0
855,171,-171.0
856,141,-141.0
857,138,-138.0
858,141,-141.0
859,145,-145.0
860,138,-138.0
861,184,-184.0
862,200,-200.0
863,101,-101.0
864,177,-177.0
865,138,-138.0
866,142,-142.0
867,142,-142.0
868,101,-101.0
869,95,-95.0
870,144,-144.0
871,119,-119.0
872,135,-135.0
873,190,-190.0
874,155,-155.0
875,200,-200.0
876,95,-95.0
877,150,-150.0
878,200,-200.0
879,200,-200.0
880,142,-142.0
881,88,-88.0
882,87,-87.0
883,145,-145.0
884,137,-137.0
885,145,-145.0
886,141,-141.0
887,144,-144.0
888,143,-143.0
889,135,-135.0
890,87,-87.0
891,136,-136.0
892,94,-94.0
893,172,-172.0
894,150,-150.0
895,153,-153.0
896,135,-135.0
897,96,-96.0
898,94,-94.0
899,137,-137.0
900,145,-145.0
901,131,-131.0
902,168,-168.0
903,90,-90.0
904,149,-149.0
905,139,-139.0
906,90,-90.0
907,150,-150.0
908,146,-146.0
909,138,-138.0
910,157,-157.0
911,145,-145.0
912,88,-88.0
913,92,-92.0
914,96,-96.0
915,147,-147.0
916,150,-150.0
917,136,-136.0
918,104,-104.0
919,147,-147.0
920,150,-150.0
921,151,-151.0
922,152,-152.0
923,151,-151.0
924,131,-131.0
925,143,-143.0
926,142,-142.0
927,85,-85.0
928,136,-136.0
929,100,-100.0
930,170,-170.0
931,102,-102.0
932,138,-138.0
933,146,-146.0
934,130,-130.0
935,152,-152.0
936,89,-89.0
937,148,-148.0
938,151,-151.0
939,147,-147.0
940,94,-94.0
941,148,-148.0
942,148,-148.0
943,99,-99.0
944,135,-135.0
945,149,-149.0
946,83,-83.0
947,153,-153.0
948,119,-119.0
949,90,-90.0
950,145,-145.0
951,130,-130.0
952,148,-148.0
953,138,-138.0
954,154,-154.0
955,167,-167.0
956,151,-151.0
957,144,-144.0
958,90,-90.0
959,95,-95.0
960,96,-96.0
961,90,-90.0
962,144,-144.0
963,145,-145.0
964,178,-178.0
965,91,-91.0
966,148,-148.0
967,153,-153.0
968,107,-107.0
969,164,-164.0
970,167,-167.0
971,145,-145.0
972,151,-151.0
973,147,-147.0
974,154,-154.0
975,150,-150.0
976,148,-148.0
977,146,-146.0
978,141,-141.0
979,137,-137.0
980,96,-96.0
981,190,-190.0
982,89,-89.0
983,167,-167.0
984,149,-149.0
985,114,-114.0
986,146,-146.0
987,120,-120.0
988,176,-176.0
989,139,-139.0
990,147,-147.0
991,138,-138.0
992,89,-89.0
993,87,-87.0
994,158,-158.0
995,146,-146.0
996,146,-146.0
997,161,-161.0
998,152,-152.0
999,186,-186.0
1000,150,-150.0
1001,162,-162.0
1002,148,-148.0
1003,94,-94.0
1004,173,-173.0
1005,95,-95.0
1006,99,-99.0
1007,100,-100.0
1008,197,-197.0
1009,101,-101.0
1010,197,-197.0
1011,145,-145.0
1012,146,-146.0
1013,164,-164.0
1014,150,-150.0
1015,161,-161.0
1016,145,-145.0
1017,93,-93.0
1018,172,-172.0
1019,92,-92.0
1020,161,-161.0
1021,200,-200.0
1022,147,-147.0
1023,196,-196.0
1024,151,-151.0
1025,95,-95.0
1026,89,-89.0
1027,196,-196.0
1028,168,-168.0
1029,106,-106.0
1030,164,-164.0
1031,164,-164.0
1032,122,-122.0
1033,142,-142.0
1034,91,-91.0
1035,172,-172.0
1036,100,-100.0
1037,157,-157.0
1038,146,-146.0
1039,91,-91.0
1040,88,-88.0
1041,145,-145.0
1042,86,-86.0
1043,181,-181.0
1044,173,-173.0
1045,147,-147.0
1046,200,-200.0
1047,142,-142.0
1048,199,-199.0
1049,149,-149.0
1050,96,-96.0
1051,98,-98.0
1052,200,-200.0
1053,178,-178.0
1054,159,-159.0
1055,168,-168.0
1056,143,-143.0
1057,138,-138.0
1058,141,-141.0
1059,88,-88.0
1060,139,-139.0
1061,85,-85.0
1062,85,-85.0
1063,166,-166.0
1064,166,-166.0
1065,96,-96.0
1066,150,-150.0
1067,86,-86.0
1068,144,-144.0
1069,88,-88.0
1070,106,-106.0
1071,109,-109.0
1072,148,-148.0
1073,131,-131.0
1074,120,-120.0
1075,139,-139.0
1076,147,-147.0
1077,187,-187.0
1078,157,-157.0
1079,86,-86.0
1080,95,-95.0
1081,121,-121.0
1082,85,-85.0
1083,174,-174.0
1084,104,-104.0
1085,200,-200.0
1086,105,-105.0
1087,162,-162.0
1088,142,-142.0
1089,139,-139.0
1090,141,-141.0
1091,145,-145.0
1092,143,-143.0
1093,108,-108.0
1094,98,-98.0
1095,175,-175.0
1096,140,-140.0
1097,144,-144.0
1098,114,-114.0
1099,89,-89.0
1100,104,-104.0
1101,120,-120.0
1102,144,-144.0
1103,106,-106.0
1104,141,-141.0
1105,164,-164.0
1106,179,-179.0
1107,143,-143.0
1108,181,-181.0
1109,143,-143.0
1110,94,-94.0
1111,170,-170.0
1112,142,-142.0
1113,142,-142.0
1114,143,-143.0
1115,159,-159.0
1116,111,-111.0
1117,87,-87.0
1118,139,-139.0
1119,95,-95.0
1120,147,-147.0
1121,89,-89.0
1122,142,-142.0
1123,90,-90.0
1124,142,-142.0
1125,156,-156.0
1126,92,-92.0
1127,109,-109.0
1128,142,-142.0
1129,144,-144.0
1130,87,-87.0
1131,119,-119.0
1132,95,-95.0
1133,88,-88.0
1134,160,-160.0
1135,88,-88.0
1136,159,-159.0
1137,163,-163.0
1138,87,-87.0
1139,163,-163.0
1140,184,-184.0
1141,151,-151.0
1142,147,-147.0
1143,158,-158.0
1144,91,-91.0
1145,85,-85.0
1146,157,-157.0
1147,91,-91.0
1148,153,-153.0
1149,146,-146.0
1150,147,-147.0
1151,97,-97.0
1152,171,-171.0
1153,128,-128.0
1154,146,-146.0
1155,144,-144.0
1156,143,-143.0
1157,92,-92.0
1158,112,-112.0
1159,108,-108.0
1160,143,-143.0
1161,144,-144.0
1162,144,-144.0
1163,162,-162.0
1164,184,-184.0
1165,145,-145.0
1166,102,-102.0
1167,93,-93.0
1168,147,-147.0
1169,89,-89.0
1170,165,-165.0
1171,89,-89.0
1172,88,-88.0
1173,119,-119.0
1174,148,-148.0
1175,146,-146.0
1176,143,-143.0
1177,104,-104.0
1178,150,-150.0
1179,150,-150.0
1180,152,-152.0
1181,144,-144.0
1182,151,-151.0
1183,145,-145.0
1184,142,-142.0
1185,93,-93.0
1186,147,-147.0
1187,150,-150.0
1188,87,-87.0
1189,185,-185.0
1190,86,-86.0
1191,149,-149.0
1192,143,-143.0
1193,152,-152.0
1194,155,-155.0
1195,162,-162.0
1196,148,-148.0
1197,89,-89.0
1198,149,-149.0
1199,141,-141.0
1200,142,-142.0
1201,155,-155.0
1202,100,-100.0
1203,149,-149.0
1204,90,-90.0
1205,163,-163.0
1206,155,-155.0
1207,156,-156.0
1208,87,-87.0
1209,146,-146.0
1210,150,-150.0
1211,95,-95.0
1212,147,-147.0
1213,106,-106.0
1214,147,-147.0
1215,96,-96.0
1216,88,-88.0
1217,175,-175.0
1218,94,-94.0
1219,147,-147.0
1220,145,-145.0
1221,155,-155.0
1222,107,-107.0
1223,106,-106.0
1224,111,-111.0
1225,87,-87.0
1226,106,-106.0
1227,109,-109.0
1228,85,-85.0
1229,89,-89.0
1230,151,-151.0
1231,105,-105.0
1232,104,-104.0
1233,107,-107.0
1234,107,-107.0
1235,168,-168.0
1236,89,-89.0
1237,174,-174.0
1238,114,-114.0
1239,146,-146.0
1240,105,-105.0
1241,103,-103.0
1242,200,-200.0
1243,109,-109.0
1244,146,-146.0
1245,173,-173.0
1246,174,-174.0
1247,164,-164.0
1248,86,-86.0
1249,110,-110.0
1250,108,-108.0
1251,100,-100.0
1252,104,-104.0
1253,120,-120.0
1254,105,-105.0
1255,104,-104.0
1256,106,-106.0
1257,105,-105.0
1258,111,-111.0
1259,103,-103.0
1260,94,-94.0
1261,116,-116.0
1262,105,-105.0
1263,145,-145.0
1264,110,-110.0
1265,103,-103.0
1266,152,-152.0
1267,155,-155.0
1268,149,-149.0
1269,200,-200.0
1270,158,-158.0
1271,200,-200.0
1272,151,-151.0
1273,154,-154.0
1274,148,-148.0
1275,147,-147.0
1276,147,-147.0
1277,149,-149.0
1278,157,-157.0
1279,177,-177.0
1280,200,-200.0
1281,200,-200.0
1282,157,-157.0
1283,200,-200.0
1284,200,-200.0
1285,200,-200.0
1286,158,-158.0
1287,186,-186.0
1288,200,-200.0
1289,168,-168.0
1290,151,-151.0
1291,200,-200.0
1292,153,-153.0
1293,171,-171.0
1294,200,-200.0
1295,158,-158.0
1296,153,-153.0
1297,104,-104.0
1298,156,-156.0
1299,136,-136.0
1300,152,-152.0
1301,176,-176.0
1302,125,-125.0
1303,97,-97.0
1304,145,-145.0
1305,88,-88.0
1306,99,-99.0
1307,162,-162.0
1308,185,-185.0
1309,116,-116.0
1310,200,-200.0
1311,152,-152.0
1312,160,-160.0
1313,136,-136.0
1314,159,-159.0
1315,200,-200.0
1316,150,-150.0
1317,129,-129.0
1318,153,-153.0
1319,200,-200.0
1320,200,-200.0
1321,164,-164.0
1322,150,-150.0
1323,153,-153.0
1324,105,-105.0
1325,152,-152.0
1326,154,-154.0
1327,153,-153.0
1328,141,-141.0
1329,200,-200.0
1330,95,-95.0
1331,137,-137.0
1332,92,-92.0
1333,150,-150.0
1334,150,-150.0
1335,151,-151.0
1336,149,-149.0
1337,105,-105.0
1338,106,-106.0
1339,94,-94.0
1340,88,-88.0
1341,155,-155.0
1342,130,-130.0
1343,190,-190.0
1344,150,-150.0
1345,138,-138.0
1346,155,-155.0
1347,115,-115.0
1348,158,-158.0
1349,86,-86.0
1350,139,-139.0
1351,154,-154.0
1352,168,-168.0
1353,147,-147.0
1354,151,-151.0
1355,86,-86.0
1356,200,-200.0
1357,153,-153.0
1358,145,-145.0
1359,90,-90.0
1360,152,-152.0
1361,200,-200.0
1362,146,-146.0
1363,174,-174.0
1364,142,-142.0
1365,94,-94.0
1366,197,-197.0
1367,146,-146.0
1368,124,-124.0
1369,139,-139.0
1370,85,-85.0
1371,145,-145.0
1372,95,-95.0
1373,155,-155.0
1374,114,-114.0
1375,107,-107.0
1376,128,-128.0
1377,151,-151.0
1378,105,-105.0
1379,151,-151.0
1380,200,-200.0
1381,87,-87.0
1382,110,-110.0
1383,159,-159.0
1384,88,-88.0
1385,93,-93.0
1386,112,-112.0
1387,147,-147.0
1388,172,-172.0
1389,174,-174.0
1390,123,-123.0
1391,138,-138.0
1392,156,-156.0
1393,118,-118.0
1394,152,-152.0
1395,137,-137.0
1396,112,-112.0
1397,137,-137.0
1398,145,-145.0
1399,111,-111.0
1400,92,-92.0
1401,125,-125.0
1402,115,-115.0
1403,111,-111.0
1404,159,-159.0
1405,174,-174.0
1406,200,-200.0
1407,156,-156.0
1408,119,-119.0
1409,111,-111.0
1410,114,-114.0
1411,86,-86.0
1412,107,-107.0
1413,111,-111.0
1414,109,-109.0
1415,121,-121.0
1416,90,-90.0
1417,122,-122.0
1418,112,-112.0
1419,177,-177.0
1420,123,-123.0
1421,116,-116.0
1422,85,-85.0
1423,171,-171.0
1424,133,-133.0
1425,121,-121.0
1426,115,-115.0
1427,120,-120.0
1428,125,-125.0
1429,151,-151.0
1430,84,-84.0
1431,115,-115.0
1432,87,-87.0
1433,101,-101.0
1434,96,-96.0
1435,122,-122.0
1436,111,-111.0
1437,109,-109.0
1438,118,-118.0
1439,144,-144.0
1440,177,-177.0
1441,112,-112.0
1442,112,-112.0
1443,105,-105.0
1444,123,-123.0
1445,117,-117.0
1446,116,-116.0
1447,84,-84.0
1448,118,-118.0
1449,86,-86.0
1450,119,-119.0
1451,109,-109.0
1452,111,-111.0
1453,162,-162.0
1454,119,-119.0
1455,107,-107.0
1456,131,-131.0
1457,167,-167.0
1458,88,-88.0
1459,113,-113.0
1460,118,-118.0
1461,182,-182.0
1462,191,-191.0
1463,117,-117.0
1464,122,-122.0
1465,121,-121.0
1466,130,-130.0
1467,146,-146.0
1468,145,-145.0
1469,165,-165.0
1470,85,-85.0
1471,124,-124.0
1472,145,-145.0
1473,169,-169.0
1474,125,-125.0
1475,157,-157.0
1476,166,-166.0
1477,163,-163.0
1478,157,-157.0
1479,162,-162.0
1480,157,-157.0
1481,153,-153.0
1482,169,-169.0
1483,195,-195.0
1484,85,-85.0
1485,91,-91.0
1486,173,-173.0
1487,96,-96.0
1488,113,-113.0
1489,109,-109.0
1490,156,-156.0
1491,162,-162.0
1492,86,-86.0
1493,168,-168.0
1494,162,-162.0
1495,200,-200.0
1496,104,-104.0
1497,111,-111.0
1498,84,-84.0
1499,87,-87.0
1500,100,-100.0
1501,146,-146.0
1502,196,-196.0
1503,132,-132.0
1504,153,-153.0
1505,111,-111.0
1506,88,-88.0
1507,104,-104.0
1508,161,-161.0
1509,88,-88.0
1510,140,-140.0
1511,154,-154.0
1512,107,-107.0
1513,106,-106.0
1514,108,-108.0
1515,154,-154.0
1516,156,-156.0
1517,156,-156.0
1518,105,-105.0
1519,154,-154.0
1520,157,-157.0
1521,84,-84.0
1522,92,-92.0
1523,106,-106.0
1524,105,-105.0
1525,183,-183.0
1526,116,-116.0
1527,154,-154.0
1528,152,-152.0
1529,105,-105.0
1530,146,-146.0
1531,128,-128.0
1532,164,-164.0
1533,141,-141.0
1534,139,-139.0
1535,87,-87.0
1536,146,-146.0
1537,135,-135.0
1538,139,-139.0
1539,141,-141.0
1540,160,-160.0
1541,150,-150.0
1542,113,-113.0
1543,149,-149.0
1544,151,-151.0
1545,162,-162.0
1546,139,-139.0
1547,189,-189.0
1548,149,-149.0
1549,138,-138.0
1550,146,-146.0
1551,143,-143.0
1552,153,-153.0
1553,158,-158.0
1554,89,-89.0
1555,147,-147.0
1556,137,-137.0
1557,155,-155.0
1558,147,-147.0
1559,117,-117.0
1560,145,-145.0
1561,163,-163.0
1562,145,-145.0
1563,151,-151.0
1564,179,-179.0
1565,200,-200.0
1566,171,-171.0
1567,157,-157.0
1568,161,-161.0
1569,148,-148.0
1570,150,-150.0
1571,122,-122.0
1572,200,-200.0
1573,155,-155.0
1574,192,-192.0
1575,200,-200.0
1576,143,-143.0
1577,141,-141.0
1578,130,-130.0
1579,132,-132.0
1580,98,-98.0
1581,165,-165.0
1582,169,-169.0
1583,146,-146.0
1584,178,-178.0
1585,144,-144.0
1586,101,-101.0
1587,157,-157.0
1588,138,-138.0
1589,151,-151.0
1590,178,-178.0
1591,148,-148.0
1592,200,-200.0
1593,158,-158.0
1594,164,-164.0
1595,154,-154.0
1596,106,-106.0
1597,200,-200.0
1598,160,-160.0
1599,200,-200.0
1600,134,-134.0
1601,149,-149.0
1602,148,-148.0
1603,161,-161.0
1604,160,-160.0
1605,164,-164.0
1606,166,-166.0
1607,106,-106.0
1608,150,-150.0
1609,145,-145.0
1610,173,-173.0
1611,119,-119.0
1612,142,-142.0
1613,130,-130.0
1614,84,-84.0
1615,112,-112.0
1616,95,-95.0
1617,144,-144.0
1618,179,-179.0
1619,154,-154.0
1620,163,-163.0
1621,153,-153.0
1622,152,-152.0
1623,148,-148.0
1624,155,-155.0
1625,173,-173.0
1626,181,-181.0
1627,149,-149.0
1628,150,-150.0
1629,165,-165.0
1630,162,-162.0
1631,156,-156.0
1632,200,-200.0
1633,169,-169.0
1634,130,-130.0
1635,119,-119.0
1636,144,-144.0
1637,161,-161.0
1638,200,-200.0
1639,88,-88.0
1640,151,-151.0
1641,122,-122.0
1642,200,-200.0
1643,147,-147.0
1644,142,-142.0
1645,183,-183.0
1646,200,-200.0
1647,141,-141.0
1648,200,-200.0
1649,152,-152.0
1650,145,-145.0
1651,158,-158.0
1652,136,-136.0
1653,139,-139.0
1654,141,-141.0
1655,200,-200.0
1656,200,-200.0
1657,171,-171.0
1658,150,-150.0
1659,125,-125.0
1660,151,-151.0
1661,200,-200.0
1662,91,-91.0
1663,95,-95.0
1664,200,-200.0
1665,155,-155.0
1666,153,-153.0
1667,151,-151.0
1668,158,-158.0
1669,169,-169.0
1670,143,-143.0
1671,152,-152.0
1672,153,-153.0
1673,174,-174.0
1674,153,-153.0
1675,200,-200.0
1676,152,-152.0
1677,145,-145.0
1678,153,-153.0
1679,158,-158.0
1680,159,-159.0
1681,156,-156.0
1682,157,-157.0
1683,182,-182.0
1684,163,-163.0
1685,149,-149.0
1686,153,-153.0
1687,156,-156.0
1688,153,-153.0
1689,146,-146.0
1690,194,-194.0
1691,156,-156.0
1692,162,-162.0
1693,157,-157.0
1694,156,-156.0
1695,149,-149.0
1696,140,-140.0
1697,145,-145.0
1698,108,-108.0
1699,111,-111.0
1700,160,-160.0
1701,173,-173.0
1702,111,-111.0
1703,187,-187.0
1704,177,-177.0
1705,145,-145.0
1706,168,-168.0
1707,113,-113.0
1708,111,-111.0
1709,110,-110.0
1710,95,-95.0
1711,164,-164.0
1712,127,-127.0
1713,113,-113.0
1714,178,-178.0
1715,116,-116.0
1716,119,-119.0
1717,185,-185.0
1718,147,-147.0
1719,111,-111.0
1720,112,-112.0
1721,108,-108.0
1722,115,-115.0
1723,158,-158.0
1724,181,-181.0
1725,156,-156.0
1726,100,-100.0
1727,116,-116.0
1728,163,-163.0
1729,188,-188.0
1730,97,-97.0
1731,154,-154.0
1732,143,-143.0
1733,103,-103.0
1734,110,-110.0
1735,107,-107.0
1736,110,-110.0
1737,111,-111.0
1738,107,-107.0
1739,98,-98.0
1740,167,-167.0
1741,162,-162.0
1742,90,-90.0
1743,153,-153.0
1744,119,-119.0
1745,114,-114.0
1746,113,-113.0
1747,104,-104.0
1748,101,-101.0
1749,164,-164.0
1750,111,-111.0
1751,117,-117.0
1752,114,-114.0
1753,115,-115.0
1754,110,-110.0
1755,131,-131.0
1756,109,-109.0
1757,160,-160.0
1758,104,-104.0
1759,150,-150.0
1760,198,-198.0
1761,107,-107.0
1762,96,-96.0
1763,97,-97.0
1764,144,-144.0
1765,112,-112.0
1766,142,-142.0
1767,117,-117.0
1768,117,-117.0
1769,117,-117.0
1770,137,-137.0
1771,94,-94.0
1772,187,-187.0
1773,105,-105.0
1774,93,-93.0
1775,118,-118.0
1776,91,-91.0
1777,178,-178.0
1778,134,-134.0
1779,161,-161.0
1780,90,-90.0
1781,153,-153.0
1782,181,-181.0
1783,161,-161.0
1784,162,-162.0
1785,139,-139.0
1786,141,-141.0
1787,134,-134.0
1788,150,-150.0
1789,154,-154.0
1790,91,-91.0
1791,154,-154.0
1792,100,-100.0
1793,138,-138.0
1794,89,-89.0
1795,89,-89.0
1796,149,-149.0
1797,89,-89.0
1798,200,-200.0
1799,141,-141.0
1800,142,-142.0
1801,118,-118.0
1802,140,-140.0
1803,86,-86.0
1804,155,-155.0
1805,156,-156.0
1806,147,-147.0
1807,97,-97.0
1808,148,-148.0
1809,141,-141.0
1810,144,-144.0
1811,141,-141.0
1812,104,-104.0
1813,85,-85.0
1814,155,-155.0
1815,94,-94.0
1816,90,-90.0
1817,154,-154.0
1818,87,-87.0
1819,90,-90.0
1820,156,-156.0
1821,158,-158.0
1822,159,-159.0
1823,93,-93.0
1824,147,-147.0
1825,155,-155.0
1826,155,-155.0
1827,148,-148.0
1828,95,-95.0
1829,99,-99.0
1830,151,-151.0
1831,87,-87.0
1832,157,-157.0
1833,161,-161.0
1834,86,-86.0
1835,165,-165.0
1836,156,-156.0
1837,91,-91.0
1838,97,-97.0
1839,94,-94.0
1840,189,-189.0
1841,101,-101.0
1842,158,-158.0
1843,100,-100.0
1844,153,-153.0
1845,179,-179.0
1846,89,-89.0
1847,90,-90.0
1848,87,-87.0
1849,178,-178.0
1850,98,-98.0
1851,99,-99.0
1852,151,-151.0
1853,149,-149.0
1854,164,-164.0
1855,148,-148.0
1856,149,-149.0
1857,105,-105.0
1858,168,-168.0
1859,191,-191.0
1860,97,-97.0
1861,156,-156.0
1862,124,-124.0
1863,176,-176.0
1864,113,-113.0
1865,118,-118.0
1866,139,-139.0
1867,84,-84.0
1868,138,-138.0
1869,150,-150.0
1870,137,-137.0
1871,156,-156.0
1872,161,-161.0
1873,165,-165.0
1874,177,-177.0
1875,200,-200.0
1876,142,-142.0
1877,200,-200.0
1878,200,-200.0
1879,133,-133.0
1880,139,-139.0
1881,200,-200.0
1882,192,-192.0
1883,177,-177.0
1884,142,-142.0
1885,152,-152.0
1886,177,-177.0
1887,137,-137.0
1888,136,-136.0
1889,144,-144.0
1890,147,-147.0
1891,199,-199.0
1892,143,-143.0
1893,141,-141.0
1894,160,-160.0
1895,167,-167.0
1896,112,-112.0
1897,167,-167.0
1898,161,-161.0
1899,153,-153.0
1900,127,-127.0
1901,152,-152.0
1902,180,-180.0
1903,104,-104.0
1904,100,-100.0
1905,90,-90.0
1906,157,-157.0
1907,150,-150.0
1908,144,-144.0
1909,168,-168.0
1910,115,-115.0
1911,137,-137.0
1912,149,-149.0
1913,92,-92.0
1914,142,-142.0
1915,145,-145.0
1916,157,-157.0
1917,137,-137.0
1918,150,-150.0
1919,143,-143.0
1920,144,-144.0
1921,154,-154.0
1922,159,-159.0
1923,142,-142.0
1924,150,-150.0
1925,158,-158.0
1926,153,-153.0
1927,160,-160.0
1928,151,-151.0
1929,158,-158.0
1930,148,-148.0
1931,158,-158.0
1932,164,-164.0
1933,172,-172.0
1934,148,-148.0
1935,151,-151.0
1936,177,-177.0
1937,160,-160.0
1938,152,-152.0
1939,157,-157.0
1940,156,-156.0
1941,133,-133.0
1942,155,-155.0
1943,157,-157.0
1944,100,-100.0
1945,151,-151.0
1946,161,-161.0
1947,152,-152.0
1948,122,-122.0
1949,160,-160.0
1950,155,-155.0
1951,87,-87.0
1952,142,-142.0
1953,170,-170.0
1954,147,-147.0
1955,156,-156.0
1956,99,-99.0
1957,200,-200.0
1958,161,-161.0
1959,99,-99.0
1960,171,-171.0
1961,158,-158.0
1962,145,-145.0
1963,150,-150.0
1964,154,-154.0
1965,115,-115.0
1966,156,-156.0
1967,159,-159.0
1968,169,-169.0
1969,155,-155.0
1970,200,-200.0
1971,157,-157.0
1972,200,-200.0
1973,200,-200.0
1974,161,-161.0
1975,200,-200.0
1976,142,-142.0
1977,178,-178.0
1978,166,-166.0
1979,166,-166.0
1980,200,-200.0
1981,96,-96.0
1982,150,-150.0
1983,138,-138.0
1984,152,-152.0
1985,200,-200.0
1986,160,-160.0
1987,200,-200.0
1988,200,-200.0
1989,183,-183.0
1990,154,-154.0
1991,105,-105.0
1992,173,-173.0
1993,111,-111.0
1994,104,-104.0
1995,200,-200.0
1996,200,-200.0
1997,153,-153.0
1998,196,-196.0
1999,200,-200.0
2000,115,-115.0
2001,163,-163.0
2002,128,-128.0
2003,147,-147.0
2004,141,-141.0
2005,132,-132.0
2006,200,-200.0
2007,178,-178.0
2008,141,-141.0
2009,112,-112.0
2010,200,-200.0
2011,181,-181.0
2012,151,-151.0
2013,148,-148.0
2014,158,-158.0
2015,121,-121.0
2016,119,-119.0
2017,200,-200.0
2018,150,-150.0
2019,140,-140.0
2020,156,-156.0
2021,142,-142.0
2022,96,-96.0
2023,118,-118.0
2024,149,-149.0
2025,106,-106.0
2026,139,-139.0
2027,150,-150.0
2028,140,-140.0
2029,109,-109.0
2030,155,-155.0
2031,107,-107.0
2032,144,-144.0
2033,161,-161.0
2034,200,-200.0
2035,163,-163.0
2036,141,-141.0
2037,146,-146.0
2038,152,-152.0
2039,142,-142.0
2040,151,-151.0
2041,160,-160.0
2042,170,-170.0
2043,143,-143.0
2044,162,-162.0
2045,144,-144.0
2046,106,-106.0
2047,165,-165.0
2048,140,-140.0
2049,107,-107.0
2050,179,-179.0
2051,108,-108.0
2052,117,-117.0
2053,147,-147.0
2054,155,-155.0
2055,147,-147.0
2056,169,-169.0
2057,158,-158.0
2058,168,-168.0
2059,110,-110.0
2060,154,-154.0
2061,134,-134.0
2062,156,-156.0
2063,157,-157.0
2064,143,-143.0
2065,155,-155.0
2066,120,-120.0
2067,144,-144.0
2068,149,-149.0
2069,156,-156.0
2070,150,-150.0
2071,105,-105.0
2072,147,-147.0
2073,104,-104.0
2074,160,-160.0
2075,158,-158.0
2076,126,-126.0
2077,172,-172.0
2078,178,-178.0
2079,200,-200.0
2080,200,-200.0
2081,152,-152.0
2082,148,-148.0
2083,117,-117.0
2084,151,-151.0
2085,157,-157.0
2086,145,-145.0
2087,200,-200.0
2088,143,-143.0
2089,158,-158.0
2090,144,-144.0
2091,152,-152.0
2092,156,-156.0
2093,142,-142.0
2094,158,-158.0
2095,156,-156.0
2096,130,-130.0
2097,133,-133.0
2098,157,-157.0
2099,156,-156.0
2100,150,-150.0
2101,104,-104.0
2102,156,-156.0
2103,142,-142.0
2104,150,-150.0
2105,154,-154.0
2106,151,-151.0
2107,155,-155.0
2108,120,-120.0
2109,111,-111.0
2110,166,-166.0
2111,166,-166.0
2112,154,-154.0
2113,149,-149.0
2114,156,-156.0
2115,162,-162.0
2116,147,-147.0
2117,156,-156.0
2118,107,-107.0
2119,115,-115.0
2120,110,-110.0
2121,149,-149.0
2122,147,-147.0
2123,146,-146.0
2124,151,-151.0
2125,168,-168.0
2126,153,-153.0
2127,148,-148.0
2128,176,-176.0
2129,110,-110.0
2130,150,-150.0
2131,157,-157.0
2132,152,-152.0
2133,156,-156.0
2134,108,-108.0
2135,164,-164.0
2136,156,-156.0
2137,117,-117.0
2138,146,-146.0
2139,148,-148.0
2140,118,-118.0
2141,144,-144.0
2142,158,-158.0
2143,149,-149.0
2144,156,-156.0
2145,157,-157.0
2146,101,-101.0
2147,104,-104.0
2148,143,-143.0
2149,153,-153.0
2150,110,-110.0
2151,151,-151.0
2152,147,-147.0
2153,150,-150.0
2154,101,-101.0
2155,160,-160.0
2156,100,-100.0
2157,93,-93.0
2158,93,-93.0
2159,153,-153.0
2160,91,-91.0
2161,156,-156.0
2162,145,-145.0
2163,158,-158.0
2164,156,-156.0
2165,143,-143.0
2166,142,-142.0
2167,152,-152.0
2168,94,-94.0
2169,142,-142.0
2170,123,-123.0
2171,143,-143.0
2172,111,-111.0
2173,115,-115.0
2174,145,-145.0
2175,200,-200.0
2176,90,-90.0
2177,145,-145.0
2178,160,-160.0
2179,141,-141.0
2180,140,-140.0
2181,106,-106.0
2182,146,-146.0
2183,178,-178.0
2184,120,-120.0
2185,153,-153.0
2186,183,-183.0
2187,144,-144.0
2188,159,-159.0
2189,90,-90.0
2190,101,-101.0
2191,150,-150.0
2192,172,-172.0
2193,147,-147.0
2194,105,-105.0
2195,143,-143.0
2196,91,-91.0
2197,157,-157.0
2198,200,-200.0
2199,107,-107.0
2200,144,-144.0
2201,141,-141.0
2202,170,-170.0
2203,162,-162.0
2204,166,-166.0
2205,104,-104.0
2206,164,-164.0
2207,154,-154.0
2208,164,-164.0
2209,96,-96.0
2210,159,-159.0
2211,110,-110.0
2212,141,-141.0
2213,155,-155.0
2214,147,-147.0
2215,162,-162.0
2216,180,-180.0
2217,98,-98.0
2218,99,-99.0
2219,165,-165.0
2220,143,-143.0
2221,88,-88.0
2222,147,-147.0
2223,93,-93.0
2224,148,-148.0
2225,164,-164.0
2226,119,-119.0
2227,110,-110.0
2228,160,-160.0
2229,149,-149.0
2230,148,-148.0
2231,149,-149.0
2232,154,-154.0
2233,135,-135.0
2234,109,-109.0
2235,153,-153.0
2236,167,-167.0
2237,164,-164.0
2238,182,-182.0
2239,198,-198.0
2240,112,-112.0
2241,116,-116.0
2242,102,-102.0
2243,158,-158.0
2244,118,-118.0
2245,149,-149.0
2246,200,-200.0
2247,179,-179.0
2248,155,-155.0
2249,160,-160.0
2250,99,-99.0
2251,90,-90.0
2252,154,-154.0
2253,120,-120.0
2254,98,-98.0
2255,130,-130.0
2256,170,-170.0
2257,126,-126.0
2258,183,-183.0
2259,176,-176.0
2260,127,-127.0
2261,89,-89.0
2262,158,-158.0
2263,153,-153.0
2264,110,-110.0
2265,162,-162.0
2266,159,-159.0
2267,90,-90.0
2268,108,-108.0
2269,153,-153.0
2270,164,-164.0
2271,111,-111.0
2272,164,-164.0
2273,156,-156.0
2274,150,-150.0
2275,166,-166.0
2276,103,-103.0
2277,157,-157.0
2278,156,-156.0
2279,181,-181.0
2280,91,-91.0
2281,154,-154.0
2282,177,-177.0
2283,96,-96.0
2284,192,-192.0
2285,131,-131.0
2286,193,-193.0
2287,200,-200.0
2288,199,-199.0
2289,200,-200.0
2290,200,-200.0
2291,200,-200.0
2292,162,-162.0
2293,200,-200.0
2294,175,-175.0
2295,89,-89.0
2296,178,-178.0
2297,165,-165.0
2298,173,-173.0
2299,169,-169.0
2300,159,-159.0
2301,182,-182.0
2302,153,-153.0
2303,113,-113.0
2304,157,-157.0
2305,100,-100.0
2306,93,-93.0
2307,154,-154.0
2308,149,-149.0
2309,152,-152.0
2310,161,-161.0
2311,87,-87.0
2312,176,-176.0
2313,97,-97.0
2314,153,-153.0
2315,100,-100.0
2316,96,-96.0
2317,159,-159.0
2318,135,-135.0
2319,154,-154.0
2320,148,-148.0
2321,156,-156.0
2322,99,-99.0
2323,164,-164.0
2324,151,-151.0
2325,152,-152.0
2326,163,-163.0
2327,157,-157.0
2328,172,-172.0
2329,93,-93.0
2330,154,-154.0
2331,96,-96.0
2332,134,-134.0
2333,200,-200.0
2334,140,-140.0
2335,197,-197.0
2336,175,-175.0
2337,136,-136.0
2338,173,-173.0
2339,93,-93.0
2340,150,-150.0
2341,156,-156.0
2342,151,-151.0
2343,162,-162.0
2344,200,-200.0
2345,90,-90.0
2346,158,-158.0
2347,171,-171.0
2348,152,-152.0
2349,155,-155.0
2350,175,-175.0
2351,148,-148.0
2352,170,-170.0
2353,90,-90.0
2354,153,-153.0
2355,152,-152.0
2356,130,-130.0
2357,95,-95.0
2358,158,-158.0
2359,174,-174.0
2360,185,-185.0
2361,155,-155.0
2362,152,-152.0
2363,151,-151.0
2364,165,-165.0
2365,167,-167.0
2366,113,-113.0
2367,154,-154.0
2368,158,-158.0
2369,147,-147.0
2370,95,-95.0
2371,103,-103.0
2372,153,-153.0
2373,100,-100.0
2374,164,-164.0
2375,110,-110.0
2376,99,-99.0
2377,152,-152.0
2378,153,-153.0
2379,157,-157.0
2380,200,-200.0
2381,174,-174.0
2382,145,-145.0
2383,146,-146.0
2384,161,-161.0
2385,92,-92.0
2386,165,-165.0
2387,106,-106.0
2388,156,-156.0
2389,200,-200.0
2390,148,-148.0
2391,87,-87.0
2392,157,-157.0
2393,181,-181.0
2394,153,-153.0
2395,200,-200.0
2396,160,-160.0
2397,159,-159.0
2398,150,-150.0
2399,86,-86.0
2400,90,-90.0
2401,148,-148.0
2402,157,-157.0
2403,161,-161.0
2404,154,-154.0
2405,169,-169.0
2406,190,-190.0
2407,166,-166.0
2408,86,-86.0
2409,144,-144.0
2410,179,-179.0
2411,161,-161.0
2412,170,-170.0
2413,152,-152.0
2414,156,-156.0
2415,159,-159.0
2416,105,-105.0
2417,103,-103.0
2418,150,-150.0
2419,95,-95.0
2420,149,-149.0
2421,154,-154.0
2422,93,-93.0
2423,138,-138.0
2424,181,-181.0
2425,88,-88.0
2426,97,-97.0
2427,173,-173.0
2428,91,-91.0
2429,147,-147.0
2430,161,-161.0
2431,200,-200.0
2432,144,-144.0
2433,135,-135.0
2434,86,-86.0
2435,144,-144.0
2436,153,-153.0
2437,109,-109.0
2438,196,-196.0
2439,169,-169.0
2440,148,-148.0
2441,153,-153.0
2442,190,-190.0
2443,149,-149.0
2444,159,-159.0
2445,91,-91.0
2446,150,-150.0
2447,135,-135.0
2448,178,-178.0
2449,152,-152.0
2450,146,-146.0
2451,97,-97.0
2452,88,-88.0
2453,91,-91.0
2454,142,-142.0
2455,86,-86.0
2456,173,-173.0
2457,152,-152.0
2458,153,-153.0
2459,154,-154.0
2460,140,-140.0
2461,150,-150.0
2462,147,-147.0
2463,160,-160.0
2464,173,-173.0
2465,147,-147.0
2466,193,-193.0
2467,183,-183.0
2468,148,-148.0
2469,148,-148.0
2470,146,-146.0
2471,142,-142.0
2472,99,-99.0
2473,148,-148.0
2474,142,-142.0
2475,157,-157.0
2476,157,-157.0
2477,158,-158.0
2478,164,-164.0
2479,134,-134.0
2480,134,-134.0
2481,142,-142.0
2482,200,-200.0
2483,144,-144.0
2484,194,-194.0
2485,134,-134.0
2486,192,-192.0
2487,200,-200.0
2488,200,-200.0
2489,172,-172.0
2490,200,-200.0
2491,198,-198.0
2492,147,-147.0
2493,141,-141.0
2494,145,-145.0
2495,199,-199.0
2496,135,-135.0
2497,141,-141.0
2498,160,-160.0
2499,139,-139.0
2500,141,-141.0
2501,157,-157.0
2502,200,-200.0
2503,140,-140.0
2504,138,-138.0
2505,135,-135.0
2506,200,-200.0
2507,200,-200.0
2508,93,-93.0
2509,156,-156.0
2510,138,-138.0
2511,148,-148.0
2512,156,-156.0
2513,136,-136.0
2514,141,-141.0
2515,135,-135.0
2516,135,-135.0
2517,150,-150.0
2518,139,-139.0
2519,140,-140.0
2520,141,-141.0
2521,200,-200.0
2522,134,-134.0
2523,137,-137.0
2524,149,-149.0
2525,91,-91.0
2526,200,-200.0
2527,140,-140.0
2528,143,-143.0
2529,147,-147.0
2530,141,-141.0
2531,138,-138.0
2532,111,-111.0
2533,139,-139.0
2534,88,-88.0
2535,137,-137.0
2536,137,-137.0
2537,137,-137.0
2538,94,-94.0
2539,145,-145.0
2540,85,-85.0
2541,92,-92.0
2542,147,-147.0
2543,140,-140.0
2544,142,-142.0
2545,146,-146.0
2546,197,-197.0
2547,137,-137.0
2548,165,-165.0
2549,111,-111.0
2550,99,-99.0
2551,108,-108.0
2552,163,-163.0
2553,162,-162.0
2554,141,-141.0
2555,142,-142.0
2556,106,-106.0
2557,85,-85.0
2558,149,-149.0
2559,166,-166.0
2560,110,-110.0
2561,93,-93.0
2562,86,-86.0
2563,153,-153.0
2564,142,-142.0
2565,97,-97.0
2566,156,-156.0
2567,136,-136.0
2568,141,-141.0
2569,85,-85.0
2570,92,-92.0
2571,200,-200.0
2572,107,-107.0
2573,140,-140.0
2574,96,-96.0
2575,146,-146.0
2576,90,-90.0
2577,147,-147.0
2578,90,-90.0
2579,140,-140.0
2580,100,-100.0
2581,141,-141.0
2582,143,-143.0
2583,146,-146.0
2584,151,-151.0
2585,92,-92.0
2586,155,-155.0
2587,156,-156.0
2588,87,-87.0
2589,150,-150.0
2590,141,-141.0
2591,96,-96.0
2592,87,-87.0
2593,174,-174.0
2594,158,-158.0
2595,102,-102.0
2596,142,-142.0
2597,146,-146.0
2598,151,-151.0
2599,95,-95.0
2600,101,-101.0
2601,89,-89.0
2602,160,-160.0
2603,148,-148.0
2604,163,-163.0
2605,92,-92.0
2606,87,-87.0
2607,176,-176.0
2608,153,-153.0
2609,155,-155.0
2610,89,-89.0
2611,147,-147.0
2612,86,-86.0
2613,101,-101.0
2614,87,-87.0
2615,157,-157.0
2616,200,-200.0
2617,159,-159.0
2618,90,-90.0
2619,137,-137.0
2620,171,-171.0
2621,145,-145.0
2622,166,-166.0
2623,102,-102.0
2624,174,-174.0
2625,158,-158.0
2626,149,-149.0
2627,154,-154.0
2628,157,-157.0
2629,171,-171.0
2630,154,-154.0
2631,160,-160.0
2632,180,-180.0
2633,181,-181.0
2634,86,-86.0
2635,150,-150.0
2636,154,-154.0
2637,145,-145.0
2638,142,-142.0
2639,170,-170.0
2640,160,-160.0
2641,158,-158.0
2642,88,-88.0
2643,200,-200.0
2644,157,-157.0
2645,200,-200.0
2646,149,-149.0
2647,147,-147.0
2648,147,-147.0
2649,190,-190.0
2650,90,-90.0
2651,143,-143.0
2652,148,-148.0
2653,99,-99.0
2654,94,-94.0
2655,155,-155.0
2656,155,-155.0
2657,175,-175.0
2658,151,-151.0
2659,158,-158.0
2660,200,-200.0
2661,200,-200.0
2662,158,-158.0
2663,90,-90.0
2664,96,-96.0
2665,199,-199.0
2666,153,-153.0
2667,147,-147.0
2668,162,-162.0
2669,200,-200.0
2670,147,-147.0
2671,155,-155.0
2672,164,-164.0
2673,159,-159.0
2674,155,-155.0
2675,109,-109.0
2676,200,-200.0
2677,89,-89.0
2678,150,-150.0
2679,149,-149.0
2680,146,-146.0
2681,94,-94.0
2682,148,-148.0
2683,151,-151.0
2684,144,-144.0
2685,148,-148.0
2686,160,-160.0
2687,158,-158.0
2688,92,-92.0
2689,94,-94.0
2690,88,-88.0
2691,145,-145.0
2692,181,-181.0
2693,150,-150.0
2694,149,-149.0
2695,148,-148.0
2696,87,-87.0
2697,200,-200.0
2698,169,-169.0
2699,179,-179.0
2700,155,-155.0
2701,149,-149.0
2702,144,-144.0
2703,158,-158.0
2704,146,-146.0
2705,97,-97.0
2706,84,-84.0
2707,166,-166.0
2708,176,-176.0
2709,92,-92.0
2710,91,-91.0
2711,200,-200.0
2712,93,-93.0
2713,146,-146.0
2714,146,-146.0
2715,86,-86.0
2716,155,-155.0
2717,153,-153.0
2718,86,-86.0
2719,146,-146.0
2720,147,-147.0
2721,155,-155.0
2722,158,-158.0
2723,161,-161.0
2724,200,-200.0
2725,90,-90.0
2726,98,-98.0
2727,147,-147.0
2728,86,-86.0
2729,146,-146.0
2730,86,-86.0
2731,157,-157.0
2732,157,-157.0
2733,92,-92.0
2734,156,-156.0
2735,165,-165.0
2736,200,-200.0
2737,164,-164.0
2738,95,-95.0
2739,170,-170.0
2740,150,-150.0
2741,170,-170.0
2742,152,-152.0
2743,167,-167.0
2744,102,-102.0
2745,151,-151.0
2746,155,-155.0
2747,151,-151.0
2748,151,-151.0
2749,169,-169.0
2750,161,-161.0
2751,151,-151.0
2752,155,-155.0
2753,150,-150.0
2754,153,-153.0
2755,159,-159.0
2756,105,-105.0
2757,152,-152.0
2758,150,-150.0
2759,102,-102.0
2760,158,-158.0
2761,91,-91.0
2762,98,-98.0
2763,144,-144.0
2764,147,-147.0
2765,107,-107.0
2766,147,-147.0
2767,107,-107.0
2768,156,-156.0
2769,145,-145.0
2770,143,-143.0
2771,151,-151.0
2772,147,-147.0
2773,159,-159.0
2774,88,-88.0
2775,147,-147.0
2776,148,-148.0
2777,144,-144.0
2778,148,-148.0
2779,143,-143.0
2780,148,-148.0
2781,156,-156.0
2782,151,-151.0
2783,156,-156.0
2784,146,-146.0
2785,143,-143.0
2786,143,-143.0
2787,164,-164.0
2788,84,-84.0
2789,97,-97.0
2790,100,-100.0
2791,200,-200.0
2792,148,-148.0
2793,170,-170.0
2794,91,-91.0
2795,171,-171.0
2796,117,-117.0
2797,95,-95.0
2798,138,-138.0
2799,149,-149.0
2800,158,-158.0
2801,98,-98.0
2802,143,-143.0
2803,151,-151.0
2804,145,-145.0
2805,83,-83.0
2806,160,-160.0
2807,123,-123.0
2808,192,-192.0
2809,86,-86.0
2810,152,-152.0
2811,179,-179.0
2812,155,-155.0
2813,141,-141.0
2814,147,-147.0
2815,147,-147.0
2816,184,-184.0
2817,165,-165.0
2818,149,-149.0
2819,145,-145.0
2820,85,-85.0
2821,135,-135.0
2822,97,-97.0
2823,184,-184.0
2824,150,-150.0
2825,104,-104.0
2826,154,-154.0
2827,104,-104.0
2828,161,-161.0
2829,188,-188.0
2830,151,-151.0
2831,142,-142.0
2832,143,-143.0
2833,162,-162.0
2834,150,-150.0
2835,87,-87.0
2836,163,-163.0
2837,109,-109.0
2838,149,-149.0
2839,176,-176.0
2840,149,-149.0
2841,148,-148.0
2842,84,-84.0
2843,151,-151.0
2844,172,-172.0
2845,91,-91.0
2846,150,-150.0
2847,99,-99.0
2848,143,-143.0
2849,104,-104.0
2850,117,-117.0
2851,158,-158.0
2852,155,-155.0
2853,151,-151.0
2854,122,-122.0
2855,88,-88.0
2856,150,-150.0
2857,112,-112.0
2858,174,-174.0
2859,90,-90.0
2860,145,-145.0
2861,154,-154.0
2862,150,-150.0
2863,152,-152.0
2864,157,-157.0
2865,184,-184.0
2866,99,-99.0
2867,100,-100.0
2868,155,-155.0
2869,147,-147.0
2870,92,-92.0
2871,141,-141.0
2872,179,-179.0
2873,147,-147.0
2874,87,-87.0
2875,175,-175.0
2876,89,-89.0
2877,152,-152.0
2878,186,-186.0
2879,183,-183.0
2880,86,-86.0
2881,149,-149.0
2882,170,-170.0
2883,162,-162.0
2884,200,-200.0
2885,153,-153.0
2886,149,-149.0
2887,156,-156.0
2888,147,-147.0
2889,152,-152.0
2890,200,-200.0
2891,143,-143.0
2892,107,-107.0
2893,143,-143.0
2894,152,-152.0
2895,92,-92.0
2896,145,-145.0
2897,170,-170.0
2898,146,-146.0
2899,86,-86.0
2900,150,-150.0
2901,103,-103.0
2902,159,-159.0
2903,95,-95.0
2904,153,-153.0
2905,149,-149.0
2906,87,-87.0
2907,90,-90.0
2908,151,-151.0
2909,85,-85.0
2910,143,-143.0
2911,151,-151.0
2912,102,-102.0
2913,152,-152.0
2914,89,-89.0
2915,160,-160.0
2916,147,-147.0
2917,93,-93.0
2918,150,-150.0
2919,89,-89.0
2920,143,-143.0
2921,151,-151.0
2922,144,-144.0
2923,152,-152.0
2924,148,-148.0
2925,91,-91.0
2926,148,-148.0
2927,149,-149.0
2928,150,-150.0
2929,146,-146.0
2930,101,-101.0
2931,153,-153.0
2932,147,-147.0
2933,145,-145.0
2934,101,-101.0
2935,94,-94.0
2936,162,-162.0
2937,148,-148.0
2938,112,-112.0
2939,150,-150.0
2940,158,-158.0
2941,105,-105.0
2942,93,-93.0
2943,145,-145.0
2944,140,-140.0
2945,91,-91.0
2946,147,-147.0
2947,142,-142.0
2948,143,-143.0
2949,158,-158.0
2950,94,-94.0
2951,155,-155.0
2952,144,-144.0
2953,164,-164.0
2954,96,-96.0
2955,94,-94.0
2956,173,-173.0
2957,142,-142.0
2958,146,-146.0
2959,96,-96.0
2960,147,-147.0
2961,158,-158.0
2962,97,-97.0
2963,147,-147.0
2964,89,-89.0
2965,142,-142.0
2966,143,-143.0
2967,104,-104.0
2968,142,-142.0
2969,143,-143.0
2970,96,-96.0
2971,144,-144.0
2972,117,-117.0
2973,145,-145.0
2974,102,-102.0
2975,156,-156.0
2976,173,-173.0
2977,141,-141.0
2978,160,-160.0
2979,150,-150.0
2980,151,-151.0
2981,91,-91.0
2982,157,-157.0
2983,95,-95.0
2984,146,-146.0
2985,168,-168.0
2986,91,-91.0
2987,146,-146.0
2988,149,-149.0
2989,146,-146.0
2990,159,-159.0
2991,153,-153.0
2992,115,-115.0
2993,151,-151.0
2994,85,-85.0
2995,122,-122.0
2996,147,-147.0
2997,102,-102.0
2998,145,-145.0
2999,90,-90.0
3000,89,-89.0
3001,163,-163.0
3002,148,-148.0
3003,147,-147.0
3004,154,-154.0
3005,146,-146.0
3006,112,-112.0
3007,146,-146.0
3008,155,-155.0
3009,156,-156.0
3010,87,-87.0
3011,147,-147.0
3012,147,-147.0
3013,88,-88.0
3014,106,-106.0
3015,143,-143.0
3016,160,-160.0
3017,155,-155.0
3018,171,-171.0
3019,89,-89.0
3020,149,-149.0
3021,160,-160.0
3022,90,-90.0
3023,109,-109.0
3024,149,-149.0
3025,163,-163.0
3026,88,-88.0
3027,151,-151.0
3028,84,-84.0
3029,151,-151.0
3030,156,-156.0
3031,164,-164.0
3032,163,-163.0
3033,107,-107.0
3034,88,-88.0
3035,98,-98.0
3036,148,-148.0
3037,89,-89.0
3038,150,-150.0
3039,155,-155.0
3040,163,-163.0
3041,99,-99.0
3042,151,-151.0
3043,157,-157.0
3044,95,-95.0
3045,154,-154.0
3046,158,-158.0
3047,95,-95.0
3048,149,-149.0
3049,160,-160.0
3050,150,-150.0
3051,94,-94.0
3052,88,-88.0
3053,158,-158.0
3054,154,-154.0
3055,161,-161.0
3056,172,-172.0
3057,149,-149.0
3058,148,-148.0
3059,154,-154.0
3060,200,-200.0
3061,85,-85.0
3062,164,-164.0
3063,155,-155.0
3064,148,-148.0
3065,97,-97.0
3066,149,-149.0
3067,146,-146.0
3068,153,-153.0
3069,143,-143.0
3070,153,-153.0
3071,154,-154.0
3072,154,-154.0
3073,95,-95.0
3074,162,-162.0
3075,161,-161.0
3076,153,-153.0
3077,159,-159.0
3078,159,-159.0
3079,96,-96.0
3080,84,-84.0
3081,99,-99.0
3082,92,-92.0
3083,153,-153.0
3084,84,-84.0
3085,158,-158.0
3086,91,-91.0
3087,151,-151.0
3088,97,-97.0
3089,151,-151.0
3090,154,-154.0
3091,161,-161.0
3092,100,-100.0
3093,157,-157.0
3094,88,-88.0
3095,160,-160.0
3096,151,-151.0
3097,155,-155.0
3098,171,-171.0
3099,153,-153.0
3100,160,-160.0
3101,152,-152.0
3102,156,-156.0
3103,152,-152.0
3104,99,-99.0
3105,156,-156.0
3106,91,-91.0
3107,145,-145.0
3108,152,-152.0
3109,168,-168.0
3110,158,-158.0
3111,84,-84.0
3112,155,-155.0
3113,153,-153.0
3114,149,-149.0
3115,98,-98.0
3116,149,-149.0
3117,153,-153.0
3118,112,-112.0
3119,144,-144.0
3120,158,-158.0
3121,198,-198.0
3122,98,-98.0
3123,96,-96.0
3124,142,-142.0
3125,148,-148.0
3126,85,-85.0
3127,153,-153.0
3128,147,-147.0
3129,101,-101.0
3130,98,-98.0
3131,92,-92.0
3132,88,-88.0
3133,143,-143.0
3134,86,-86.0
3135,149,-149.0
3136,91,-91.0
3137,87,-87.0
3138,88,-88.0
3139,167,-167.0
3140,151,-151.0
3141,105,-105.0
3142,145,-145.0
3143,154,-154.0
3144,166,-166.0
3145,143,-143.0
3146,141,-141.0
3147,91,-91.0
3148,86,-86.0
3149,92,-92.0
3150,138,-138.0
3151,96,-96.0
3152,88,-88.0
3153,157,-157.0
3154,107,-107.0
3155,147,-147.0
3156,148,-148.0
3157,149,-149.0
3158,145,-145.0
3159,103,-103.0
3160,99,-99.0
3161,92,-92.0
3162,92,-92.0
3163,93,-93.0
3164,146,-146.0
3165,134,-134.0
3166,154,-154.0
3167,138,-138.0
3168,142,-142.0
3169,167,-167.0
3170,134,-134.0
3171,106,-106.0
3172,149,-149.0
3173,158,-158.0
3174,163,-163.0
3175,123,-123.0
3176,97,-97.0
3177,99,-99.0
3178,109,-109.0
3179,151,-151.0
3180,143,-143.0
3181,145,-145.0
3182,158,-158.0
3183,165,-165.0
3184,152,-152.0
3185,170,-170.0
3186,154,-154.0
3187,153,-153.0
3188,133,-133.0
3189,144,-144.0
3190,102,-102.0
3191,153,-153.0
3192,134,-134.0
3193,96,-96.0
3194,94,-94.0
3195,141,-141.0
3196,144,-144.0
3197,135,-135.0
3198,95,-95.0
3199,150,-150.0
3200,165,-165.0
3201,93,-93.0
3202,142,-142.0
3203,141,-141.0
3204,142,-142.0
3205,144,-144.0
3206,96,-96.0
3207,158,-158.0
3208,175,-175.0
3209,100,-100.0
3210,89,-89.0
3211,107,-107.0
3212,145,-145.0
3213,90,-90.0
3214,96,-96.0
3215,150,-150.0
3216,200,-200.0
3217,151,-151.0
3218,200,-200.0
3219,138,-138.0
3220,99,-99.0
3221,143,-143.0
3222,87,-87.0
3223,145,-145.0
3224,152,-152.0
3225,91,-91.0
3226,147,-147.0
3227,146,-146.0
3228,162,-162.0
3229,153,-153.0
3230,157,-157.0
3231,104,-104.0
3232,150,-150.0
3233,157,-157.0
3234,156,-156.0
3235,96,-96.0
3236,87,-87.0
3237,86,-86.0
3238,89,-89.0
3239,100,-100.0
3240,84,-84.0
3241,159,-159.0
3242,98,-98.0
3243,92,-92.0
3244,93,-93.0
3245,86,-86.0
3246,86,-86.0
3247,156,-156.0
3248,200,-200.0
3249,200,-200.0
3250,147,-147.0
3251,167,-167.0
3252,159,-159.0
3253,160,-160.0
3254,156,-156.0
3255,150,-150.0
3256,160,-160.0
3257,91,-91.0
3258,155,-155.0
3259,153,-153.0
3260,155,-155.0
3261,200,-200.0
3262,171,-171.0
3263,200,-200.0
3264,200,-200.0
3265,198,-198.0
3266,200,-200.0
3267,200,-200.0
3268,160,-160.0
3269,200,-200.0
3270,200,-200.0
3271,173,-173.0
3272,173,-173.0
3273,187,-187.0
3274,200,-200.0
3275,200,-200.0
3276,200,-200.0
3277,170,-170.0
3278,110,-110.0
3279,90,-90.0
3280,114,-114.0
3281,187,-187.0
3282,163,-163.0
3283,161,-161.0
3284,199,-199.0
3285,160,-160.0
3286,191,-191.0
3287,160,-160.0
3288,165,-165.0
3289,89,-89.0
3290,169,-169.0
3291,176,-176.0
3292,200,-200.0
3293,155,-155.0
3294,115,-115.0
3295,173,-173.0
3296,180,-180.0
3297,90,-90.0
3298,170,-170.0
3299,91,-91.0
3300,156,-156.0
3301,164,-164.0
3302,181,-181.0
3303,150,-150.0
3304,164,-164.0
3305,156,-156.0
3306,147,-147.0
3307,145,-145.0
3308,163,-163.0
3309,159,-159.0
3310,87,-87.0
3311,165,-165.0
3312,100,-100.0
3313,93,-93.0
3314,94,-94.0
3315,173,-173.0
3316,165,-165.0
3317,171,-171.0
3318,87,-87.0
3319,186,-186.0
3320,200,-200.0
3321,101,-101.0
3322,200,-200.0
3323,200,-200.0
3324,104,-104.0
3325,200,-200.0
3326,200,-200.0
3327,200,-200.0
3328,173,-173.0
3329,132,-132.0
3330,200,-200.0
3331,200,-200.0
3332,95,-95.0
3333,200,-200.0
3334,185,-185.0
3335,112,-112.0
3336,160,-160.0
3337,200,-200.0
3338,168,-168.0
3339,180,-180.0
3340,176,-176.0
3341,97,-97.0
3342,86,-86.0
3343,160,-160.0
3344,159,-159.0
3345,200,-200.0
3346,134,-134.0
3347,163,-163.0
3348,93,-93.0
3349,179,-179.0
3350,155,-155.0
3351,151,-151.0
3352,88,-88.0
3353,200,-200.0
3354,161,-161.0
3355,148,-148.0
3356,140,-140.0
3357,200,-200.0
3358,85,-85.0
3359,143,-143.0
3360,138,-138.0
3361,144,-144.0
3362,125,-125.0
3363,197,-197.0
3364,158,-158.0
3365,151,-151.0
3366,145,-145.0
3367,194,-194.0
3368,170,-170.0
3369,149,-149.0
3370,158,-158.0
3371,158,-158.0
3372,155,-155.0
3373,162,-162.0
3374,153,-153.0
3375,145,-145.0
3376,84,-84.0
3377,84,-84.0
3378,148,-148.0
3379,164,-164.0
3380,154,-154.0
3381,145,-145.0
3382,114,-114.0
3383,120,-120.0
3384,96,-96.0
3385,179,-179.0
3386,163,-163.0
3387,151,-151.0
3388,195,-195.0
3389,102,-102.0
3390,93,-93.0
3391,155,-155.0
3392,159,-159.0
3393,173,-173.0
3394,143,-143.0
3395,95,-95.0
3396,102,-102.0
3397,200,-200.0
3398,111,-111.0
3399,165,-165.0
3400,100,-100.0
3401,86,-86.0
3402,94,-94.0
3403,118,-118.0
3404,92,-92.0
3405,145,-145.0
3406,171,-171.0
3407,185,-185.0
3408,153,-153.0
3409,167,-167.0
3410,85,-85.0
3411,94,-94.0
3412,88,-88.0
3413,156,-156.0
3414,153,-153.0
3415,155,-155.0
3416,149,-149.0
3417,168,-168.0
3418,187,-187.0
3419,163,-163.0
3420,181,-181.0
3421,150,-150.0
3422,148,-148.0
3423,181,-181.0
3424,91,-91.0
3425,89,-89.0
3426,93,-93.0
3427,173,-173.0
3428,189,-189.0
3429,154,-154.0
3430,161,-161.0
3431,84,-84.0
3432,88,-88.0
3433,152,-152.0
3434,170,-170.0
3435,97,-97.0
3436,111,-111.0
3437,158,-158.0
3438,171,-171.0
3439,166,-166.0
3440,91,-91.0
3441,142,-142.0
3442,150,-150.0
3443,176,-176.0
3444,110,-110.0
3445,90,-90.0
3446,174,-174.0
3447,198,-198.0
3448,177,-177.0
3449,98,-98.0
3450,200,-200.0
3451,157,-157.0
3452,89,-89.0
3453,88,-88.0
3454,92,-92.0
3455,99,-99.0
3456,185,-185.0
3457,153,-153.0
3458,149,-149.0
3459,155,-155.0
3460,89,-89.0
3461,152,-152.0
3462,146,-146.0
3463,106,-106.0
3464,88,-88.0
3465,144,-144.0
3466,103,-103.0
3467,149,-149.0
3468,89,-89.0
3469,164,-164.0
3470,151,-151.0
3471,98,-98.0
3472,150,-150.0
3473,108,-108.0
3474,152,-152.0
3475,110,-110.0
3476,117,-117.0
3477,118,-118.0
3478,92,-92.0
3479,111,-111.0
3480,114,-114.0
3481,154,-154.0
3482,157,-157.0
3483,95,-95.0
3484,155,-155.0
3485,149,-149.0
3486,159,-159.0
3487,117,-117.0
3488,156,-156.0
3489,153,-153.0
3490,129,-129.0
3491,173,-173.0
3492,88,-88.0
3493,90,-90.0
3494,200,-200.0
3495,120,-120.0
3496,161,-161.0
3497,174,-174.0
3498,164,-164.0
3499,115,-115.0
3500,198,-198.0
3501,153,-153.0
3502,158,-158.0
3503,98,-98.0
3504,156,-156.0
3505,192,-192.0
3506,169,-169.0
3507,88,-88.0
3508,200,-200.0
3509,116,-116.0
3510,151,-151.0
3511,169,-169.0
3512,150,-150.0
3513,133,-133.0
3514,108,-108.0
3515,109,-109.0
3516,160,-160.0
3517,104,-104.0
3518,150,-150.0
3519,179,-179.0
3520,85,-85.0
3521,92,-92.0
3522,97,-97.0
3523,146,-146.0
3524,84,-84.0
3525,150,-150.0
3526,149,-149.0
3527,148,-148.0
3528,96,-96.0
3529,90,-90.0
3530,174,-174.0
3531,144,-144.0
3532,95,-95.0
3533,91,-91.0
3534,192,-192.0
3535,148,-148.0
3536,147,-147.0
3537,163,-163.0
3538,102,-102.0
3539,104,-104.0
3540,175,-175.0
3541,149,-149.0
3542,104,-104.0
3543,145,-145.0
3544,149,-149.0
3545,97,-97.0
3546,166,-166.0
3547,144,-144.0
3548,141,-141.0
3549,98,-98.0
3550,86,-86.0
3551,151,-151.0
3552,100,-100.0
3553,157,-157.0
3554,89,-89.0
3555,88,-88.0
3556,147,-147.0
3557,175,-175.0
3558,149,-149.0
3559,173,-173.0
3560,149,-149.0
3561,124,-124.0
3562,142,-142.0
3563,86,-86.0
3564,145,-145.0
3565,144,-144.0
3566,92,-92.0
3567,122,-122.0
3568,85,-85.0
3569,96,-96.0
3570,200,-200.0
3571,98,-98.0
3572,181,-181.0
3573,90,-90.0
3574,144,-144.0
3575,84,-84.0
3576,98,-98.0
3577,169,-169.0
3578,148,-148.0
3579,175,-175.0
3580,85,-85.0
3581,131,-131.0
3582,200,-200.0
3583,146,-146.0
3584,86,-86.0
3585,177,-177.0
3586,143,-143.0
3587,194,-194.0
3588,85,-85.0
3589,84,-84.0
3590,92,-92.0
3591,99,-99.0
3592,170,-170.0
3593,161,-161.0
3594,170,-170.0
3595,143,-143.0
3596,170,-170.0
3597,106,-106.0
3598,87,-87.0
3599,98,-98.0
3600,198,-198.0
3601,137,-137.0
3602,168,-168.0
3603,156,-156.0
3604,169,-169.0
3605,168,-168.0
3606,168,-168.0
3607,93,-93.0
3608,93,-93.0
3609,111,-111.0
3610,113,-113.0
3611,84,-84.0
3612,147,-147.0
3613,200,-200.0
3614,94,-94.0
3615,94,-94.0
3616,106,-106.0
3617,85,-85.0
3618,105,-105.0
3619,186,-186.0
3620,200,-200.0
3621,176,-176.0
3622,153,-153.0
3623,200,-200.0
3624,156,-156.0
3625,176,-176.0
3626,98,-98.0
3627,112,-112.0
3628,167,-167.0
3629,84,-84.0
3630,87,-87.0
3631,84,-84.0
3632,106,-106.0
3633,169,-169.0
3634,90,-90.0
3635,95,-95.0
3636,87,-87.0
3637,109,-109.0
3638,100,-100.0
3639,98,-98.0
3640,99,-99.0
3641,86,-86.0
3642,178,-178.0
3643,85,-85.0
3644,160,-160.0
3645,142,-142.0
3646,98,-98.0
3647,146,-146.0
3648,87,-87.0
3649,159,-159.0
3650,90,-90.0
3651,88,-88.0
3652,105,-105.0
3653,105,-105.0
3654,114,-114.0
3655,143,-143.0
3656,106,-106.0
3657,91,-91.0
3658,146,-146.0
3659,90,-90.0
3660,91,-91.0
3661,159,-159.0
3662,111,-111.0
3663,84,-84.0
3664,106,-106.0
3665,106,-106.0
3666,155,-155.0
3667,104,-104.0
3668,104,-104.0
3669,200,-200.0
3670,93,-93.0
3671,90,-90.0
3672,145,-145.0
3673,86,-86.0
3674,109,-109.0
3675,139,-139.0
3676,144,-144.0
3677,185,-185.0
3678,145,-145.0
3679,167,-167.0
3680,144,-144.0
3681,178,-178.0
3682,152,-152.0
3683,160,-160.0
3684,87,-87.0
3685,86,-86.0
3686,197,-197.0
3687,86,-86.0
3688,153,-153.0
3689,88,-88.0
3690,99,-99.0
3691,138,-138.0
3692,175,-175.0
3693,108,-108.0
3694,102,-102.0
3695,200,-200.0
3696,84,-84.0
3697,163,-163.0
3698,111,-111.0
3699,199,-199.0
3700,112,-112.0
3701,111,-111.0
3702,110,-110.0
3703,106,-106.0
3704,87,-87.0
3705,93,-93.0
3706,172,-172.0
3707,153,-153.0
3708,169,-169.0
3709,99,-99.0
3710,139,-139.0
3711,142,-142.0
3712,84,-84.0
3713,150,-150.0
3714,92,-92.0
3715,156,-156.0
3716,160,-160.0
3717,88,-88.0
3718,142,-142.0
3719,142,-142.0
3720,85,-85.0
3721,146,-146.0
3722,85,-85.0
3723,139,-139.0
3724,145,-145.0
3725,86,-86.0
3726,87,-87.0
3727,138,-138.0
3728,152,-152.0
3729,90,-90.0
3730,145,-145.0
3731,169,-169.0
3732,159,-159.0
3733,169,-169.0
3734,111,-111.0
3735,89,-89.0
3736,108,-108.0
3737,107,-107.0
3738,110,-110.0
3739,107,-107.0
3740,86,-86.0
3741,107,-107.0
3742,88,-88.0
3743,100,-100.0
3744,88,-88.0
3745,180,-180.0
3746,88,-88.0
3747,128,-128.0
3748,99,-99.0
3749,107,-107.0
3750,167,-167.0
3751,107,-107.0
3752,154,-154.0
3753,93,-93.0
3754,111,-111.0
3755,94,-94.0
3756,175,-175.0
3757,106,-106.0
3758,106,-106.0
3759,175,-175.0
3760,154,-154.0
3761,156,-156.0
3762,106,-106.0
3763,90,-90.0
3764,156,-156.0
3765,107,-107.0
3766,154,-154.0
3767,165,-165.0
3768,106,-106.0
3769,87,-87.0
3770,161,-161.0
3771,86,-86.0
3772,87,-87.0
3773,99,-99.0
3774,161,-161.0
3775,94,-94.0
3776,93,-93.0
3777,106,-106.0
3778,153,-153.0
3779,164,-164.0
3780,159,-159.0
3781,92,-92.0
3782,159,-159.0
3783,197,-197.0
3784,107,-107.0
3785,165,-165.0
3786,89,-89.0
3787,112,-112.0
3788,87,-87.0
3789,108,-108.0
3790,174,-174.0
3791,186,-186.0
3792,151,-151.0
3793,164,-164.0
3794,91,-91.0
3795,166,-166.0
3796,86,-86.0
3797,112,-112.0
3798,107,-107.0
3799,94,-94.0
3800,150,-150.0
3801,95,-95.0
3802,102,-102.0
3803,92,-92.0
3804,200,-200.0
3805,148,-148.0
3806,105,-105.0
3807,145,-145.0
3808,170,-170.0
3809,109,-109.0
3810,108,-108.0
3811,161,-161.0
3812,109,-109.0
3813,109,-109.0
3814,145,-145.0
3815,110,-110.0
3816,200,-200.0
3817,120,-120.0
3818,94,-94.0
3819,149,-149.0
3820,156,-156.0
3821,107,-107.0
3822,109,-109.0
3823,90,-90.0
3824,156,-156.0
3825,145,-145.0
3826,148,-148.0
3827,150,-150.0
3828,154,-154.0
3829,144,-144.0
3830,150,-150.0
3831,188,-188.0
3832,156,-156.0
3833,157,-157.0
3834,155,-155.0
3835,106,-106.0
3836,150,-150.0
3837,102,-102.0
3838,90,-90.0
3839,183,-183.0
3840,88,-88.0
3841,110,-110.0
3842,163,-163.0
3843,107,-107.0
3844,107,-107.0
3845,110,-110.0
3846,173,-173.0
3847,166,-166.0
3848,105,-105.0
3849,107,-107.0
3850,111,-111.0
3851,96,-96.0
3852,106,-106.0
3853,108,-108.0
3854,92,-92.0
3855,171,-171.0
3856,100,-100.0
3857,165,-165.0
3858,109,-109.0
3859,98,-98.0
3860,160,-160.0
3861,88,-88.0
3862,163,-163.0
3863,93,-93.0
3864,109,-109.0
3865,87,-87.0
3866,111,-111.0
3867,90,-90.0
3868,112,-112.0
3869,108,-108.0
3870,161,-161.0
3871,103,-103.0
3872,160,-160.0
3873,110,-110.0
3874,118,-118.0
3875,161,-161.0
3876,112,-112.0
3877,110,-110.0
3878,166,-166.0
3879,112,-112.0
3880,109,-109.0
3881,109,-109.0
3882,84,-84.0
3883,96,-96.0
3884,111,-111.0
3885,114,-114.0
3886,159,-159.0
3887,109,-109.0
3888,118,-118.0
3889,109,-109.0
3890,167,-167.0
3891,100,-100.0
3892,113,-113.0
3893,148,-148.0
3894,100,-100.0
3895,113,-113.0
3896,111,-111.0
3897,153,-153.0
3898,119,-119.0
3899,112,-112.0
3900,199,-199.0
3901,200,-200.0
3902,160,-160.0
3903,106,-106.0
3904,108,-108.0
3905,161,-161.0
3906,107,-107.0
3907,105,-105.0
3908,108,-108.0
3909,133,-133.0
3910,87,-87.0
3911,105,-105.0
3912,116,-116.0
3913,115,-115.0
3914,115,-115.0
3915,111,-111.0
3916,180,-180.0
3917,155,-155.0
3918,113,-113.0
3919,108,-108.0
3920,110,-110.0
3921,200,-200.0
3922,200,-200.0
3923,117,-117.0
3924,105,-105.0
3925,145,-145.0
3926,156,-156.0
3927,152,-152.0
3928,121,-121.0
3929,195,-195.0
3930,144,-144.0
3931,143,-143.0
3932,180,-180.0
3933,143,-143.0
3934,188,-188.0
3935,152,-152.0
3936,164,-164.0
3937,152,-152.0
3938,161,-161.0
3939,151,-151.0
3940,200,-200.0
3941,154,-154.0
3942,200,-200.0
3943,172,-172.0
3944,167,-167.0
3945,200,-200.0
3946,200,-200.0
3947,200,-200.0
3948,200,-200.0
3949,200,-200.0
3950,200,-200.0
3951,200,-200.0
3952,200,-200.0
3953,200,-200.0
3954,200,-200.0
3955,200,-200.0
3956,200,-200.0
3957,200,-200.0
3958,200,-200.0
3959,200,-200.0
3960,200,-200.0
3961,200,-200.0
3962,200,-200.0
3963,200,-200.0
3964,200,-200.0
3965,200,-200.0
3966,200,-200.0
3967,200,-200.0
3968,200,-200.0
3969,200,-200.0
3970,200,-200.0
3971,200,-200.0
3972,166,-166.0
3973,163,-163.0
3974,160,-160.0
3975,153,-153.0
3976,160,-160.0
3977,200,-200.0
3978,153,-153.0
3979,155,-155.0
3980,146,-146.0
3981,146,-146.0
3982,200,-200.0
3983,151,-151.0
3984,200,-200.0
3985,147,-147.0
3986,157,-157.0
3987,138,-138.0
3988,148,-148.0
3989,156,-156.0
3990,200,-200.0
3991,154,-154.0
3992,153,-153.0
3993,157,-157.0
3994,146,-146.0
3995,155,-155.0
3996,200,-200.0
3997,157,-157.0
3998,196,-196.0
3999,118,-118.0
4000,184,-184.0
4001,114,-114.0
4002,171,-171.0
4003,165,-165.0
4004,164,-164.0
4005,129,-129.0
4006,116,-116.0
4007,164,-164.0
4008,117,-117.0
4009,166,-166.0
4010,114,-114.0
4011,154,-154.0
4012,94,-94.0
4013,180,-180.0
4014,117,-117.0
4015,117,-117.0
4016,153,-153.0
4017,112,-112.0
4018,135,-135.0
4019,200,-200.0
4020,115,-115.0
4021,120,-120.0
4022,113,-113.0
4023,117,-117.0
4024,92,-92.0
4025,103,-103.0
4026,91,-91.0
4027,174,-174.0
4028,117,-117.0
4029,111,-111.0
4030,156,-156.0
4031,182,-182.0
4032,131,-131.0
4033,180,-180.0
4034,121,-121.0
4035,122,-122.0
4036,126,-126.0
4037,171,-171.0
4038,113,-113.0
4039,104,-104.0
4040,108,-108.0
4041,85,-85.0
4042,109,-109.0
4043,118,-118.0
4044,123,-123.0
4045,120,-120.0
4046,95,-95.0
4047,120,-120.0
4048,165,-165.0
4049,146,-146.0
4050,150,-150.0
4051,111,-111.0
4052,112,-112.0
4053,126,-126.0
4054,170,-170.0
4055,164,-164.0
4056,176,-176.0
4057,159,-159.0
4058,120,-120.0
4059,138,-138.0
4060,147,-147.0
4061,88,-88.0
4062,89,-89.0
4063,93,-93.0
4064,123,-123.0
4065,99,-99.0
4066,95,-95.0
4067,170,-170.0
4068,152,-152.0
4069,164,-164.0
4070,88,-88.0
4071,174,-174.0
4072,108,-108.0
4073,105,-105.0
4074,148,-148.0
4075,120,-120.0
4076,115,-115.0
4077,181,-181.0
4078,189,-189.0
4079,89,-89.0
4080,173,-173.0
4081,158,-158.0
4082,86,-86.0
4083,146,-146.0
4084,87,-87.0
4085,180,-180.0
4086,166,-166.0
4087,123,-123.0
4088,87,-87.0
4089,166,-166.0
4090,156,-156.0
4091,110,-110.0
4092,96,-96.0
4093,87,-87.0
4094,168,-168.0
4095,162,-162.0
4096,113,-113.0
4097,90,-90.0
4098,175,-175.0
4099,110,-110.0
4100,108,-108.0
