episodes,steps,rewards
0,200,-200.0
1,200,-200.0
2,200,-200.0
3,200,-200.0
4,200,-200.0
5,200,-200.0
6,200,-200.0
7,200,-200.0
8,200,-200.0
9,200,-200.0
10,200,-200.0
11,200,-200.0
12,200,-200.0
13,200,-200.0
14,200,-200.0
15,200,-200.0
16,200,-200.0
17,200,-200.0
18,200,-200.0
19,200,-200.0
20,200,-200.0
21,200,-200.0
22,171,-171.0
23,200,-200.0
24,200,-200.0
25,200,-200.0
26,200,-200.0
27,200,-200.0
28,200,-200.0
29,200,-200.0
30,200,-200.0
31,200,-200.0
32,200,-200.0
33,200,-200.0
34,134,-134.0
35,200,-200.0
36,200,-200.0
37,200,-200.0
38,200,-200.0
39,200,-200.0
40,200,-200.0
41,200,-200.0
42,200,-200.0
43,200,-200.0
44,200,-200.0
45,200,-200.0
46,200,-200.0
47,200,-200.0
48,200,-200.0
49,200,-200.0
50,200,-200.0
51,200,-200.0
52,177,-177.0
53,192,-192.0
54,200,-200.0
55,200,-200.0
56,200,-200.0
57,200,-200.0
58,200,-200.0
59,154,-154.0
60,200,-200.0
61,194,-194.0
62,200,-200.0
63,200,-200.0
64,200,-200.0
65,200,-200.0
66,200,-200.0
67,200,-200.0
68,111,-111.0
69,200,-200.0
70,200,-200.0
71,200,-200.0
72,159,-159.0
73,200,-200.0
74,200,-200.0
75,200,-200.0
76,200,-200.0
77,200,-200.0
78,200,-200.0
79,200,-200.0
80,200,-200.0
81,200,-200.0
82,200,-200.0
83,200,-200.0
84,200,-200.0
85,200,-200.0
86,200,-200.0
87,200,-200.0
88,200,-200.0
89,155,-155.0
90,200,-200.0
91,146,-146.0
92,200,-200.0
93,146,-146.0
94,157,-157.0
95,200,-200.0
96,108,-108.0
97,167,-167.0
98,200,-200.0
99,200,-200.0
100,200,-200.0
101,87,-87.0
102,96,-96.0
103,149,-149.0
104,200,-200.0
105,139,-139.0
106,149,-149.0
107,200,-200.0
108,157,-157.0
109,200,-200.0
110,185,-185.0
111,170,-170.0
112,132,-132.0
113,200,-200.0
114,124,-124.0
115,200,-200.0
116,200,-200.0
117,200,-200.0
118,200,-200.0
119,200,-200.0
120,169,-169.0
121,87,-87.0
122,200,-200.0
123,113,-113.0
124,200,-200.0
125,142,-142.0
126,146,-146.0
127,200,-200.0
128,181,-181.0
129,173,-173.0
130,200,-200.0
131,91,-91.0
132,105,-105.0
133,110,-110.0
134,200,-200.0
135,200,-200.0
136,200,-200.0
137,106,-106.0
138,93,-93.0
139,97,-97.0
140,151,-151.0
141,147,-147.0
142,91,-91.0
143,85,-85.0
144,200,-200.0
145,111,-111.0
146,86,-86.0
147,200,-200.0
148,124,-124.0
149,109,-109.0
150,200,-200.0
151,86,-86.0
152,90,-90.0
153,200,-200.0
154,167,-167.0
155,183,-183.0
156,200,-200.0
157,200,-200.0
158,177,-177.0
159,159,-159.0
160,91,-91.0
161,144,-144.0
162,158,-158.0
163,200,-200.0
164,200,-200.0
165,166,-166.0
166,159,-159.0
167,200,-200.0
168,111,-111.0
169,154,-154.0
170,113,-113.0
171,173,-173.0
172,137,-137.0
173,173,-173.0
174,200,-200.0
175,164,-164.0
176,105,-105.0
177,166,-166.0
178,128,-128.0
179,94,-94.0
180,191,-191.0
181,174,-174.0
182,161,-161.0
183,177,-177.0
184,177,-177.0
185,171,-171.0
186,161,-161.0
187,97,-97.0
188,130,-130.0
189,163,-163.0
190,160,-160.0
191,164,-164.0
192,113,-113.0
193,200,-200.0
194,190,-190.0
195,124,-124.0
196,162,-162.0
197,129,-129.0
198,100,-100.0
199,182,-182.0
200,161,-161.0
201,116,-116.0
202,127,-127.0
203,122,-122.0
204,192,-192.0
205,188,-188.0
206,200,-200.0
207,193,-193.0
208,114,-114.0
209,156,-156.0
210,117,-117.0
211,199,-199.0
212,176,-176.0
213,171,-171.0
214,85,-85.0
215,122,-122.0
216,87,-87.0
217,164,-164.0
218,124,-124.0
219,143,-143.0
220,170,-170.0
221,177,-177.0
222,122,-122.0
223,179,-179.0
224,166,-166.0
225,171,-171.0
226,101,-101.0
227,88,-88.0
228,122,-122.0
229,173,-173.0
230,115,-115.0
231,165,-165.0
232,109,-109.0
233,108,-108.0
234,175,-175.0
235,131,-131.0
236,157,-157.0
237,154,-154.0
238,89,-89.0
239,168,-168.0
240,121,-121.0
241,200,-200.0
242,172,-172.0
243,90,-90.0
244,118,-118.0
245,142,-142.0
246,165,-165.0
247,167,-167.0
248,174,-174.0
249,170,-170.0
250,173,-173.0
