episodes,steps,rewards
0,200,-200.0
1,200,-200.0
2,200,-200.0
3,200,-200.0
4,200,-200.0
5,200,-200.0
6,200,-200.0
7,200,-200.0
8,200,-200.0
9,200,-200.0
10,200,-200.0
11,200,-200.0
12,200,-200.0
13,200,-200.0
14,200,-200.0
15,200,-200.0
16,200,-200.0
17,200,-200.0
18,200,-200.0
19,200,-200.0
20,200,-200.0
21,200,-200.0
22,200,-200.0
23,200,-200.0
24,200,-200.0
25,200,-200.0
26,200,-200.0
27,200,-200.0
28,200,-200.0
29,156,-156.0
30,145,-145.0
31,168,-168.0
32,200,-200.0
33,200,-200.0
34,200,-200.0
35,200,-200.0
36,200,-200.0
37,177,-177.0
38,200,-200.0
39,200,-200.0
40,200,-200.0
41,114,-114.0
42,200,-200.0
43,200,-200.0
44,200,-200.0
45,200,-200.0
46,200,-200.0
47,200,-200.0
48,165,-165.0
49,200,-200.0
50,200,-200.0
51,200,-200.0
52,200,-200.0
53,200,-200.0
54,122,-122.0
55,181,-181.0
56,119,-119.0
57,154,-154.0
58,200,-200.0
59,200,-200.0
60,125,-125.0
61,200,-200.0
62,120,-120.0
63,114,-114.0
64,153,-153.0
65,190,-190.0
66,185,-185.0
67,155,-155.0
68,188,-188.0
69,128,-128.0
70,132,-132.0
71,185,-185.0
72,121,-121.0
73,137,-137.0
74,106,-106.0
75,188,-188.0
76,183,-183.0
77,97,-97.0
78,145,-145.0
79,135,-135.0
80,161,-161.0
81,149,-149.0
82,200,-200.0
83,93,-93.0
84,171,-171.0
85,158,-158.0
86,112,-112.0
87,145,-145.0
88,145,-145.0
89,176,-176.0
90,176,-176.0
91,91,-91.0
92,142,-142.0
93,194,-194.0
94,111,-111.0
95,85,-85.0
96,187,-187.0
97,154,-154.0
98,88,-88.0
99,173,-173.0
100,112,-112.0
101,168,-168.0
102,146,-146.0
103,95,-95.0
104,141,-141.0
105,114,-114.0
106,109,-109.0
107,148,-148.0
108,164,-164.0
109,111,-111.0
110,121,-121.0
111,130,-130.0
112,187,-187.0
113,159,-159.0
114,159,-159.0
115,184,-184.0
116,105,-105.0
117,98,-98.0
118,145,-145.0
119,122,-122.0
120,180,-180.0
121,93,-93.0
122,129,-129.0
123,140,-140.0
124,115,-115.0
125,164,-164.0
126,91,-91.0
127,110,-110.0
128,103,-103.0
129,94,-94.0
130,200,-200.0
131,108,-108.0
132,109,-109.0
133,155,-155.0
134,98,-98.0
135,99,-99.0
136,173,-173.0
137,90,-90.0
138,145,-145.0
139,175,-175.0
140,192,-192.0
141,122,-122.0
142,109,-109.0
143,162,-162.0
144,166,-166.0
145,154,-154.0
146,159,-159.0
147,112,-112.0
148,176,-176.0
149,107,-107.0
150,108,-108.0
151,97,-97.0
152,116,-116.0
153,146,-146.0
154,151,-151.0
155,105,-105.0
156,124,-124.0
157,130,-130.0
158,200,-200.0
159,85,-85.0
160,194,-194.0
161,86,-86.0
162,149,-149.0
163,148,-148.0
164,125,-125.0
165,117,-117.0
166,151,-151.0
167,143,-143.0
168,159,-159.0
169,143,-143.0
170,182,-182.0
171,111,-111.0
172,145,-145.0
173,156,-156.0
174,104,-104.0
175,142,-142.0
176,154,-154.0
177,150,-150.0
178,159,-159.0
179,200,-200.0
180,88,-88.0
181,164,-164.0
182,167,-167.0
183,146,-146.0
184,162,-162.0
185,200,-200.0
186,200,-200.0
187,161,-161.0
188,182,-182.0
189,153,-153.0
190,200,-200.0
191,200,-200.0
192,147,-147.0
193,200,-200.0
194,200,-200.0
195,153,-153.0
196,200,-200.0
197,145,-145.0
198,118,-118.0
199,94,-94.0
200,177,-177.0
201,142,-142.0
202,161,-161.0
203,140,-140.0
204,160,-160.0
205,141,-141.0
206,104,-104.0
207,98,-98.0
208,151,-151.0
209,92,-92.0
210,161,-161.0
211,152,-152.0
212,155,-155.0
213,179,-179.0
214,156,-156.0
215,149,-149.0
216,159,-159.0
217,146,-146.0
218,114,-114.0
219,108,-108.0
220,137,-137.0
221,153,-153.0
222,159,-159.0
223,85,-85.0
224,85,-85.0
225,90,-90.0
226,140,-140.0
227,191,-191.0
228,151,-151.0
229,155,-155.0
230,138,-138.0
231,155,-155.0
232,115,-115.0
233,86,-86.0
234,115,-115.0
235,161,-161.0
236,84,-84.0
237,147,-147.0
238,92,-92.0
239,132,-132.0
240,131,-131.0
241,154,-154.0
242,160,-160.0
243,174,-174.0
244,111,-111.0
245,145,-145.0
246,149,-149.0
247,171,-171.0
248,92,-92.0
249,90,-90.0
250,92,-92.0
251,153,-153.0
252,154,-154.0
253,188,-188.0
254,150,-150.0
255,111,-111.0
256,85,-85.0
257,146,-146.0
258,91,-91.0
259,100,-100.0
260,116,-116.0
261,191,-191.0
262,114,-114.0
263,200,-200.0
264,88,-88.0
265,119,-119.0
266,182,-182.0
267,89,-89.0
268,159,-159.0
269,85,-85.0
270,147,-147.0
271,134,-134.0
272,143,-143.0
273,85,-85.0
274,86,-86.0
275,146,-146.0
276,142,-142.0
277,89,-89.0
278,154,-154.0
279,143,-143.0
280,93,-93.0
281,155,-155.0
282,149,-149.0
283,161,-161.0
284,200,-200.0
285,100,-100.0
286,134,-134.0
287,93,-93.0
288,151,-151.0
289,143,-143.0
290,103,-103.0
291,152,-152.0
292,200,-200.0
293,156,-156.0
294,135,-135.0
295,142,-142.0
296,142,-142.0
297,148,-148.0
298,171,-171.0
299,146,-146.0
300,142,-142.0
301,145,-145.0
302,125,-125.0
303,155,-155.0
304,142,-142.0
305,144,-144.0
306,145,-145.0
307,160,-160.0
308,156,-156.0
309,97,-97.0
310,152,-152.0
311,152,-152.0
312,178,-178.0
313,141,-141.0
314,87,-87.0
315,150,-150.0
316,143,-143.0
317,147,-147.0
318,160,-160.0
319,172,-172.0
320,161,-161.0
321,87,-87.0
322,152,-152.0
323,160,-160.0
324,150,-150.0
325,156,-156.0
326,141,-141.0
327,106,-106.0
328,145,-145.0
329,147,-147.0
330,113,-113.0
331,146,-146.0
332,158,-158.0
333,146,-146.0
334,152,-152.0
335,138,-138.0
336,91,-91.0
337,149,-149.0
338,166,-166.0
339,145,-145.0
340,147,-147.0
341,147,-147.0
342,148,-148.0
343,89,-89.0
344,152,-152.0
345,148,-148.0
346,143,-143.0
347,149,-149.0
348,86,-86.0
349,147,-147.0
350,158,-158.0
351,90,-90.0
352,161,-161.0
353,151,-151.0
354,90,-90.0
355,121,-121.0
356,149,-149.0
357,147,-147.0
358,117,-117.0
359,151,-151.0
360,157,-157.0
361,91,-91.0
362,152,-152.0
363,90,-90.0
364,171,-171.0
365,89,-89.0
366,143,-143.0
367,141,-141.0
368,200,-200.0
369,163,-163.0
370,146,-146.0
371,147,-147.0
372,105,-105.0
373,147,-147.0
374,145,-145.0
375,128,-128.0
376,111,-111.0
377,169,-169.0
378,149,-149.0
379,148,-148.0
380,90,-90.0
381,154,-154.0
382,90,-90.0
383,112,-112.0
384,97,-97.0
385,96,-96.0
386,145,-145.0
387,140,-140.0
388,153,-153.0
389,92,-92.0
390,143,-143.0
391,132,-132.0
392,147,-147.0
393,138,-138.0
394,145,-145.0
395,88,-88.0
396,154,-154.0
397,92,-92.0
398,149,-149.0
399,109,-109.0
400,93,-93.0
401,90,-90.0
402,144,-144.0
403,85,-85.0
404,153,-153.0
405,134,-134.0
406,140,-140.0
407,116,-116.0
408,145,-145.0
409,103,-103.0
410,93,-93.0
411,153,-153.0
412,157,-157.0
413,137,-137.0
414,139,-139.0
415,98,-98.0
416,86,-86.0
417,85,-85.0
418,149,-149.0
419,149,-149.0
420,140,-140.0
421,152,-152.0
422,86,-86.0
423,90,-90.0
424,150,-150.0
425,91,-91.0
426,99,-99.0
427,85,-85.0
428,100,-100.0
429,151,-151.0
430,89,-89.0
431,93,-93.0
432,152,-152.0
433,91,-91.0
434,142,-142.0
435,90,-90.0
436,142,-142.0
437,86,-86.0
438,86,-86.0
439,137,-137.0
440,156,-156.0
441,144,-144.0
442,165,-165.0
443,147,-147.0
444,86,-86.0
445,84,-84.0
446,160,-160.0
447,147,-147.0
448,143,-143.0
449,110,-110.0
450,135,-135.0
451,154,-154.0
452,147,-147.0
453,146,-146.0
454,98,-98.0
455,85,-85.0
456,137,-137.0
457,138,-138.0
458,85,-85.0
459,140,-140.0
460,103,-103.0
461,141,-141.0
462,147,-147.0
463,89,-89.0
464,149,-149.0
465,86,-86.0
466,145,-145.0
467,88,-88.0
468,87,-87.0
469,88,-88.0
470,152,-152.0
471,144,-144.0
472,99,-99.0
473,141,-141.0
474,134,-134.0
475,200,-200.0
476,144,-144.0
477,86,-86.0
478,145,-145.0
479,160,-160.0
480,140,-140.0
481,86,-86.0
482,98,-98.0
483,142,-142.0
484,149,-149.0
485,142,-142.0
486,84,-84.0
487,200,-200.0
488,99,-99.0
489,99,-99.0
490,150,-150.0
491,163,-163.0
492,141,-141.0
493,142,-142.0
494,144,-144.0
495,146,-146.0
496,144,-144.0
497,139,-139.0
498,149,-149.0
499,90,-90.0
500,193,-193.0
501,150,-150.0
502,142,-142.0
503,146,-146.0
504,147,-147.0
505,152,-152.0
506,91,-91.0
507,84,-84.0
508,100,-100.0
509,143,-143.0
510,174,-174.0
511,137,-137.0
512,142,-142.0
513,142,-142.0
514,178,-178.0
515,165,-165.0
516,153,-153.0
517,147,-147.0
518,150,-150.0
519,100,-100.0
520,141,-141.0
521,200,-200.0
522,200,-200.0
523,153,-153.0
524,145,-145.0
525,144,-144.0
526,121,-121.0
527,144,-144.0
528,187,-187.0
529,147,-147.0
530,145,-145.0
531,143,-143.0
532,144,-144.0
533,187,-187.0
534,142,-142.0
535,154,-154.0
536,192,-192.0
537,200,-200.0
538,159,-159.0
539,134,-134.0
540,152,-152.0
541,138,-138.0
542,182,-182.0
543,150,-150.0
544,200,-200.0
545,146,-146.0
546,154,-154.0
547,88,-88.0
548,158,-158.0
549,152,-152.0
550,84,-84.0
551,188,-188.0
552,88,-88.0
553,187,-187.0
554,156,-156.0
555,98,-98.0
556,179,-179.0
557,146,-146.0
558,171,-171.0
559,200,-200.0
560,193,-193.0
561,200,-200.0
562,93,-93.0
563,91,-91.0
564,137,-137.0
565,138,-138.0
566,88,-88.0
567,97,-97.0
568,189,-189.0
569,111,-111.0
570,191,-191.0
571,104,-104.0
572,165,-165.0
573,126,-126.0
574,174,-174.0
575,165,-165.0
576,146,-146.0
577,102,-102.0
578,162,-162.0
579,152,-152.0
580,123,-123.0
581,93,-93.0
582,89,-89.0
583,89,-89.0
584,191,-191.0
585,92,-92.0
586,200,-200.0
587,132,-132.0
588,98,-98.0
589,156,-156.0
590,122,-122.0
591,151,-151.0
592,158,-158.0
593,183,-183.0
594,141,-141.0
595,186,-186.0
596,154,-154.0
597,144,-144.0
598,156,-156.0
599,162,-162.0
600,185,-185.0
601,200,-200.0
602,92,-92.0
603,200,-200.0
604,200,-200.0
605,98,-98.0
606,111,-111.0
607,149,-149.0
608,145,-145.0
609,143,-143.0
610,143,-143.0
611,178,-178.0
612,150,-150.0
613,89,-89.0
614,149,-149.0
615,149,-149.0
616,105,-105.0
617,168,-168.0
618,155,-155.0
619,152,-152.0
620,200,-200.0
621,159,-159.0
622,171,-171.0
623,114,-114.0
624,133,-133.0
625,145,-145.0
626,182,-182.0
627,149,-149.0
628,162,-162.0
629,200,-200.0
630,152,-152.0
631,149,-149.0
632,167,-167.0
633,160,-160.0
634,164,-164.0
635,108,-108.0
636,172,-172.0
637,185,-185.0
638,154,-154.0
639,94,-94.0
640,166,-166.0
641,159,-159.0
642,147,-147.0
643,152,-152.0
644,92,-92.0
645,90,-90.0
646,104,-104.0
647,156,-156.0
648,91,-91.0
649,113,-113.0
650,148,-148.0
651,147,-147.0
652,188,-188.0
653,152,-152.0
654,88,-88.0
655,93,-93.0
656,88,-88.0
657,184,-184.0
658,97,-97.0
659,186,-186.0
660,155,-155.0
661,148,-148.0
662,156,-156.0
663,170,-170.0
664,150,-150.0
665,157,-157.0
666,186,-186.0
667,143,-143.0
668,95,-95.0
669,154,-154.0
670,149,-149.0
671,148,-148.0
672,152,-152.0
673,146,-146.0
674,200,-200.0
675,157,-157.0
676,144,-144.0
677,94,-94.0
678,161,-161.0
679,151,-151.0
680,142,-142.0
681,86,-86.0
682,97,-97.0
683,147,-147.0
684,96,-96.0
685,147,-147.0
686,157,-157.0
687,97,-97.0
688,90,-90.0
689,198,-198.0
690,154,-154.0
691,149,-149.0
692,146,-146.0
693,110,-110.0
694,93,-93.0
695,152,-152.0
696,148,-148.0
697,97,-97.0
698,151,-151.0
699,87,-87.0
700,96,-96.0
701,93,-93.0
702,150,-150.0
703,145,-145.0
704,150,-150.0
705,95,-95.0
706,164,-164.0
707,159,-159.0
708,157,-157.0
709,120,-120.0
710,193,-193.0
711,178,-178.0
712,94,-94.0
713,169,-169.0
714,88,-88.0
715,150,-150.0
716,129,-129.0
717,104,-104.0
718,149,-149.0
719,162,-162.0
720,152,-152.0
721,152,-152.0
722,147,-147.0
723,190,-190.0
724,154,-154.0
725,153,-153.0
726,142,-142.0
727,145,-145.0
728,148,-148.0
729,96,-96.0
730,180,-180.0
731,92,-92.0
732,186,-186.0
733,181,-181.0
734,174,-174.0
735,150,-150.0
736,200,-200.0
737,113,-113.0
738,100,-100.0
739,89,-89.0
740,143,-143.0
741,99,-99.0
742,104,-104.0
743,148,-148.0
744,149,-149.0
745,141,-141.0
746,88,-88.0
747,114,-114.0
748,90,-90.0
749,92,-92.0
750,90,-90.0
