episodes,steps,rewards
0,200,-200.0
1,200,-200.0
2,200,-200.0
3,200,-200.0
4,200,-200.0
5,200,-200.0
6,200,-200.0
7,200,-200.0
8,200,-200.0
9,200,-200.0
10,200,-200.0
11,200,-200.0
12,200,-200.0
13,200,-200.0
14,200,-200.0
15,200,-200.0
16,200,-200.0
17,200,-200.0
18,200,-200.0
19,200,-200.0
20,200,-200.0
21,200,-200.0
22,200,-200.0
23,200,-200.0
24,200,-200.0
25,200,-200.0
26,200,-200.0
27,200,-200.0
28,200,-200.0
29,200,-200.0
30,200,-200.0
31,200,-200.0
32,200,-200.0
33,200,-200.0
34,200,-200.0
35,200,-200.0
36,200,-200.0
37,200,-200.0
38,200,-200.0
39,200,-200.0
40,200,-200.0
41,200,-200.0
42,200,-200.0
43,200,-200.0
44,200,-200.0
45,200,-200.0
46,200,-200.0
47,200,-200.0
48,200,-200.0
49,200,-200.0
50,200,-200.0
51,200,-200.0
52,200,-200.0
53,200,-200.0
54,200,-200.0
55,200,-200.0
56,200,-200.0
57,200,-200.0
58,200,-200.0
59,200,-200.0
60,200,-200.0
61,200,-200.0
62,200,-200.0
63,200,-200.0
64,200,-200.0
65,200,-200.0
66,200,-200.0
67,200,-200.0
68,200,-200.0
69,200,-200.0
70,200,-200.0
71,200,-200.0
72,200,-200.0
73,200,-200.0
74,200,-200.0
75,200,-200.0
76,200,-200.0
77,200,-200.0
78,200,-200.0
79,200,-200.0
80,200,-200.0
81,200,-200.0
82,200,-200.0
83,200,-200.0
84,200,-200.0
85,200,-200.0
86,200,-200.0
87,200,-200.0
88,200,-200.0
89,200,-200.0
90,200,-200.0
91,200,-200.0
92,200,-200.0
93,200,-200.0
94,200,-200.0
95,200,-200.0
96,200,-200.0
97,200,-200.0
98,200,-200.0
99,200,-200.0
100,200,-200.0
101,200,-200.0
102,200,-200.0
103,200,-200.0
104,200,-200.0
105,200,-200.0
106,200,-200.0
107,200,-200.0
108,200,-200.0
109,200,-200.0
110,200,-200.0
111,200,-200.0
112,200,-200.0
113,200,-200.0
114,200,-200.0
115,200,-200.0
116,200,-200.0
117,200,-200.0
118,200,-200.0
119,200,-200.0
120,200,-200.0
121,200,-200.0
122,200,-200.0
123,200,-200.0
124,200,-200.0
125,200,-200.0
126,200,-200.0
127,200,-200.0
128,200,-200.0
129,200,-200.0
130,200,-200.0
131,200,-200.0
132,200,-200.0
133,200,-200.0
134,200,-200.0
135,200,-200.0
136,200,-200.0
137,200,-200.0
138,200,-200.0
139,200,-200.0
140,200,-200.0
141,200,-200.0
142,200,-200.0
143,200,-200.0
144,200,-200.0
145,200,-200.0
146,200,-200.0
147,200,-200.0
148,200,-200.0
149,200,-200.0
150,200,-200.0
151,200,-200.0
152,149,-149.0
153,200,-200.0
154,200,-200.0
155,200,-200.0
156,200,-200.0
157,200,-200.0
158,200,-200.0
159,200,-200.0
160,200,-200.0
161,200,-200.0
162,200,-200.0
163,200,-200.0
164,200,-200.0
165,200,-200.0
166,200,-200.0
167,200,-200.0
168,185,-185.0
169,200,-200.0
170,200,-200.0
171,200,-200.0
172,200,-200.0
173,200,-200.0
174,200,-200.0
175,200,-200.0
176,200,-200.0
177,200,-200.0
178,200,-200.0
179,200,-200.0
180,200,-200.0
181,200,-200.0
182,198,-198.0
183,172,-172.0
184,200,-200.0
185,117,-117.0
186,126,-126.0
187,200,-200.0
188,200,-200.0
189,200,-200.0
190,190,-190.0
191,200,-200.0
192,200,-200.0
193,181,-181.0
194,127,-127.0
195,200,-200.0
196,200,-200.0
197,178,-178.0
198,200,-200.0
199,150,-150.0
200,200,-200.0
201,200,-200.0
202,127,-127.0
203,200,-200.0
204,200,-200.0
205,200,-200.0
206,182,-182.0
207,193,-193.0
208,147,-147.0
209,200,-200.0
210,178,-178.0
211,200,-200.0
212,200,-200.0
213,200,-200.0
214,200,-200.0
215,200,-200.0
216,180,-180.0
217,200,-200.0
218,200,-200.0
219,200,-200.0
220,114,-114.0
221,200,-200.0
222,200,-200.0
223,169,-169.0
224,200,-200.0
225,200,-200.0
226,200,-200.0
227,198,-198.0
228,172,-172.0
229,166,-166.0
230,174,-174.0
231,163,-163.0
232,199,-199.0
233,200,-200.0
234,200,-200.0
235,200,-200.0
236,186,-186.0
237,185,-185.0
238,200,-200.0
239,200,-200.0
240,200,-200.0
241,163,-163.0
242,166,-166.0
243,152,-152.0
244,193,-193.0
245,183,-183.0
246,187,-187.0
247,183,-183.0
248,170,-170.0
249,151,-151.0
250,156,-156.0
251,156,-156.0
252,155,-155.0
253,190,-190.0
254,181,-181.0
255,199,-199.0
256,184,-184.0
257,175,-175.0
258,200,-200.0
259,171,-171.0
260,200,-200.0
261,194,-194.0
262,200,-200.0
263,192,-192.0
264,168,-168.0
265,195,-195.0
266,150,-150.0
267,193,-193.0
268,200,-200.0
269,199,-199.0
270,160,-160.0
271,158,-158.0
272,200,-200.0
273,149,-149.0
274,200,-200.0
275,200,-200.0
276,112,-112.0
277,163,-163.0
278,198,-198.0
279,200,-200.0
280,167,-167.0
281,175,-175.0
282,183,-183.0
283,169,-169.0
284,156,-156.0
285,118,-118.0
286,176,-176.0
287,161,-161.0
288,200,-200.0
289,114,-114.0
290,110,-110.0
291,114,-114.0
292,115,-115.0
293,111,-111.0
294,120,-120.0
295,116,-116.0
296,117,-117.0
297,166,-166.0
298,159,-159.0
299,145,-145.0
300,124,-124.0
301,108,-108.0
302,111,-111.0
303,108,-108.0
304,136,-136.0
305,89,-89.0
306,142,-142.0
307,127,-127.0
308,141,-141.0
309,109,-109.0
310,158,-158.0
311,107,-107.0
312,144,-144.0
313,143,-143.0
314,162,-162.0
315,170,-170.0
316,140,-140.0
317,156,-156.0
318,143,-143.0
319,160,-160.0
320,169,-169.0
321,169,-169.0
322,162,-162.0
323,137,-137.0
324,156,-156.0
325,169,-169.0
326,149,-149.0
327,170,-170.0
328,148,-148.0
329,158,-158.0
330,156,-156.0
331,152,-152.0
332,152,-152.0
333,145,-145.0
334,129,-129.0
335,149,-149.0
336,151,-151.0
337,155,-155.0
338,168,-168.0
339,189,-189.0
340,194,-194.0
341,146,-146.0
342,162,-162.0
343,130,-130.0
344,164,-164.0
345,133,-133.0
346,152,-152.0
347,146,-146.0
348,166,-166.0
349,139,-139.0
350,197,-197.0
351,200,-200.0
352,185,-185.0
353,200,-200.0
354,158,-158.0
355,189,-189.0
356,189,-189.0
357,98,-98.0
358,164,-164.0
359,160,-160.0
360,200,-200.0
361,97,-97.0
362,157,-157.0
363,165,-165.0
364,150,-150.0
365,200,-200.0
366,166,-166.0
367,158,-158.0
368,200,-200.0
369,153,-153.0
370,171,-171.0
371,177,-177.0
372,195,-195.0
373,167,-167.0
374,168,-168.0
375,165,-165.0
376,165,-165.0
377,194,-194.0
378,160,-160.0
379,102,-102.0
380,190,-190.0
381,165,-165.0
382,180,-180.0
383,157,-157.0
384,177,-177.0
385,179,-179.0
386,177,-177.0
387,162,-162.0
388,167,-167.0
389,168,-168.0
390,161,-161.0
391,188,-188.0
392,160,-160.0
393,173,-173.0
394,176,-176.0
395,179,-179.0
396,169,-169.0
397,169,-169.0
398,200,-200.0
399,155,-155.0
400,165,-165.0
401,169,-169.0
402,178,-178.0
403,152,-152.0
404,158,-158.0
405,154,-154.0
406,163,-163.0
407,159,-159.0
408,162,-162.0
409,159,-159.0
410,159,-159.0
411,179,-179.0
412,189,-189.0
413,167,-167.0
414,159,-159.0
415,172,-172.0
416,200,-200.0
417,179,-179.0
418,184,-184.0
419,200,-200.0
420,142,-142.0
421,168,-168.0
422,158,-158.0
423,155,-155.0
424,149,-149.0
425,176,-176.0
426,170,-170.0
427,169,-169.0
428,164,-164.0
429,157,-157.0
430,173,-173.0
431,151,-151.0
432,153,-153.0
433,169,-169.0
434,171,-171.0
435,135,-135.0
436,171,-171.0
437,157,-157.0
438,100,-100.0
439,148,-148.0
440,174,-174.0
441,168,-168.0
442,153,-153.0
443,177,-177.0
444,143,-143.0
445,161,-161.0
446,162,-162.0
447,177,-177.0
448,157,-157.0
449,123,-123.0
450,159,-159.0
451,154,-154.0
452,155,-155.0
453,167,-167.0
454,154,-154.0
455,154,-154.0
456,144,-144.0
457,153,-153.0
458,125,-125.0
459,157,-157.0
460,92,-92.0
461,141,-141.0
462,135,-135.0
463,94,-94.0
464,140,-140.0
465,147,-147.0
466,144,-144.0
467,155,-155.0
468,139,-139.0
469,113,-113.0
470,159,-159.0
471,155,-155.0
472,143,-143.0
473,146,-146.0
474,170,-170.0
475,141,-141.0
476,141,-141.0
477,139,-139.0
478,173,-173.0
479,163,-163.0
480,167,-167.0
481,185,-185.0
482,162,-162.0
483,163,-163.0
484,166,-166.0
485,140,-140.0
486,157,-157.0
487,156,-156.0
488,136,-136.0
489,170,-170.0
490,164,-164.0
491,200,-200.0
492,172,-172.0
493,167,-167.0
494,150,-150.0
495,146,-146.0
496,157,-157.0
497,180,-180.0
498,172,-172.0
499,172,-172.0
500,164,-164.0
501,156,-156.0
502,136,-136.0
503,146,-146.0
504,142,-142.0
505,124,-124.0
506,157,-157.0
507,165,-165.0
508,159,-159.0
509,159,-159.0
510,165,-165.0
511,174,-174.0
512,150,-150.0
513,156,-156.0
514,138,-138.0
515,148,-148.0
516,200,-200.0
517,154,-154.0
518,148,-148.0
519,142,-142.0
520,159,-159.0
521,200,-200.0
522,138,-138.0
523,137,-137.0
524,173,-173.0
525,156,-156.0
526,176,-176.0
527,144,-144.0
528,164,-164.0
529,163,-163.0
530,159,-159.0
531,150,-150.0
532,152,-152.0
533,151,-151.0
534,161,-161.0
535,173,-173.0
536,166,-166.0
537,170,-170.0
538,148,-148.0
539,148,-148.0
540,151,-151.0
541,139,-139.0
542,153,-153.0
543,157,-157.0
544,170,-170.0
545,174,-174.0
546,181,-181.0
547,169,-169.0
548,200,-200.0
549,171,-171.0
550,167,-167.0
551,143,-143.0
552,148,-148.0
553,164,-164.0
554,155,-155.0
555,140,-140.0
556,155,-155.0
557,165,-165.0
558,117,-117.0
559,130,-130.0
560,142,-142.0
561,169,-169.0
562,126,-126.0
563,154,-154.0
564,131,-131.0
565,175,-175.0
566,200,-200.0
567,162,-162.0
568,121,-121.0
569,200,-200.0
570,160,-160.0
571,200,-200.0
572,171,-171.0
573,148,-148.0
574,158,-158.0
575,162,-162.0
576,156,-156.0
577,157,-157.0
578,179,-179.0
579,142,-142.0
580,164,-164.0
581,143,-143.0
582,179,-179.0
583,200,-200.0
584,200,-200.0
585,156,-156.0
586,162,-162.0
587,158,-158.0
588,167,-167.0
589,157,-157.0
590,200,-200.0
591,186,-186.0
592,164,-164.0
593,179,-179.0
594,155,-155.0
595,155,-155.0
596,170,-170.0
597,146,-146.0
598,161,-161.0
599,149,-149.0
600,170,-170.0
601,143,-143.0
602,141,-141.0
603,156,-156.0
604,140,-140.0
605,152,-152.0
606,136,-136.0
607,139,-139.0
608,135,-135.0
609,148,-148.0
610,143,-143.0
611,171,-171.0
612,147,-147.0
613,148,-148.0
614,162,-162.0
615,146,-146.0
616,141,-141.0
617,154,-154.0
618,157,-157.0
619,174,-174.0
620,157,-157.0
621,164,-164.0
622,166,-166.0
623,148,-148.0
624,143,-143.0
625,164,-164.0
626,200,-200.0
627,149,-149.0
628,149,-149.0
629,156,-156.0
630,179,-179.0
631,150,-150.0
632,172,-172.0
633,138,-138.0
634,151,-151.0
635,145,-145.0
636,200,-200.0
637,158,-158.0
638,150,-150.0
639,159,-159.0
640,174,-174.0
641,158,-158.0
642,174,-174.0
643,150,-150.0
644,200,-200.0
645,172,-172.0
646,163,-163.0
647,158,-158.0
648,175,-175.0
649,188,-188.0
650,200,-200.0
651,168,-168.0
652,172,-172.0
653,200,-200.0
654,156,-156.0
655,147,-147.0
656,150,-150.0
657,156,-156.0
658,152,-152.0
659,153,-153.0
660,196,-196.0
661,155,-155.0
662,161,-161.0
663,151,-151.0
664,176,-176.0
665,151,-151.0
666,152,-152.0
667,156,-156.0
668,141,-141.0
669,153,-153.0
670,147,-147.0
671,146,-146.0
672,155,-155.0
673,114,-114.0
674,160,-160.0
675,134,-134.0
676,200,-200.0
677,118,-118.0
678,115,-115.0
679,160,-160.0
680,155,-155.0
681,127,-127.0
682,136,-136.0
683,118,-118.0
684,148,-148.0
685,146,-146.0
686,157,-157.0
687,116,-116.0
688,154,-154.0
689,120,-120.0
690,157,-157.0
691,155,-155.0
692,153,-153.0
693,166,-166.0
694,200,-200.0
695,117,-117.0
696,128,-128.0
697,118,-118.0
698,122,-122.0
699,119,-119.0
700,120,-120.0
701,182,-182.0
702,200,-200.0
703,130,-130.0
704,200,-200.0
705,200,-200.0
706,172,-172.0
707,173,-173.0
708,154,-154.0
709,162,-162.0
710,166,-166.0
711,161,-161.0
712,164,-164.0
713,146,-146.0
714,153,-153.0
715,177,-177.0
716,162,-162.0
717,167,-167.0
718,165,-165.0
719,154,-154.0
720,151,-151.0
721,146,-146.0
722,144,-144.0
723,141,-141.0
724,145,-145.0
725,156,-156.0
726,155,-155.0
727,200,-200.0
728,161,-161.0
729,165,-165.0
730,200,-200.0
731,200,-200.0
732,200,-200.0
733,169,-169.0
734,168,-168.0
735,172,-172.0
736,164,-164.0
737,175,-175.0
738,142,-142.0
739,156,-156.0
740,162,-162.0
741,161,-161.0
742,165,-165.0
743,159,-159.0
744,163,-163.0
745,151,-151.0
746,157,-157.0
747,155,-155.0
748,159,-159.0
749,146,-146.0
750,156,-156.0
751,171,-171.0
752,200,-200.0
753,167,-167.0
754,156,-156.0
755,175,-175.0
756,161,-161.0
757,173,-173.0
758,168,-168.0
759,177,-177.0
760,174,-174.0
761,200,-200.0
762,174,-174.0
763,200,-200.0
764,200,-200.0
765,200,-200.0
766,186,-186.0
767,200,-200.0
768,100,-100.0
769,167,-167.0
770,103,-103.0
771,200,-200.0
772,174,-174.0
773,200,-200.0
774,107,-107.0
775,183,-183.0
776,169,-169.0
777,200,-200.0
778,200,-200.0
779,169,-169.0
780,200,-200.0
781,156,-156.0
782,165,-165.0
783,108,-108.0
784,164,-164.0
785,99,-99.0
786,172,-172.0
787,200,-200.0
788,200,-200.0
789,195,-195.0
790,191,-191.0
791,200,-200.0
792,168,-168.0
793,165,-165.0
794,159,-159.0
795,154,-154.0
796,171,-171.0
797,200,-200.0
798,137,-137.0
799,102,-102.0
800,93,-93.0
801,199,-199.0
802,158,-158.0
803,171,-171.0
804,163,-163.0
805,140,-140.0
806,122,-122.0
807,161,-161.0
808,154,-154.0
809,161,-161.0
810,158,-158.0
811,169,-169.0
812,156,-156.0
813,172,-172.0
814,157,-157.0
815,155,-155.0
816,168,-168.0
817,163,-163.0
818,161,-161.0
819,160,-160.0
820,159,-159.0
821,175,-175.0
822,158,-158.0
823,162,-162.0
824,159,-159.0
825,147,-147.0
826,153,-153.0
827,162,-162.0
828,151,-151.0
829,147,-147.0
830,151,-151.0
831,157,-157.0
832,172,-172.0
833,149,-149.0
834,200,-200.0
835,155,-155.0
836,160,-160.0
837,163,-163.0
838,200,-200.0
839,200,-200.0
840,200,-200.0
841,200,-200.0
842,141,-141.0
843,140,-140.0
844,200,-200.0
845,200,-200.0
846,200,-200.0
847,200,-200.0
848,134,-134.0
849,200,-200.0
850,134,-134.0
851,200,-200.0
852,131,-131.0
853,142,-142.0
854,142,-142.0
855,124,-124.0
856,126,-126.0
857,117,-117.0
858,121,-121.0
859,200,-200.0
860,126,-126.0
861,170,-170.0
862,123,-123.0
863,126,-126.0
864,133,-133.0
865,167,-167.0
866,200,-200.0
867,119,-119.0
868,127,-127.0
869,145,-145.0
870,132,-132.0
871,135,-135.0
872,149,-149.0
873,200,-200.0
874,126,-126.0
875,129,-129.0
876,124,-124.0
877,128,-128.0
878,200,-200.0
879,200,-200.0
880,127,-127.0
881,128,-128.0
882,200,-200.0
883,143,-143.0
884,140,-140.0
885,200,-200.0
886,200,-200.0
887,200,-200.0
888,200,-200.0
889,200,-200.0
890,200,-200.0
891,200,-200.0
892,200,-200.0
893,128,-128.0
894,129,-129.0
895,200,-200.0
896,121,-121.0
897,146,-146.0
898,131,-131.0
899,200,-200.0
900,145,-145.0
