episodes,steps,rewards
0,122,-186.5811443675763
1,64,-77.06773355836287
2,97,-127.3466422398916
3,107,-276.5849564942323
4,112,-16.26725209094255
5,82,-114.70342106937629
6,64,-57.39864345272262
7,97,-357.2954487241749
8,129,-352.0683667448915
9,80,-139.92544286532842
10,114,-323.90521365353914
11,126,-286.1883694217886
12,101,-222.7235045742965
13,122,-419.5965460210132
14,150,-98.3932658475264
15,1000,2.092279652586323
16,564,-358.3378429574882
17,1000,-220.89669031169979
18,1000,-108.63125620353748
19,1000,-82.46670615703458
20,1000,-144.25572510585542
21,1000,-130.1164442911711
22,118,-133.35715671632983
23,173,-204.7354444741335
24,278,-111.85901439861227
25,119,-158.03344711898896
26,130,-71.38903338132246
27,170,-136.5006446093672
28,1000,-58.40433294577467
29,1000,-75.39021391295508
30,1000,-178.03594749673672
31,1000,-138.59573537088548
32,1000,-131.67913313307895
33,1000,-126.60769472434713
34,69,-91.14662978569332
35,410,-137.83563638255458
36,1000,-126.84266762635073
37,730,-307.5118718654418
38,628,-77.21658190987463
39,1000,-5.0330373253649086
40,316,-108.95832004077907
41,1000,-112.88451032208572
42,1000,-124.57501545313598
43,1000,-155.1855048865933
44,733,-327.41988324754163
45,134,-140.72493760235415
46,1000,-96.55418373489852
47,301,216.7012772413991
48,1000,-141.43556324154895
49,829,-247.01238601749756
50,1000,-73.72284767133793
51,1000,13.99554965669165
52,1000,-27.311364616566546
53,580,-214.14391312006896
54,1000,-25.755284802368326
55,1000,-1.6862039508784845
56,71,-176.34746749564061
57,1000,-22.588982205227186
58,887,-370.3345557353508
59,1000,-5.248686577885101
60,1000,-33.52768267963279
61,1000,-36.59440743027323
62,1000,-62.22036443142491
63,1000,-57.90759552507284
64,1000,-108.31813668463221
65,1000,-9.299931398151381
66,1000,6.994485486760408
67,1000,-17.774885815126126
68,1000,-13.620265764291375
69,1000,-121.77993504976023
70,1000,-68.34928409727142
71,1000,-64.73995317105323
72,293,-273.2692589237268
73,1000,-9.490100353226794
74,1000,-8.229148595785915
75,397,-206.3311919269209
76,1000,-11.636738429625053
77,1000,-26.99388395124977
78,1000,-35.65459760001799
79,1000,52.91041568319552
80,154,-34.75990895758838
81,82,-120.30624335792709
82,76,-65.52721971943967
83,68,-48.85657690820163
84,1000,-51.96317376572735
85,1000,-153.52613403601117
86,1000,-94.17597751914377
87,1000,-20.004386937652857
88,1000,-49.911291395455606
89,1000,-54.620639990807334
90,1000,-7.760454956010723
91,1000,-104.36675162038964
92,1000,12.80347452213286
93,1000,-78.3188199215053
94,1000,-43.19405907420886
95,1000,-9.855161828133982
96,560,191.66883138179338
97,745,146.95219864428404
98,497,-228.46296171378305
99,450,-30.76538460161234
100,1000,34.526979031363624
101,831,153.18203382188358
102,1000,-83.94295984100415
103,1000,-122.35617316479636
104,1000,-24.82158692777303
105,1000,14.281515543895503
106,1000,60.92692403970989
107,1000,48.435039185802765
108,1000,-27.137204470958864
109,707,144.467853056689
110,282,-105.03163859004232
111,1000,12.829645377054042
112,527,-297.6124585585908
113,1000,-44.3852514947831
114,1000,-17.658934508089956
115,1000,-96.12880978419386
116,1000,-59.8664888644053
117,1000,-96.4115656372921
118,834,106.91174344412002
119,527,215.49689949479313
120,742,159.45233790489021
121,362,190.23097991545518
122,1000,32.760958544995624
123,541,183.1462776395984
124,501,211.45797861463905
125,574,-231.22899492393097
126,477,223.3420163237144
127,291,286.6615830888225
128,269,210.10040580568025
129,817,109.96136798566367
130,584,192.96734364762625
131,1000,-4.395373659460797
132,1000,30.092036754272826
133,1000,-40.79250148474982
134,1000,-65.56647309419296
135,1000,-19.65178165764845
136,1000,-54.4549547054621
137,572,233.71379470127002
138,346,-119.02778263423104
139,614,214.3248074443212
140,1000,-66.41612240005635
141,1000,-70.06175010956979
142,762,137.12859548394562
143,569,226.99778520367985
144,341,-203.05910926270116
145,399,241.63274504176192
146,802,124.74787969613925
147,843,144.00566901686517
148,457,262.31583826493295
149,273,-170.67643689236994
150,1000,-86.00392969168236
151,589,153.84274704034635
152,1000,-77.34712606284113
153,1000,-83.31043731708615
154,910,127.971124976627
155,422,213.0768878221184
156,457,250.88625138229375
157,681,178.44875410926937
158,303,264.68294909235453
159,845,107.73811409218196
160,347,253.23733509806607
161,1000,-51.355033147718935
162,390,259.4152103270099
163,422,174.47248949820397
164,1000,-64.90416346767402
165,583,224.9674736587229
166,892,117.52971969338184
167,876,-156.94597176554396
168,271,217.62949219165864
169,445,188.11957580458497
170,1000,-30.12046136937585
171,424,203.85627253597028
172,1000,-104.07673159296394
173,528,242.01425903077052
174,276,275.25208824968695
175,431,260.31431998360733
176,439,263.770330727258
177,392,243.2185168458721
178,1000,-53.01773970335014
179,616,131.66589657980677
180,456,188.25428836320975
181,278,264.90205354344823
182,294,255.58523259498406
183,472,238.75107748823203
184,321,286.8023914432945
185,500,196.0667271658794
186,782,-228.56490331035945
187,404,221.72061641552614
188,330,250.6975448597485
189,544,226.71907956768172
190,306,227.69292062998426
191,470,250.53133541617763
192,258,250.7717419081507
193,1000,-36.88668194013055
194,487,178.86406751353593
195,540,230.9196789025812
196,664,169.31175626008206
197,491,216.33600468663485
198,614,190.3481519169726
199,1000,-119.58058167115769
200,389,236.97670091788822
201,466,231.27644287159643
202,476,-220.95756683502526
203,442,241.52746197425097
204,417,250.32917503939285
205,336,218.61045306457373
206,230,191.53944708130837
207,344,186.3584300112458
208,320,265.00095807848334
209,448,253.9405544424176
210,627,-145.16964472710674
211,408,-293.9173934074856
212,358,293.00094568615316
213,473,244.67787863729487
214,280,241.51282976122297
215,381,252.19840631940443
216,484,227.24780701485
217,488,6.810948767800696
218,520,213.41324691163823
219,455,224.9218694965826
220,272,217.79922824197433
221,271,268.00771122337846
222,504,203.7073597554792
223,231,266.7743675772208
224,361,258.4601271936058
225,334,252.7618961851952
226,343,236.74084147138782
227,530,218.1631189791821
228,354,240.70943638810328
229,378,247.95199252524972
230,292,282.6120967441144
231,97,-186.8898808673909
232,204,254.12359686930628
233,540,197.73085940721307
234,251,249.2023609106393
235,370,205.28510890089223
236,735,-217.29082776483946
237,246,274.93338580206284
238,367,261.93499299024563
239,519,-259.7003796378563
240,322,253.92891045665635
241,642,132.15862302308787
242,366,235.83771815204847
243,1000,-134.33866381069706
244,249,18.31091036176032
245,1000,-45.54567651455216
246,344,168.41873438317378
247,469,260.07805241222763
248,275,195.29226884961747
249,286,222.94486243311485
250,386,240.0777449306985
251,475,215.04981534813834
252,305,224.81244002784052
253,421,217.49265617047433
254,416,218.40266002852348
255,1000,111.8709050033546
256,292,248.95812081397858
257,358,251.9649103178896
258,357,265.09913942756884
259,316,194.31393162614017
260,572,209.6532838631664
261,396,261.0391828086585
262,476,252.30981994291932
263,292,209.37589377869838
264,291,248.83043251644415
265,314,212.05111491686787
266,530,206.57750677522355
267,874,149.19129366093287
268,525,175.15857667260576
269,1000,-64.50893827434922
270,320,208.55234830106076
271,255,236.13234923139032
272,399,210.9098147194557
273,471,247.71643995117537
274,386,208.74018920346236
275,361,235.81955312797365
276,335,252.73398645212208
277,598,212.98633751471434
278,292,225.097027821881
279,592,164.82743639228752
280,615,219.37889425429412
281,218,10.399077045884368
282,504,218.47895164467764
283,307,254.026335501159
284,284,263.4450700435025
285,374,223.98910867247614
286,433,287.46335105883804
287,329,217.18914679135082
288,1000,115.8573909663324
289,351,-4.646447156201944
290,875,160.22328664434093
291,341,232.9527685879319
292,251,257.9116824678186
293,904,120.41162061171946
294,322,219.81741720132763
295,312,156.29391159621048
296,394,255.90268587853598
297,584,156.2848439841918
298,255,263.67088366121754
299,320,238.8224482019724
300,308,291.6203536412777
