episodes,steps,rewards
0,200,-200.0
1,200,-200.0
2,200,-200.0
3,200,-200.0
4,200,-200.0
5,200,-200.0
6,200,-200.0
7,200,-200.0
8,200,-200.0
9,200,-200.0
10,200,-200.0
11,200,-200.0
12,200,-200.0
13,200,-200.0
14,200,-200.0
15,200,-200.0
16,200,-200.0
17,200,-200.0
18,200,-200.0
19,200,-200.0
20,200,-200.0
21,200,-200.0
22,200,-200.0
23,200,-200.0
24,200,-200.0
25,200,-200.0
26,200,-200.0
27,200,-200.0
28,200,-200.0
29,200,-200.0
30,200,-200.0
31,200,-200.0
32,200,-200.0
33,200,-200.0
34,200,-200.0
35,200,-200.0
36,200,-200.0
37,200,-200.0
38,200,-200.0
39,200,-200.0
40,200,-200.0
41,200,-200.0
42,200,-200.0
43,200,-200.0
44,200,-200.0
45,200,-200.0
46,200,-200.0
47,200,-200.0
48,200,-200.0
49,200,-200.0
50,200,-200.0
51,190,-190.0
52,200,-200.0
53,200,-200.0
54,200,-200.0
55,200,-200.0
56,200,-200.0
57,200,-200.0
58,200,-200.0
59,200,-200.0
60,200,-200.0
61,200,-200.0
62,200,-200.0
63,200,-200.0
64,200,-200.0
65,143,-143.0
66,200,-200.0
67,200,-200.0
68,200,-200.0
69,200,-200.0
70,200,-200.0
71,200,-200.0
72,200,-200.0
73,200,-200.0
74,200,-200.0
75,200,-200.0
76,200,-200.0
77,194,-194.0
78,200,-200.0
79,200,-200.0
80,200,-200.0
81,200,-200.0
82,200,-200.0
83,200,-200.0
84,200,-200.0
85,115,-115.0
86,200,-200.0
87,184,-184.0
88,200,-200.0
89,200,-200.0
90,200,-200.0
91,196,-196.0
92,200,-200.0
93,200,-200.0
94,200,-200.0
95,200,-200.0
96,176,-176.0
97,200,-200.0
98,200,-200.0
99,200,-200.0
100,200,-200.0
101,200,-200.0
102,200,-200.0
103,200,-200.0
104,200,-200.0
105,200,-200.0
106,124,-124.0
107,200,-200.0
108,200,-200.0
109,200,-200.0
110,177,-177.0
111,189,-189.0
112,200,-200.0
113,200,-200.0
114,200,-200.0
115,200,-200.0
116,200,-200.0
117,200,-200.0
118,200,-200.0
119,200,-200.0
120,200,-200.0
121,200,-200.0
122,200,-200.0
123,200,-200.0
124,200,-200.0
125,200,-200.0
126,200,-200.0
127,200,-200.0
128,200,-200.0
129,200,-200.0
130,200,-200.0
131,183,-183.0
132,200,-200.0
133,184,-184.0
134,200,-200.0
135,189,-189.0
136,135,-135.0
137,159,-159.0
138,200,-200.0
139,200,-200.0
140,200,-200.0
141,200,-200.0
142,200,-200.0
143,137,-137.0
144,200,-200.0
145,200,-200.0
146,200,-200.0
147,200,-200.0
148,200,-200.0
149,194,-194.0
150,200,-200.0
151,133,-133.0
152,135,-135.0
153,147,-147.0
154,200,-200.0
155,200,-200.0
156,200,-200.0
157,111,-111.0
158,89,-89.0
159,200,-200.0
160,132,-132.0
161,112,-112.0
162,158,-158.0
163,119,-119.0
164,155,-155.0
165,200,-200.0
166,152,-152.0
167,180,-180.0
168,88,-88.0
169,175,-175.0
170,199,-199.0
171,137,-137.0
172,160,-160.0
173,200,-200.0
174,129,-129.0
175,122,-122.0
176,200,-200.0
177,184,-184.0
178,145,-145.0
179,113,-113.0
180,107,-107.0
181,191,-191.0
182,186,-186.0
183,149,-149.0
184,146,-146.0
185,187,-187.0
186,200,-200.0
187,200,-200.0
188,93,-93.0
189,150,-150.0
190,200,-200.0
191,200,-200.0
192,200,-200.0
193,161,-161.0
194,90,-90.0
195,200,-200.0
196,200,-200.0
197,200,-200.0
198,200,-200.0
199,170,-170.0
200,90,-90.0
201,170,-170.0
202,180,-180.0
203,200,-200.0
204,173,-173.0
205,200,-200.0
206,200,-200.0
207,148,-148.0
208,111,-111.0
209,164,-164.0
210,200,-200.0
211,184,-184.0
212,200,-200.0
213,198,-198.0
214,200,-200.0
215,178,-178.0
216,200,-200.0
217,200,-200.0
218,119,-119.0
219,200,-200.0
220,200,-200.0
221,200,-200.0
222,193,-193.0
223,200,-200.0
224,200,-200.0
225,175,-175.0
226,182,-182.0
227,200,-200.0
228,180,-180.0
229,97,-97.0
230,127,-127.0
231,149,-149.0
232,174,-174.0
233,200,-200.0
234,200,-200.0
235,200,-200.0
236,200,-200.0
237,195,-195.0
238,200,-200.0
239,200,-200.0
240,200,-200.0
241,95,-95.0
242,99,-99.0
243,200,-200.0
244,200,-200.0
245,88,-88.0
246,151,-151.0
247,95,-95.0
248,200,-200.0
249,200,-200.0
250,108,-108.0
251,175,-175.0
252,191,-191.0
253,200,-200.0
254,192,-192.0
255,200,-200.0
256,200,-200.0
257,200,-200.0
258,136,-136.0
259,159,-159.0
260,200,-200.0
261,92,-92.0
262,200,-200.0
263,186,-186.0
264,200,-200.0
265,200,-200.0
266,162,-162.0
267,200,-200.0
268,183,-183.0
269,174,-174.0
270,86,-86.0
271,136,-136.0
272,200,-200.0
273,103,-103.0
274,165,-165.0
275,158,-158.0
276,182,-182.0
277,97,-97.0
278,129,-129.0
279,164,-164.0
280,89,-89.0
281,200,-200.0
282,154,-154.0
283,200,-200.0
284,88,-88.0
285,151,-151.0
286,156,-156.0
287,158,-158.0
288,200,-200.0
289,175,-175.0
290,178,-178.0
291,123,-123.0
292,196,-196.0
293,112,-112.0
294,92,-92.0
295,200,-200.0
296,86,-86.0
297,129,-129.0
298,200,-200.0
299,84,-84.0
300,200,-200.0
301,172,-172.0
302,175,-175.0
303,116,-116.0
304,200,-200.0
305,87,-87.0
306,136,-136.0
307,191,-191.0
308,200,-200.0
309,151,-151.0
310,169,-169.0
311,200,-200.0
312,200,-200.0
313,169,-169.0
314,138,-138.0
315,195,-195.0
316,200,-200.0
317,85,-85.0
318,200,-200.0
319,142,-142.0
320,183,-183.0
321,200,-200.0
322,200,-200.0
323,108,-108.0
324,114,-114.0
325,200,-200.0
326,200,-200.0
327,175,-175.0
328,184,-184.0
329,200,-200.0
330,156,-156.0
331,169,-169.0
332,200,-200.0
333,163,-163.0
334,128,-128.0
335,200,-200.0
336,101,-101.0
337,200,-200.0
338,200,-200.0
339,94,-94.0
340,89,-89.0
341,98,-98.0
342,92,-92.0
343,176,-176.0
344,99,-99.0
345,200,-200.0
346,94,-94.0
347,119,-119.0
348,200,-200.0
349,200,-200.0
350,164,-164.0
351,190,-190.0
352,188,-188.0
353,158,-158.0
354,155,-155.0
355,181,-181.0
356,200,-200.0
357,157,-157.0
358,182,-182.0
359,200,-200.0
360,109,-109.0
361,200,-200.0
362,171,-171.0
363,200,-200.0
364,181,-181.0
365,166,-166.0
366,174,-174.0
367,92,-92.0
368,200,-200.0
369,83,-83.0
370,200,-200.0
371,200,-200.0
372,170,-170.0
373,200,-200.0
374,174,-174.0
375,164,-164.0
376,157,-157.0
377,92,-92.0
378,104,-104.0
379,171,-171.0
380,200,-200.0
381,152,-152.0
382,91,-91.0
383,158,-158.0
384,92,-92.0
385,165,-165.0
386,152,-152.0
387,91,-91.0
388,85,-85.0
389,155,-155.0
390,200,-200.0
391,136,-136.0
392,192,-192.0
393,200,-200.0
394,200,-200.0
395,91,-91.0
396,168,-168.0
397,172,-172.0
398,200,-200.0
399,157,-157.0
400,97,-97.0
401,158,-158.0
402,146,-146.0
403,200,-200.0
404,188,-188.0
405,87,-87.0
406,153,-153.0
407,149,-149.0
408,101,-101.0
409,176,-176.0
410,156,-156.0
411,167,-167.0
412,94,-94.0
413,130,-130.0
414,200,-200.0
415,168,-168.0
416,180,-180.0
417,101,-101.0
418,94,-94.0
419,112,-112.0
420,94,-94.0
421,133,-133.0
422,83,-83.0
423,86,-86.0
424,92,-92.0
425,165,-165.0
426,90,-90.0
427,159,-159.0
428,158,-158.0
429,167,-167.0
430,176,-176.0
431,85,-85.0
432,91,-91.0
433,181,-181.0
434,171,-171.0
435,180,-180.0
436,187,-187.0
437,200,-200.0
438,88,-88.0
439,188,-188.0
440,98,-98.0
441,167,-167.0
442,200,-200.0
443,169,-169.0
444,176,-176.0
445,200,-200.0
446,162,-162.0
447,186,-186.0
448,160,-160.0
449,83,-83.0
450,160,-160.0
451,172,-172.0
452,148,-148.0
453,200,-200.0
454,160,-160.0
455,84,-84.0
456,154,-154.0
457,164,-164.0
458,157,-157.0
459,200,-200.0
460,200,-200.0
461,119,-119.0
462,200,-200.0
463,156,-156.0
464,156,-156.0
465,90,-90.0
466,160,-160.0
467,200,-200.0
468,177,-177.0
469,150,-150.0
470,151,-151.0
471,151,-151.0
472,159,-159.0
473,156,-156.0
474,200,-200.0
475,200,-200.0
476,155,-155.0
477,165,-165.0
478,90,-90.0
479,148,-148.0
480,200,-200.0
481,200,-200.0
482,159,-159.0
483,152,-152.0
484,157,-157.0
485,200,-200.0
486,165,-165.0
487,149,-149.0
488,171,-171.0
489,200,-200.0
490,168,-168.0
491,158,-158.0
492,87,-87.0
493,200,-200.0
494,193,-193.0
495,156,-156.0
496,148,-148.0
497,181,-181.0
498,200,-200.0
499,186,-186.0
500,199,-199.0
501,89,-89.0
502,161,-161.0
503,164,-164.0
504,170,-170.0
505,200,-200.0
506,156,-156.0
507,175,-175.0
508,200,-200.0
509,101,-101.0
510,100,-100.0
511,155,-155.0
512,162,-162.0
513,87,-87.0
514,165,-165.0
515,138,-138.0
516,146,-146.0
517,105,-105.0
518,200,-200.0
519,162,-162.0
520,159,-159.0
521,94,-94.0
522,200,-200.0
523,100,-100.0
524,186,-186.0
525,188,-188.0
526,200,-200.0
527,200,-200.0
528,200,-200.0
529,88,-88.0
530,200,-200.0
531,173,-173.0
532,94,-94.0
533,200,-200.0
534,160,-160.0
535,85,-85.0
536,183,-183.0
537,85,-85.0
538,165,-165.0
539,90,-90.0
540,171,-171.0
541,134,-134.0
542,164,-164.0
543,168,-168.0
544,200,-200.0
545,180,-180.0
546,200,-200.0
547,200,-200.0
548,162,-162.0
549,162,-162.0
550,184,-184.0
551,166,-166.0
552,150,-150.0
553,166,-166.0
554,110,-110.0
555,156,-156.0
556,156,-156.0
557,89,-89.0
558,159,-159.0
559,156,-156.0
560,200,-200.0
561,200,-200.0
562,200,-200.0
563,200,-200.0
564,172,-172.0
565,165,-165.0
566,200,-200.0
567,85,-85.0
568,161,-161.0
569,164,-164.0
570,152,-152.0
571,190,-190.0
572,183,-183.0
573,91,-91.0
574,85,-85.0
575,176,-176.0
576,148,-148.0
577,190,-190.0
578,200,-200.0
579,92,-92.0
580,200,-200.0
581,164,-164.0
582,143,-143.0
583,158,-158.0
584,151,-151.0
585,93,-93.0
586,179,-179.0
587,92,-92.0
588,200,-200.0
589,183,-183.0
590,200,-200.0
591,188,-188.0
592,200,-200.0
593,200,-200.0
594,200,-200.0
595,200,-200.0
596,200,-200.0
597,200,-200.0
598,200,-200.0
599,200,-200.0
600,200,-200.0
601,200,-200.0
602,200,-200.0
603,200,-200.0
604,145,-145.0
605,200,-200.0
606,183,-183.0
607,200,-200.0
608,105,-105.0
609,200,-200.0
610,111,-111.0
611,200,-200.0
612,193,-193.0
613,200,-200.0
614,168,-168.0
615,156,-156.0
616,130,-130.0
617,138,-138.0
618,200,-200.0
619,167,-167.0
620,87,-87.0
621,121,-121.0
622,129,-129.0
623,127,-127.0
624,130,-130.0
625,129,-129.0
626,173,-173.0
627,198,-198.0
628,118,-118.0
629,113,-113.0
630,129,-129.0
631,126,-126.0
632,155,-155.0
633,155,-155.0
634,139,-139.0
635,148,-148.0
636,146,-146.0
637,200,-200.0
638,200,-200.0
639,200,-200.0
640,171,-171.0
641,200,-200.0
642,200,-200.0
643,197,-197.0
644,200,-200.0
645,168,-168.0
646,161,-161.0
647,124,-124.0
648,159,-159.0
649,167,-167.0
650,93,-93.0
651,140,-140.0
652,120,-120.0
653,177,-177.0
654,165,-165.0
655,102,-102.0
656,161,-161.0
657,196,-196.0
658,200,-200.0
659,164,-164.0
660,130,-130.0
661,200,-200.0
662,200,-200.0
663,200,-200.0
664,166,-166.0
665,170,-170.0
666,151,-151.0
667,90,-90.0
668,174,-174.0
669,157,-157.0
670,141,-141.0
671,162,-162.0
672,200,-200.0
673,168,-168.0
674,147,-147.0
675,88,-88.0
676,156,-156.0
677,176,-176.0
678,142,-142.0
679,117,-117.0
680,96,-96.0
681,200,-200.0
682,141,-141.0
683,150,-150.0
684,167,-167.0
685,168,-168.0
686,96,-96.0
687,200,-200.0
688,166,-166.0
689,176,-176.0
690,176,-176.0
691,106,-106.0
692,168,-168.0
693,122,-122.0
694,200,-200.0
695,163,-163.0
696,164,-164.0
697,200,-200.0
698,145,-145.0
699,177,-177.0
700,188,-188.0
701,146,-146.0
702,199,-199.0
703,138,-138.0
704,168,-168.0
705,155,-155.0
706,200,-200.0
707,129,-129.0
708,200,-200.0
709,164,-164.0
710,144,-144.0
711,184,-184.0
712,144,-144.0
713,166,-166.0
714,200,-200.0
715,170,-170.0
716,200,-200.0
717,144,-144.0
718,84,-84.0
719,176,-176.0
720,200,-200.0
721,173,-173.0
722,200,-200.0
723,165,-165.0
724,108,-108.0
725,167,-167.0
726,88,-88.0
727,89,-89.0
728,175,-175.0
729,140,-140.0
730,200,-200.0
731,163,-163.0
732,153,-153.0
733,180,-180.0
734,144,-144.0
735,185,-185.0
736,146,-146.0
737,167,-167.0
738,153,-153.0
739,145,-145.0
740,193,-193.0
741,148,-148.0
742,96,-96.0
743,136,-136.0
744,180,-180.0
745,89,-89.0
746,119,-119.0
747,89,-89.0
748,156,-156.0
749,116,-116.0
750,156,-156.0
751,119,-119.0
752,155,-155.0
753,106,-106.0
754,193,-193.0
755,152,-152.0
756,154,-154.0
757,141,-141.0
758,127,-127.0
759,174,-174.0
760,147,-147.0
761,156,-156.0
762,113,-113.0
763,143,-143.0
764,140,-140.0
765,128,-128.0
766,107,-107.0
767,181,-181.0
768,138,-138.0
769,110,-110.0
770,131,-131.0
771,137,-137.0
772,88,-88.0
773,120,-120.0
774,182,-182.0
775,196,-196.0
776,135,-135.0
777,142,-142.0
778,137,-137.0
779,141,-141.0
780,153,-153.0
781,145,-145.0
782,162,-162.0
783,159,-159.0
784,193,-193.0
785,162,-162.0
786,175,-175.0
787,124,-124.0
788,98,-98.0
789,112,-112.0
790,116,-116.0
791,97,-97.0
792,178,-178.0
793,140,-140.0
794,142,-142.0
795,200,-200.0
796,140,-140.0
797,106,-106.0
798,95,-95.0
799,155,-155.0
800,92,-92.0
801,150,-150.0
802,146,-146.0
803,145,-145.0
804,147,-147.0
805,124,-124.0
806,147,-147.0
807,167,-167.0
808,141,-141.0
809,200,-200.0
810,144,-144.0
811,113,-113.0
812,148,-148.0
813,200,-200.0
814,158,-158.0
815,171,-171.0
816,94,-94.0
817,168,-168.0
818,200,-200.0
819,123,-123.0
820,86,-86.0
821,167,-167.0
822,102,-102.0
823,146,-146.0
824,111,-111.0
825,174,-174.0
826,147,-147.0
827,162,-162.0
828,143,-143.0
829,84,-84.0
830,147,-147.0
831,184,-184.0
832,153,-153.0
833,151,-151.0
834,89,-89.0
835,188,-188.0
836,157,-157.0
837,147,-147.0
838,110,-110.0
839,143,-143.0
840,88,-88.0
841,147,-147.0
842,85,-85.0
843,153,-153.0
844,147,-147.0
845,145,-145.0
846,87,-87.0
847,197,-197.0
848,87,-87.0
849,147,-147.0
850,158,-158.0
851,174,-174.0
852,161,-161.0
853,151,-151.0
854,138,-138.0
855,141,-141.0
856,168,-168.0
857,117,-117.0
858,200,-200.0
859,107,-107.0
860,89,-89.0
861,141,-141.0
862,140,-140.0
863,200,-200.0
864,163,-163.0
865,140,-140.0
866,161,-161.0
867,96,-96.0
868,104,-104.0
869,86,-86.0
870,133,-133.0
871,95,-95.0
872,179,-179.0
873,110,-110.0
874,105,-105.0
875,160,-160.0
876,157,-157.0
877,140,-140.0
878,108,-108.0
879,165,-165.0
880,139,-139.0
881,160,-160.0
882,89,-89.0
883,145,-145.0
884,145,-145.0
885,141,-141.0
886,96,-96.0
887,163,-163.0
888,155,-155.0
889,145,-145.0
890,104,-104.0
891,115,-115.0
892,162,-162.0
893,134,-134.0
894,138,-138.0
895,145,-145.0
896,150,-150.0
897,123,-123.0
898,140,-140.0
899,163,-163.0
900,135,-135.0
901,123,-123.0
902,162,-162.0
903,88,-88.0
904,155,-155.0
905,144,-144.0
906,140,-140.0
907,165,-165.0
908,154,-154.0
909,145,-145.0
910,166,-166.0
911,138,-138.0
912,155,-155.0
913,145,-145.0
914,163,-163.0
915,165,-165.0
916,143,-143.0
917,200,-200.0
918,174,-174.0
919,139,-139.0
920,143,-143.0
921,137,-137.0
922,200,-200.0
923,193,-193.0
924,169,-169.0
925,104,-104.0
926,96,-96.0
927,89,-89.0
928,146,-146.0
929,163,-163.0
930,135,-135.0
931,142,-142.0
932,90,-90.0
933,143,-143.0
934,178,-178.0
935,141,-141.0
936,146,-146.0
937,141,-141.0
938,148,-148.0
939,167,-167.0
940,142,-142.0
941,139,-139.0
942,139,-139.0
943,138,-138.0
944,150,-150.0
945,140,-140.0
946,138,-138.0
947,94,-94.0
948,160,-160.0
949,87,-87.0
950,143,-143.0
951,88,-88.0
952,173,-173.0
953,150,-150.0
954,135,-135.0
955,144,-144.0
956,134,-134.0
957,139,-139.0
958,138,-138.0
959,165,-165.0
960,109,-109.0
961,165,-165.0
962,154,-154.0
963,149,-149.0
964,152,-152.0
965,152,-152.0
966,144,-144.0
967,192,-192.0
968,153,-153.0
969,146,-146.0
970,166,-166.0
971,142,-142.0
972,138,-138.0
973,171,-171.0
974,157,-157.0
975,149,-149.0
976,153,-153.0
977,154,-154.0
978,143,-143.0
979,137,-137.0
980,143,-143.0
981,137,-137.0
982,138,-138.0
983,152,-152.0
984,136,-136.0
985,136,-136.0
986,150,-150.0
987,138,-138.0
988,140,-140.0
989,100,-100.0
990,141,-141.0
991,152,-152.0
992,155,-155.0
993,158,-158.0
994,135,-135.0
995,90,-90.0
996,162,-162.0
997,165,-165.0
998,136,-136.0
999,178,-178.0
1000,134,-134.0
1001,135,-135.0
1002,142,-142.0
1003,149,-149.0
1004,172,-172.0
1005,200,-200.0
1006,143,-143.0
1007,160,-160.0
1008,148,-148.0
1009,161,-161.0
1010,140,-140.0
1011,97,-97.0
1012,159,-159.0
1013,158,-158.0
1014,200,-200.0
1015,155,-155.0
1016,101,-101.0
1017,166,-166.0
1018,183,-183.0
1019,143,-143.0
1020,149,-149.0
1021,138,-138.0
1022,150,-150.0
1023,142,-142.0
1024,141,-141.0
1025,147,-147.0
1026,171,-171.0
1027,176,-176.0
1028,200,-200.0
1029,145,-145.0
1030,146,-146.0
1031,157,-157.0
1032,145,-145.0
1033,144,-144.0
1034,200,-200.0
1035,197,-197.0
1036,139,-139.0
1037,157,-157.0
1038,200,-200.0
1039,200,-200.0
1040,200,-200.0
1041,149,-149.0
1042,200,-200.0
1043,157,-157.0
1044,150,-150.0
1045,155,-155.0
1046,155,-155.0
1047,148,-148.0
1048,200,-200.0
1049,200,-200.0
1050,159,-159.0
1051,158,-158.0
1052,200,-200.0
1053,157,-157.0
1054,162,-162.0
1055,152,-152.0
1056,153,-153.0
1057,167,-167.0
1058,146,-146.0
1059,168,-168.0
1060,158,-158.0
1061,154,-154.0
1062,146,-146.0
1063,155,-155.0
1064,149,-149.0
1065,125,-125.0
1066,177,-177.0
1067,165,-165.0
1068,157,-157.0
1069,161,-161.0
1070,189,-189.0
1071,200,-200.0
1072,200,-200.0
1073,200,-200.0
1074,200,-200.0
1075,176,-176.0
1076,173,-173.0
1077,172,-172.0
1078,168,-168.0
1079,151,-151.0
1080,200,-200.0
1081,167,-167.0
1082,198,-198.0
1083,200,-200.0
1084,158,-158.0
1085,125,-125.0
1086,137,-137.0
1087,134,-134.0
1088,166,-166.0
1089,174,-174.0
1090,126,-126.0
1091,150,-150.0
1092,188,-188.0
1093,173,-173.0
1094,169,-169.0
1095,133,-133.0
1096,169,-169.0
1097,166,-166.0
1098,158,-158.0
1099,177,-177.0
1100,200,-200.0
1101,200,-200.0
1102,167,-167.0
1103,186,-186.0
1104,200,-200.0
1105,164,-164.0
1106,91,-91.0
1107,196,-196.0
1108,151,-151.0
1109,165,-165.0
1110,194,-194.0
1111,177,-177.0
1112,178,-178.0
1113,94,-94.0
1114,169,-169.0
1115,185,-185.0
1116,169,-169.0
1117,175,-175.0
1118,154,-154.0
1119,170,-170.0
1120,189,-189.0
1121,200,-200.0
1122,181,-181.0
1123,200,-200.0
1124,181,-181.0
1125,200,-200.0
1126,169,-169.0
1127,185,-185.0
1128,200,-200.0
1129,179,-179.0
1130,200,-200.0
1131,168,-168.0
1132,97,-97.0
1133,92,-92.0
1134,174,-174.0
1135,178,-178.0
1136,172,-172.0
1137,174,-174.0
1138,190,-190.0
1139,156,-156.0
1140,158,-158.0
1141,187,-187.0
1142,88,-88.0
1143,190,-190.0
1144,151,-151.0
1145,161,-161.0
1146,157,-157.0
1147,144,-144.0
1148,159,-159.0
1149,162,-162.0
1150,156,-156.0
1151,159,-159.0
1152,158,-158.0
1153,150,-150.0
1154,156,-156.0
1155,152,-152.0
1156,159,-159.0
1157,163,-163.0
1158,155,-155.0
1159,151,-151.0
1160,155,-155.0
1161,160,-160.0
1162,164,-164.0
1163,153,-153.0
1164,167,-167.0
1165,169,-169.0
1166,200,-200.0
1167,145,-145.0
1168,200,-200.0
1169,143,-143.0
1170,141,-141.0
1171,200,-200.0
1172,158,-158.0
1173,200,-200.0
1174,130,-130.0
1175,200,-200.0
1176,127,-127.0
1177,129,-129.0
1178,200,-200.0
1179,161,-161.0
1180,152,-152.0
1181,175,-175.0
1182,151,-151.0
1183,167,-167.0
1184,179,-179.0
1185,149,-149.0
1186,160,-160.0
1187,200,-200.0
1188,177,-177.0
1189,164,-164.0
1190,134,-134.0
1191,192,-192.0
1192,160,-160.0
1193,150,-150.0
1194,153,-153.0
1195,151,-151.0
1196,166,-166.0
1197,149,-149.0
1198,161,-161.0
1199,173,-173.0
1200,200,-200.0
1201,89,-89.0
1202,200,-200.0
1203,200,-200.0
1204,200,-200.0
1205,158,-158.0
1206,163,-163.0
1207,151,-151.0
1208,139,-139.0
1209,189,-189.0
1210,88,-88.0
1211,180,-180.0
1212,200,-200.0
1213,200,-200.0
1214,155,-155.0
1215,143,-143.0
1216,141,-141.0
1217,151,-151.0
1218,161,-161.0
1219,150,-150.0
1220,162,-162.0
1221,168,-168.0
1222,162,-162.0
1223,160,-160.0
1224,148,-148.0
1225,149,-149.0
1226,144,-144.0
1227,144,-144.0
1228,155,-155.0
1229,138,-138.0
1230,148,-148.0
1231,160,-160.0
1232,166,-166.0
1233,152,-152.0
1234,162,-162.0
1235,176,-176.0
1236,153,-153.0
1237,200,-200.0
1238,155,-155.0
1239,93,-93.0
1240,143,-143.0
1241,153,-153.0
1242,149,-149.0
1243,106,-106.0
1244,141,-141.0
1245,163,-163.0
1246,163,-163.0
1247,152,-152.0
1248,146,-146.0
1249,152,-152.0
1250,166,-166.0
1251,140,-140.0
1252,144,-144.0
1253,161,-161.0
1254,142,-142.0
1255,160,-160.0
1256,163,-163.0
1257,153,-153.0
1258,150,-150.0
1259,154,-154.0
1260,152,-152.0
1261,137,-137.0
1262,153,-153.0
1263,174,-174.0
1264,165,-165.0
1265,176,-176.0
1266,200,-200.0
1267,176,-176.0
1268,109,-109.0
1269,200,-200.0
1270,153,-153.0
1271,89,-89.0
1272,182,-182.0
1273,150,-150.0
1274,183,-183.0
1275,175,-175.0
1276,154,-154.0
1277,117,-117.0
1278,191,-191.0
1279,114,-114.0
1280,150,-150.0
1281,146,-146.0
1282,188,-188.0
1283,170,-170.0
1284,152,-152.0
1285,175,-175.0
1286,160,-160.0
1287,164,-164.0
1288,135,-135.0
1289,87,-87.0
1290,100,-100.0
1291,180,-180.0
1292,143,-143.0
1293,120,-120.0
1294,174,-174.0
1295,176,-176.0
1296,89,-89.0
1297,189,-189.0
1298,107,-107.0
1299,110,-110.0
1300,167,-167.0
1301,87,-87.0
1302,88,-88.0
1303,190,-190.0
1304,150,-150.0
1305,144,-144.0
1306,161,-161.0
1307,173,-173.0
1308,188,-188.0
1309,151,-151.0
1310,179,-179.0
1311,171,-171.0
1312,163,-163.0
1313,155,-155.0
1314,156,-156.0
1315,148,-148.0
1316,169,-169.0
1317,117,-117.0
1318,148,-148.0
1319,159,-159.0
1320,160,-160.0
1321,150,-150.0
1322,143,-143.0
1323,153,-153.0
1324,150,-150.0
1325,155,-155.0
1326,152,-152.0
1327,159,-159.0
1328,165,-165.0
1329,172,-172.0
1330,165,-165.0
1331,161,-161.0
1332,88,-88.0
1333,168,-168.0
1334,183,-183.0
1335,155,-155.0
1336,152,-152.0
1337,157,-157.0
1338,174,-174.0
1339,177,-177.0
1340,160,-160.0
1341,158,-158.0
1342,171,-171.0
1343,152,-152.0
1344,153,-153.0
1345,166,-166.0
1346,154,-154.0
1347,152,-152.0
1348,89,-89.0
1349,158,-158.0
1350,176,-176.0
1351,92,-92.0
1352,153,-153.0
1353,162,-162.0
1354,163,-163.0
1355,87,-87.0
1356,164,-164.0
1357,200,-200.0
1358,153,-153.0
1359,200,-200.0
1360,191,-191.0
1361,160,-160.0
1362,89,-89.0
1363,152,-152.0
1364,177,-177.0
1365,165,-165.0
1366,170,-170.0
1367,195,-195.0
1368,170,-170.0
1369,156,-156.0
1370,200,-200.0
1371,151,-151.0
1372,200,-200.0
1373,200,-200.0
1374,163,-163.0
1375,181,-181.0
1376,166,-166.0
1377,157,-157.0
1378,174,-174.0
1379,154,-154.0
1380,143,-143.0
1381,145,-145.0
1382,151,-151.0
1383,167,-167.0
1384,200,-200.0
1385,153,-153.0
1386,175,-175.0
1387,158,-158.0
1388,165,-165.0
1389,170,-170.0
1390,147,-147.0
1391,95,-95.0
1392,200,-200.0
1393,200,-200.0
1394,150,-150.0
1395,159,-159.0
1396,193,-193.0
1397,152,-152.0
1398,200,-200.0
1399,141,-141.0
1400,184,-184.0
1401,157,-157.0
1402,112,-112.0
1403,107,-107.0
1404,121,-121.0
1405,200,-200.0
1406,157,-157.0
1407,158,-158.0
1408,162,-162.0
1409,151,-151.0
1410,168,-168.0
1411,156,-156.0
1412,97,-97.0
1413,153,-153.0
1414,157,-157.0
1415,155,-155.0
1416,94,-94.0
1417,200,-200.0
1418,150,-150.0
1419,157,-157.0
1420,163,-163.0
1421,157,-157.0
1422,148,-148.0
1423,149,-149.0
1424,96,-96.0
1425,154,-154.0
1426,159,-159.0
1427,157,-157.0
1428,149,-149.0
1429,145,-145.0
1430,170,-170.0
1431,163,-163.0
1432,175,-175.0
1433,150,-150.0
1434,155,-155.0
1435,117,-117.0
1436,156,-156.0
1437,189,-189.0
1438,158,-158.0
1439,145,-145.0
1440,156,-156.0
1441,150,-150.0
1442,144,-144.0
1443,150,-150.0
1444,154,-154.0
1445,194,-194.0
1446,173,-173.0
1447,163,-163.0
1448,200,-200.0
1449,154,-154.0
1450,176,-176.0
