episodes,steps,rewards
0,87,-112.1220063435083
1,93,-132.20541955040488
2,100,-346.8356943758165
3,87,-459.3256233934809
4,98,-149.51423690387531
5,73,-174.65430102057945
6,91,-89.64987019698
7,107,-354.0441037926248
8,125,-127.54044639958931
9,111,-483.0573506939469
10,109,-390.23102839553366
11,84,-331.755841942724
12,156,-513.4882291052483
13,107,-334.5872023007141
14,59,-123.17570577938127
15,64,-135.58484107838638
16,89,-101.34119804345085
17,262,-249.32341496682477
18,185,-762.861039171974
19,265,-247.15141454309187
20,192,-508.40690448492677
21,1000,-210.28812934957907
22,1000,-149.07960818599705
23,1000,-111.94944909925431
24,119,-310.67131807806174
25,143,-131.01296223973753
26,1000,-53.58749075801385
27,1000,-120.92287123161265
28,1000,-144.52235567142225
29,1000,-134.02227018831755
30,1000,-128.84786219135796
31,234,-484.27969075007945
32,256,-297.40970336557837
33,1000,-117.86926171034087
34,334,-346.66115003704397
35,1000,-72.26829247757273
36,1000,-65.23683678269158
37,1000,-56.47980898674979
38,1000,-106.392894509328
39,1000,-86.54743611408968
40,1000,-116.48422069563713
41,793,-256.1624046708565
42,1000,-95.57610889506736
43,1000,-58.91589796739024
44,1000,-97.23773118073852
45,1000,-122.94437538251205
46,1000,-122.96934828091806
47,1000,-43.30132434965944
48,1000,-35.39532856723578
49,1000,-78.51733341720683
50,441,-109.9441609002494
51,1000,-37.45727565811768
52,142,-169.8279094416015
53,351,-287.0575846069221
54,933,-240.23429584224016
55,579,-199.66490158710224
56,197,-131.9917636570309
57,1000,-145.8444156594523
58,1000,-173.80840218278624
59,1000,-178.33327344936765
60,156,-166.3437684937499
61,1000,-119.92838332836105
62,1000,-114.45292524934875
63,1000,-150.7348991432455
64,1000,-160.77596560177756
65,637,-238.30602198083756
66,1000,-141.64666417477417
67,1000,-67.60169314353244
68,1000,-117.1103950182462
69,312,-244.07373679763745
70,982,-674.6313902699837
71,1000,-71.48635559271266
72,714,-248.92086412114082
73,1000,-128.39925297123784
74,358,-304.71071868248885
75,1000,-62.15814366483457
76,1000,-136.39410401837475
77,1000,-96.84034685582033
78,1000,-150.7443729589497
79,1000,-125.5469305011066
80,724,-432.732278796544
81,403,-467.01317233290433
82,299,-37.707232697186214
83,188,-212.5108992563717
84,292,-188.97650256770584
85,420,-285.8931698089653
86,149,-278.6311431081462
87,262,-134.05158173947237
88,218,-180.95033654443492
89,319,-174.75610733496163
90,736,-318.4384655221685
91,1000,-165.91931586096024
92,1000,-115.70932589026754
93,1000,-122.74088889079333
94,1000,-106.04878373397433
95,1000,-140.2069535288521
96,1000,-95.50520833033613
97,379,-530.9209889767869
98,579,-272.3962564128782
99,1000,-147.06035419801626
100,1000,-153.70836245188417
