episodes,steps,rewards
0,112,-74.73435026036938
1,107,-158.34824548326853
2,74,-77.44871014841306
3,89,-390.58201290529314
4,69,-93.98536598960406
5,66,-91.71931025162704
6,67,-76.64788666888984
7,92,-242.16852533354677
8,80,-333.0432614312347
9,89,-273.039096270371
10,73,-182.29829058178746
11,107,-453.03911498567413
12,69,-90.57168087076622
13,157,-135.43876355580352
14,180,-394.8610028088314
15,167,-65.0949170734449
16,107,-74.56294577134969
17,199,-11.183836372287573
18,1000,-85.4197331909821
19,1000,-48.290866309381094
20,1000,-88.670253248344
21,1000,-92.96328208191754
22,1000,-70.5521876400111
23,1000,-3.1988600042693065
24,1000,-59.960773516481304
25,780,-207.6916042549206
26,1000,12.099528155403421
27,1000,-18.333231884440085
28,582,146.4114399937458
29,1000,6.093395999919035
30,121,-191.57056673964485
31,773,-169.50112051457592
32,1000,-31.47470273905929
33,213,-95.47097275837719
34,1000,-82.12723654803959
35,1000,-104.01326391660159
36,1000,-106.11451320705321
37,1000,-85.59833852610106
38,1000,-143.19037531387096
39,238,-135.78302909446205
40,255,-105.18745891872533
41,538,-466.7815875498097
42,166,-188.22934296761983
43,1000,-261.4746202632168
44,1000,-105.93510321840893
45,1000,-181.49589358500887
46,1000,-83.07255274265002
47,1000,-162.665905283555
48,1000,-88.753362832396
49,1000,-32.59327021425915
50,120,-190.41861112832672
51,399,-333.1573035259903
52,1000,-239.5139587866188
53,1000,-124.50022073687732
54,377,-126.25234533442034
55,1000,-145.04702019944497
56,1000,-108.37024525669725
57,146,-135.2724677567847
58,296,-173.08268905902662
59,1000,-154.5867650530291
60,1000,-106.2289023148941
61,1000,-48.69342854669388
62,1000,-44.58430860939194
63,1000,-136.3503999301889
64,456,-91.3384319961215
65,654,-294.41659954209547
66,119,-115.59699684134286
67,618,-392.0322109443591
68,1000,-143.1832525606687
69,470,-316.0906005097603
70,247,-515.5233111153705
71,337,-103.90822525485957
72,1000,-94.34397769827994
73,1000,-86.84986381135309
74,1000,-83.81370149972341
75,1000,-159.23289922570433
76,1000,-92.79869765157254
77,245,-357.75148582652776
78,1000,-118.01612796776786
79,1000,-87.80432125368267
80,1000,-73.59800941551589
81,1000,-119.34884256673682
82,1000,-94.85255899715716
83,1000,-84.54183044388972
84,1000,-144.0619558975104
85,1000,-81.07814939615358
86,1000,-119.09234402842002
87,854,-225.48861980253997
88,984,-221.02989538238205
89,1000,-97.14376099617579
90,1000,-147.30076157500196
91,1000,-107.223528731102
92,175,-96.0283659895251
93,1000,-179.2611709945903
94,1000,-137.25780605757734
95,1000,-156.95317752338744
96,1000,-65.31617692393465
97,1000,-106.10454180891861
98,1000,-133.54762215248402
99,1000,-140.6879893804096
100,1000,-132.20507909530505
101,1000,-122.43142303950977
102,1000,-93.07324590332466
103,1000,-105.64695339602112
104,1000,-106.91704428470166
105,1000,-104.00934096959702
106,1000,-86.06079147428925
107,1000,-122.11842200804625
108,1000,-98.88893531295572
109,1000,-88.76885201396416
110,1000,-155.3794752113282
111,1000,-120.62000861294908
112,1000,-102.22964974314696
113,1000,-139.5313581229595
114,1000,-104.95513395104192
115,1000,-134.18085439766003
116,1000,-65.54158598158732
117,1000,-75.95334020400912
118,1000,-96.92018340811774
119,1000,-97.5387716978497
120,1000,-78.20848745290999
121,1000,-138.39758879308707
122,1000,-169.69069669388253
123,849,-315.6119247692568
124,98,-244.7988895869915
125,1000,-165.73854497987261
126,1000,-155.53631448191402
127,1000,-152.9378252418283
128,1000,-94.07907705889474
129,1000,-93.32219270725932
130,1000,-124.25387245143033
131,449,-276.08692525641436
132,1000,-120.28602342941353
133,320,-196.25178241113076
134,361,-180.9898326827918
135,1000,-149.21993946060286
136,1000,-130.5345500540544
137,1000,-111.10521342479726
138,1000,-107.09801494603097
139,1000,-116.79390633641206
140,1000,-137.4031900392521
141,177,-191.70633091581854
142,757,-347.34337879382565
143,693,-243.3953592414083
144,235,-129.25320047002617
145,106,-213.6418929488985
146,1000,-179.3388293526058
147,1000,-152.399467596344
148,1000,-163.77800362317475
149,1000,-150.30645281201825
150,1000,-123.53761697413597
151,1000,-161.5788479592061
152,1000,-157.96358349405315
153,1000,-173.28384193358875
154,1000,-199.3539931146293
155,1000,-177.90980322093927
156,1000,-194.6555275438345
157,1000,-140.02007055340286
158,1000,-148.83449871428496
159,1000,-171.67215917429212
160,729,-136.0711335934285
161,1000,-169.88938568347263
162,1000,-189.92991479624126
163,1000,-130.22882558797588
164,204,-261.5355934657635
165,1000,-171.8257936892943
166,83,-282.75289956619434
167,1000,-91.61384091870005
168,754,-259.37268072154484
169,1000,-41.604649863939215
170,877,-141.8307866324344
171,218,-248.80645604283103
172,1000,-97.64713900046455
173,1000,-63.31835172057701
174,1000,-64.17075919794434
175,1000,-58.887509085319785
176,1000,-2.390205288108889
177,1000,5.768043269049704
178,253,-356.94331331257524
179,90,-12.250645129814657
180,171,-128.2642241814507
181,153,-255.20859842272523
182,138,-358.99866742402844
183,1000,-66.04188305580881
184,1000,-28.94190817595248
185,1000,-80.49730981652166
186,1000,-43.821140151746626
187,1000,-30.347862154326045
188,1000,-17.361004571700445
189,1000,-22.223410430757333
190,176,-106.74536427180254
191,257,197.0955221087659
192,363,-250.7034946892228
193,155,-245.69875393245312
194,137,-501.76122900781087
195,286,-306.07823075544917
196,214,-291.21805482030004
197,665,-295.3582898550189
198,387,-281.1234339325422
199,1000,-43.210145739841444
200,1000,-149.80868312459697
201,648,-271.73435496153945
202,1000,-169.5764995380089
203,233,-355.6986971375882
204,1000,-132.40168487756966
205,208,-122.44192403040773
206,1000,-122.4022202927812
207,1000,-111.09012050385749
208,1000,-116.46591057844039
209,1000,-70.48232484020225
210,1000,-61.69516665277056
211,1000,-77.71631964547291
212,1000,-36.25633289687748
213,1000,-152.15405157496966
214,485,-412.3828520855872
215,308,-389.4612990709273
216,1000,-311.24086316016724
217,248,-355.4492517944732
218,188,-80.14205276764031
219,308,-278.161638359117
220,604,-359.68382601723323
221,1000,-117.65821262222654
222,1000,-231.34499995541384
223,1000,-105.55595560968636
224,648,-141.59018276491065
225,1000,-129.50260794003742
226,1000,-47.214121958775934
227,817,-194.75040922540907
228,1000,-76.22946522984682
229,1000,-58.52685479973984
230,1000,-115.83660061764516
231,199,-120.5958246096748
232,310,-65.60498180607999
233,577,-60.24196406276837
234,332,-52.68935147733032
235,332,-455.4723608465366
236,134,-124.24160897940644
237,91,-284.5867820298418
238,123,-211.0232395345832
239,229,-320.67032117072455
240,179,-639.0832104509808
241,254,-109.24313250137097
242,500,-188.3187866727061
243,335,-240.85327670914455
244,244,-207.74227748158592
245,311,-196.04080390034855
246,785,-181.4197297429564
247,1000,-74.09535043673424
248,1000,-126.63169004876347
249,1000,-48.083238496663746
250,1000,-49.14388744715811
251,1000,-63.788235826922815
252,1000,-53.176235347767246
253,280,-384.77804010572913
254,1000,-59.66622481077707
255,1000,-84.30407746430012
256,1000,-79.64237315283162
257,714,-216.7441711411032
258,826,-201.4921840933485
259,1000,-91.28776308487573
260,1000,-118.58546585194817
261,1000,-60.80104511887811
262,1000,-87.69283624163319
263,1000,-68.11793021012299
264,1000,-72.68679676090454
265,1000,-117.12433750778447
266,1000,-144.9711890576952
267,734,-236.14117221543108
268,119,-262.2847215551472
269,388,-378.30342689107397
270,302,-332.0499891637386
271,532,-292.68860863338074
272,106,-224.71718409218062
273,952,-226.67720995074978
274,804,-192.08013910312565
275,144,6.0112478840611345
276,1000,-130.5650453841405
277,1000,-136.87682091949202
278,1000,-105.36399628791713
279,1000,-75.30660652404634
280,118,-201.26304272960323
281,1000,-77.3446584587933
282,1000,-227.24121301937558
283,146,-231.80921678139424
284,1000,-114.63468682680063
285,1000,-175.19681925774768
286,1000,-203.51732381790137
287,1000,-155.43068644363998
288,335,-190.71524189300834
289,1000,-112.53255707719714
290,1000,-102.65456650445216
291,182,-171.8004078584466
292,1000,-148.50653395128137
293,1000,-110.28602004382822
294,126,-173.4101809518594
295,1000,-95.07046822177016
296,1000,-263.0190994906038
297,1000,-63.57399225486004
298,1000,-205.91315552125099
299,199,-428.2111858009971
300,130,-490.5419167233798
301,337,-394.6947550827634
302,439,-211.06487605737027
303,101,-499.1634838823195
304,96,-584.6558408190103
305,96,-247.14604711657992
306,139,-412.4269188979139
307,110,-287.08181874989117
308,252,-494.8806353941495
309,111,-281.4320880046
310,284,-306.09952763781416
311,406,-555.9402836899749
312,422,-431.65957306157975
313,389,-319.65051292296926
314,387,-396.67910030923247
315,645,-430.00664623231853
316,183,-281.35820632289233
317,1000,-130.98105725770975
318,570,-341.7982854544435
319,707,-350.1265140720681
320,1000,-70.632332191513
321,1000,-304.9676288547749
322,1000,-152.62678053037553
323,257,-198.66853386217596
324,1000,-193.00948985317316
325,481,-187.84372579721492
326,752,-247.10683535060852
327,1000,-195.11812750344293
328,1000,-83.46787445419857
329,1000,-85.85957557225196
330,344,-273.7024974673201
331,1000,-98.16462715319692
332,1000,-81.78907027063617
333,343,-219.66882892097777
334,1000,-192.36393495074458
335,262,-96.26929197876363
336,1000,-173.1188221936799
337,1000,-112.42613092491742
338,1000,-110.68999982833262
339,392,-181.11825706454087
340,1000,-89.80409340326818
341,200,-181.5483212993845
342,806,-309.20008778689817
343,298,-377.63104627025643
344,236,-77.24435028742553
345,425,-469.0183287420968
346,544,-293.2585509185137
347,197,-207.81932836428138
348,1000,-252.46999714881753
349,1000,-88.20959606994651
350,1000,-100.25834240448165
351,1000,-50.13905958910577
352,1000,-85.95676631931549
353,1000,-71.77297595662014
354,1000,-103.76205974870969
355,1000,-165.50879603720244
356,1000,-49.28432356185472
357,1000,-95.97581627141317
358,132,-96.92474435535145
359,1000,-79.92549206629887
360,1000,-77.07212565533656
361,179,-312.9155170715346
362,1000,-103.12338318398744
363,140,-85.49641965844945
364,1000,-128.18580669833497
365,782,-314.03152111149063
366,181,-197.26614436908085
367,97,-237.5959162787937
368,206,-261.74054437479754
369,1000,-163.85513339676262
370,1000,-80.4229255637931
371,1000,-116.04136613091842
372,1000,-71.62020128447004
373,1000,-113.45111774254288
374,1000,0.5049889712668663
375,1000,-132.95941973913608
376,541,-109.42641766922507
377,1000,-75.5429939340517
378,1000,-53.199454637266804
379,1000,-61.75240316531165
380,1000,-46.75999364446757
381,1000,-198.97776664601662
382,111,-167.94573214435164
383,1000,-71.23033248790183
384,1000,-77.27243186632654
385,1000,-109.16228154295882
386,143,-133.93021216688572
387,443,-278.70654703610614
388,1000,-78.1446442213235
389,228,-93.89298288503902
390,1000,-97.52730501727073
391,1000,-103.9632847653
392,1000,-63.15415588182741
393,1000,-76.5420519406835
394,567,-737.4149420039365
395,998,-352.8578719877703
396,228,-222.14191385731453
397,332,-171.40972438575022
398,448,-242.20051110766644
399,206,-241.75231150294834
400,1000,-107.4912114350919
