episodes,steps,rewards
0,200,-200.0
1,200,-200.0
2,200,-200.0
3,200,-200.0
4,200,-200.0
5,200,-200.0
6,200,-200.0
7,200,-200.0
8,200,-200.0
9,200,-200.0
10,200,-200.0
11,200,-200.0
12,200,-200.0
13,200,-200.0
14,200,-200.0
15,200,-200.0
16,200,-200.0
17,200,-200.0
18,200,-200.0
19,200,-200.0
20,200,-200.0
21,200,-200.0
22,200,-200.0
23,200,-200.0
24,200,-200.0
25,200,-200.0
26,200,-200.0
27,200,-200.0
28,200,-200.0
29,200,-200.0
30,200,-200.0
31,200,-200.0
32,200,-200.0
33,200,-200.0
34,200,-200.0
35,200,-200.0
36,200,-200.0
37,200,-200.0
38,200,-200.0
39,200,-200.0
40,200,-200.0
41,200,-200.0
42,200,-200.0
43,200,-200.0
44,200,-200.0
45,200,-200.0
46,200,-200.0
47,200,-200.0
48,200,-200.0
49,200,-200.0
50,200,-200.0
51,200,-200.0
52,200,-200.0
53,200,-200.0
54,200,-200.0
55,200,-200.0
56,200,-200.0
57,200,-200.0
58,200,-200.0
59,200,-200.0
60,200,-200.0
61,200,-200.0
62,200,-200.0
63,200,-200.0
64,200,-200.0
65,200,-200.0
66,200,-200.0
67,200,-200.0
68,200,-200.0
69,200,-200.0
70,200,-200.0
71,200,-200.0
72,200,-200.0
73,200,-200.0
74,200,-200.0
75,200,-200.0
76,200,-200.0
77,200,-200.0
78,200,-200.0
79,200,-200.0
80,200,-200.0
81,200,-200.0
82,200,-200.0
83,200,-200.0
84,200,-200.0
85,200,-200.0
86,200,-200.0
87,200,-200.0
88,200,-200.0
89,200,-200.0
90,200,-200.0
91,200,-200.0
92,200,-200.0
93,200,-200.0
94,200,-200.0
95,200,-200.0
96,200,-200.0
97,200,-200.0
98,200,-200.0
99,200,-200.0
100,200,-200.0
101,200,-200.0
102,200,-200.0
103,200,-200.0
104,200,-200.0
105,200,-200.0
106,200,-200.0
107,200,-200.0
108,200,-200.0
109,200,-200.0
110,200,-200.0
111,200,-200.0
112,200,-200.0
113,200,-200.0
114,200,-200.0
115,200,-200.0
116,200,-200.0
117,200,-200.0
118,200,-200.0
119,200,-200.0
120,200,-200.0
121,200,-200.0
122,200,-200.0
123,200,-200.0
124,200,-200.0
125,200,-200.0
126,200,-200.0
127,200,-200.0
128,200,-200.0
129,200,-200.0
130,200,-200.0
131,200,-200.0
132,200,-200.0
133,200,-200.0
134,200,-200.0
135,200,-200.0
136,200,-200.0
137,200,-200.0
138,200,-200.0
139,200,-200.0
140,200,-200.0
141,200,-200.0
142,200,-200.0
143,200,-200.0
144,200,-200.0
145,200,-200.0
146,200,-200.0
147,200,-200.0
148,200,-200.0
149,200,-200.0
150,200,-200.0
151,200,-200.0
152,200,-200.0
153,200,-200.0
154,200,-200.0
155,200,-200.0
156,200,-200.0
157,200,-200.0
158,200,-200.0
159,200,-200.0
160,200,-200.0
161,200,-200.0
162,200,-200.0
163,200,-200.0
164,200,-200.0
165,200,-200.0
166,200,-200.0
167,200,-200.0
168,200,-200.0
169,200,-200.0
170,200,-200.0
171,200,-200.0
172,163,-163.0
173,175,-175.0
174,200,-200.0
175,200,-200.0
176,200,-200.0
177,200,-200.0
178,200,-200.0
179,200,-200.0
180,200,-200.0
181,200,-200.0
182,200,-200.0
183,200,-200.0
184,200,-200.0
185,200,-200.0
186,200,-200.0
187,200,-200.0
188,200,-200.0
189,200,-200.0
190,200,-200.0
191,180,-180.0
192,190,-190.0
193,181,-181.0
194,142,-142.0
195,159,-159.0
196,106,-106.0
197,180,-180.0
198,137,-137.0
199,131,-131.0
200,121,-121.0
201,89,-89.0
202,118,-118.0
203,185,-185.0
204,164,-164.0
205,125,-125.0
206,93,-93.0
207,174,-174.0
208,117,-117.0
209,167,-167.0
210,188,-188.0
211,166,-166.0
212,159,-159.0
213,185,-185.0
214,98,-98.0
215,169,-169.0
216,165,-165.0
217,164,-164.0
218,99,-99.0
219,187,-187.0
220,200,-200.0
221,173,-173.0
222,168,-168.0
223,157,-157.0
224,178,-178.0
225,180,-180.0
226,151,-151.0
227,170,-170.0
228,200,-200.0
229,166,-166.0
230,154,-154.0
231,152,-152.0
232,200,-200.0
233,111,-111.0
234,138,-138.0
235,144,-144.0
236,126,-126.0
237,91,-91.0
238,167,-167.0
239,160,-160.0
240,165,-165.0
241,164,-164.0
242,91,-91.0
243,103,-103.0
244,158,-158.0
245,162,-162.0
246,156,-156.0
247,164,-164.0
248,115,-115.0
249,165,-165.0
250,162,-162.0
251,160,-160.0
252,168,-168.0
253,178,-178.0
254,175,-175.0
255,192,-192.0
256,118,-118.0
257,89,-89.0
258,163,-163.0
259,120,-120.0
260,200,-200.0
261,87,-87.0
262,158,-158.0
263,88,-88.0
264,135,-135.0
265,200,-200.0
266,87,-87.0
267,96,-96.0
268,140,-140.0
269,105,-105.0
270,163,-163.0
271,115,-115.0
272,168,-168.0
273,162,-162.0
274,156,-156.0
275,185,-185.0
276,165,-165.0
277,200,-200.0
278,157,-157.0
279,163,-163.0
280,161,-161.0
281,174,-174.0
282,161,-161.0
283,200,-200.0
284,200,-200.0
285,86,-86.0
286,84,-84.0
287,172,-172.0
288,88,-88.0
289,119,-119.0
290,119,-119.0
291,124,-124.0
292,178,-178.0
293,86,-86.0
294,154,-154.0
295,166,-166.0
296,115,-115.0
297,200,-200.0
298,158,-158.0
299,161,-161.0
300,110,-110.0
301,104,-104.0
302,155,-155.0
303,138,-138.0
304,145,-145.0
305,200,-200.0
306,161,-161.0
307,153,-153.0
308,88,-88.0
309,169,-169.0
310,161,-161.0
311,140,-140.0
312,166,-166.0
313,155,-155.0
314,148,-148.0
315,104,-104.0
316,157,-157.0
317,152,-152.0
318,154,-154.0
319,86,-86.0
320,155,-155.0
321,145,-145.0
322,173,-173.0
323,200,-200.0
324,141,-141.0
325,200,-200.0
326,200,-200.0
327,150,-150.0
328,86,-86.0
329,93,-93.0
330,145,-145.0
331,144,-144.0
332,88,-88.0
333,147,-147.0
334,142,-142.0
335,200,-200.0
336,98,-98.0
337,132,-132.0
338,146,-146.0
339,200,-200.0
340,143,-143.0
341,148,-148.0
342,153,-153.0
343,143,-143.0
344,138,-138.0
345,110,-110.0
346,89,-89.0
347,188,-188.0
348,146,-146.0
349,164,-164.0
350,146,-146.0
351,153,-153.0
352,143,-143.0
353,119,-119.0
354,155,-155.0
355,111,-111.0
356,156,-156.0
357,200,-200.0
358,109,-109.0
359,149,-149.0
360,176,-176.0
361,148,-148.0
362,154,-154.0
363,126,-126.0
364,200,-200.0
365,145,-145.0
366,141,-141.0
367,123,-123.0
368,89,-89.0
369,144,-144.0
370,88,-88.0
371,140,-140.0
372,90,-90.0
373,200,-200.0
374,88,-88.0
375,181,-181.0
376,145,-145.0
377,103,-103.0
378,98,-98.0
379,87,-87.0
380,139,-139.0
381,152,-152.0
382,88,-88.0
383,107,-107.0
384,200,-200.0
385,157,-157.0
386,149,-149.0
387,145,-145.0
388,157,-157.0
389,100,-100.0
390,200,-200.0
391,91,-91.0
392,121,-121.0
393,124,-124.0
394,144,-144.0
395,150,-150.0
396,164,-164.0
397,91,-91.0
398,200,-200.0
399,200,-200.0
400,100,-100.0
401,142,-142.0
402,116,-116.0
403,87,-87.0
404,85,-85.0
405,90,-90.0
406,172,-172.0
407,144,-144.0
408,167,-167.0
409,108,-108.0
410,151,-151.0
411,88,-88.0
412,100,-100.0
413,152,-152.0
414,147,-147.0
415,88,-88.0
416,144,-144.0
417,200,-200.0
418,107,-107.0
419,156,-156.0
420,90,-90.0
421,149,-149.0
422,140,-140.0
423,105,-105.0
424,152,-152.0
425,146,-146.0
426,200,-200.0
427,154,-154.0
428,141,-141.0
429,148,-148.0
430,96,-96.0
431,147,-147.0
432,146,-146.0
433,200,-200.0
434,148,-148.0
435,154,-154.0
436,200,-200.0
437,200,-200.0
438,153,-153.0
439,149,-149.0
440,94,-94.0
441,144,-144.0
442,154,-154.0
443,181,-181.0
444,143,-143.0
445,88,-88.0
446,149,-149.0
447,141,-141.0
448,148,-148.0
449,90,-90.0
450,146,-146.0
451,156,-156.0
452,154,-154.0
453,85,-85.0
454,109,-109.0
455,89,-89.0
456,166,-166.0
457,147,-147.0
458,89,-89.0
459,144,-144.0
460,96,-96.0
461,200,-200.0
462,150,-150.0
463,186,-186.0
464,152,-152.0
465,200,-200.0
466,145,-145.0
467,96,-96.0
468,200,-200.0
469,108,-108.0
470,148,-148.0
471,145,-145.0
472,150,-150.0
473,141,-141.0
474,140,-140.0
475,150,-150.0
476,99,-99.0
477,148,-148.0
478,135,-135.0
479,174,-174.0
480,85,-85.0
481,155,-155.0
482,87,-87.0
483,147,-147.0
484,200,-200.0
485,113,-113.0
486,200,-200.0
487,86,-86.0
488,92,-92.0
489,93,-93.0
490,149,-149.0
491,84,-84.0
492,153,-153.0
493,155,-155.0
494,114,-114.0
495,158,-158.0
496,131,-131.0
497,86,-86.0
498,99,-99.0
499,101,-101.0
500,97,-97.0
501,163,-163.0
502,151,-151.0
503,94,-94.0
504,151,-151.0
505,148,-148.0
506,147,-147.0
507,150,-150.0
508,151,-151.0
509,95,-95.0
510,98,-98.0
511,90,-90.0
512,91,-91.0
513,124,-124.0
514,153,-153.0
515,167,-167.0
516,118,-118.0
517,153,-153.0
518,155,-155.0
519,156,-156.0
520,87,-87.0
521,143,-143.0
522,145,-145.0
523,153,-153.0
524,98,-98.0
525,146,-146.0
526,143,-143.0
527,150,-150.0
528,147,-147.0
529,151,-151.0
530,90,-90.0
531,86,-86.0
532,142,-142.0
533,146,-146.0
534,155,-155.0
535,85,-85.0
536,138,-138.0
537,153,-153.0
538,200,-200.0
539,148,-148.0
540,92,-92.0
541,147,-147.0
542,179,-179.0
543,92,-92.0
544,152,-152.0
545,175,-175.0
546,200,-200.0
547,93,-93.0
548,95,-95.0
549,152,-152.0
550,148,-148.0
551,147,-147.0
552,84,-84.0
553,152,-152.0
554,145,-145.0
555,112,-112.0
556,89,-89.0
557,178,-178.0
558,149,-149.0
559,143,-143.0
560,145,-145.0
561,145,-145.0
562,155,-155.0
563,146,-146.0
564,155,-155.0
565,153,-153.0
566,86,-86.0
567,145,-145.0
568,150,-150.0
569,146,-146.0
570,144,-144.0
571,144,-144.0
572,119,-119.0
573,154,-154.0
574,138,-138.0
575,146,-146.0
576,150,-150.0
577,95,-95.0
578,146,-146.0
579,145,-145.0
580,148,-148.0
581,119,-119.0
582,95,-95.0
583,88,-88.0
584,86,-86.0
585,143,-143.0
586,91,-91.0
587,170,-170.0
588,94,-94.0
589,85,-85.0
590,84,-84.0
591,88,-88.0
592,143,-143.0
593,150,-150.0
594,186,-186.0
595,145,-145.0
596,146,-146.0
597,147,-147.0
598,144,-144.0
599,149,-149.0
600,144,-144.0
601,146,-146.0
602,90,-90.0
603,179,-179.0
604,83,-83.0
605,86,-86.0
606,141,-141.0
607,143,-143.0
608,89,-89.0
609,149,-149.0
610,142,-142.0
611,99,-99.0
612,142,-142.0
613,98,-98.0
614,150,-150.0
615,146,-146.0
616,141,-141.0
617,142,-142.0
618,140,-140.0
619,90,-90.0
620,139,-139.0
621,139,-139.0
622,91,-91.0
623,110,-110.0
624,140,-140.0
625,138,-138.0
626,140,-140.0
627,140,-140.0
628,140,-140.0
629,107,-107.0
630,91,-91.0
631,147,-147.0
632,92,-92.0
633,144,-144.0
634,85,-85.0
635,84,-84.0
636,143,-143.0
637,142,-142.0
638,139,-139.0
639,140,-140.0
640,89,-89.0
641,85,-85.0
642,178,-178.0
643,140,-140.0
644,84,-84.0
645,141,-141.0
646,84,-84.0
647,143,-143.0
648,143,-143.0
649,109,-109.0
650,141,-141.0
651,140,-140.0
652,91,-91.0
653,140,-140.0
654,147,-147.0
655,83,-83.0
656,140,-140.0
657,103,-103.0
658,102,-102.0
659,85,-85.0
660,141,-141.0
661,94,-94.0
662,90,-90.0
663,141,-141.0
664,143,-143.0
665,165,-165.0
666,90,-90.0
667,139,-139.0
668,151,-151.0
669,97,-97.0
670,139,-139.0
671,140,-140.0
672,84,-84.0
673,146,-146.0
674,87,-87.0
675,90,-90.0
676,94,-94.0
677,140,-140.0
678,159,-159.0
679,140,-140.0
680,139,-139.0
681,94,-94.0
682,140,-140.0
683,140,-140.0
684,146,-146.0
685,96,-96.0
686,139,-139.0
687,85,-85.0
688,141,-141.0
689,153,-153.0
690,84,-84.0
691,150,-150.0
692,142,-142.0
693,142,-142.0
694,86,-86.0
695,140,-140.0
696,164,-164.0
697,146,-146.0
698,139,-139.0
699,142,-142.0
700,106,-106.0
