episodes,steps,rewards
0,200,-200.0
1,200,-200.0
2,200,-200.0
3,200,-200.0
4,200,-200.0
5,200,-200.0
6,200,-200.0
7,200,-200.0
8,200,-200.0
9,200,-200.0
10,200,-200.0
11,200,-200.0
12,200,-200.0
13,200,-200.0
14,200,-200.0
15,200,-200.0
16,200,-200.0
17,200,-200.0
18,200,-200.0
19,200,-200.0
20,200,-200.0
21,200,-200.0
22,200,-200.0
23,200,-200.0
24,200,-200.0
25,200,-200.0
26,200,-200.0
27,200,-200.0
28,200,-200.0
29,200,-200.0
30,200,-200.0
31,200,-200.0
32,200,-200.0
33,200,-200.0
34,200,-200.0
35,200,-200.0
36,200,-200.0
37,200,-200.0
38,200,-200.0
39,200,-200.0
40,200,-200.0
41,200,-200.0
42,200,-200.0
43,200,-200.0
44,200,-200.0
45,200,-200.0
46,200,-200.0
47,200,-200.0
48,200,-200.0
49,200,-200.0
50,200,-200.0
51,200,-200.0
52,200,-200.0
53,200,-200.0
54,200,-200.0
55,200,-200.0
56,200,-200.0
57,200,-200.0
58,200,-200.0
59,200,-200.0
60,200,-200.0
61,200,-200.0
62,200,-200.0
63,200,-200.0
64,200,-200.0
65,200,-200.0
66,200,-200.0
67,200,-200.0
68,200,-200.0
69,200,-200.0
70,200,-200.0
71,200,-200.0
72,200,-200.0
73,200,-200.0
74,200,-200.0
75,200,-200.0
76,200,-200.0
77,200,-200.0
78,200,-200.0
79,200,-200.0
80,200,-200.0
81,200,-200.0
82,200,-200.0
83,200,-200.0
84,200,-200.0
85,200,-200.0
86,200,-200.0
87,200,-200.0
88,200,-200.0
89,200,-200.0
90,200,-200.0
91,200,-200.0
92,200,-200.0
93,200,-200.0
94,200,-200.0
95,200,-200.0
96,200,-200.0
97,195,-195.0
98,200,-200.0
99,200,-200.0
100,200,-200.0
101,200,-200.0
102,200,-200.0
103,200,-200.0
104,200,-200.0
105,200,-200.0
106,200,-200.0
107,200,-200.0
108,200,-200.0
109,192,-192.0
110,200,-200.0
111,200,-200.0
112,200,-200.0
113,200,-200.0
114,200,-200.0
115,200,-200.0
116,200,-200.0
117,200,-200.0
118,200,-200.0
119,200,-200.0
120,200,-200.0
121,200,-200.0
122,200,-200.0
123,200,-200.0
124,120,-120.0
125,200,-200.0
126,200,-200.0
127,200,-200.0
128,200,-200.0
129,200,-200.0
130,200,-200.0
131,200,-200.0
132,200,-200.0
133,200,-200.0
134,192,-192.0
135,200,-200.0
136,200,-200.0
137,200,-200.0
138,200,-200.0
139,200,-200.0
140,200,-200.0
141,200,-200.0
142,148,-148.0
143,189,-189.0
144,200,-200.0
145,200,-200.0
146,200,-200.0
147,200,-200.0
148,200,-200.0
149,200,-200.0
150,200,-200.0
151,200,-200.0
152,200,-200.0
153,200,-200.0
154,200,-200.0
155,200,-200.0
156,200,-200.0
157,200,-200.0
158,200,-200.0
159,200,-200.0
160,200,-200.0
161,200,-200.0
162,200,-200.0
163,200,-200.0
164,200,-200.0
165,200,-200.0
166,200,-200.0
167,200,-200.0
168,200,-200.0
169,200,-200.0
170,200,-200.0
171,153,-153.0
172,200,-200.0
173,200,-200.0
174,191,-191.0
175,150,-150.0
176,200,-200.0
177,200,-200.0
178,151,-151.0
179,200,-200.0
180,145,-145.0
181,199,-199.0
182,200,-200.0
183,200,-200.0
184,119,-119.0
185,200,-200.0
186,200,-200.0
187,200,-200.0
188,150,-150.0
189,122,-122.0
190,200,-200.0
191,157,-157.0
192,200,-200.0
193,163,-163.0
194,200,-200.0
195,200,-200.0
196,156,-156.0
197,161,-161.0
198,150,-150.0
199,198,-198.0
200,147,-147.0
201,137,-137.0
202,150,-150.0
203,190,-190.0
204,200,-200.0
205,136,-136.0
206,141,-141.0
207,200,-200.0
208,200,-200.0
209,200,-200.0
210,200,-200.0
211,141,-141.0
212,200,-200.0
213,200,-200.0
214,147,-147.0
215,200,-200.0
216,147,-147.0
217,146,-146.0
218,147,-147.0
219,149,-149.0
220,200,-200.0
221,167,-167.0
222,137,-137.0
223,175,-175.0
224,152,-152.0
225,131,-131.0
226,170,-170.0
227,140,-140.0
228,187,-187.0
229,142,-142.0
230,200,-200.0
231,123,-123.0
232,183,-183.0
233,200,-200.0
234,121,-121.0
235,92,-92.0
236,197,-197.0
237,169,-169.0
238,179,-179.0
239,187,-187.0
240,163,-163.0
241,154,-154.0
242,153,-153.0
243,187,-187.0
244,171,-171.0
245,122,-122.0
246,118,-118.0
247,200,-200.0
248,164,-164.0
249,129,-129.0
250,200,-200.0
251,118,-118.0
252,166,-166.0
253,117,-117.0
254,185,-185.0
255,117,-117.0
256,112,-112.0
257,168,-168.0
258,108,-108.0
259,156,-156.0
260,138,-138.0
261,199,-199.0
262,200,-200.0
263,161,-161.0
264,162,-162.0
265,154,-154.0
266,158,-158.0
267,134,-134.0
268,197,-197.0
269,166,-166.0
270,165,-165.0
271,89,-89.0
272,163,-163.0
273,157,-157.0
274,122,-122.0
275,162,-162.0
276,165,-165.0
277,183,-183.0
278,161,-161.0
279,170,-170.0
280,152,-152.0
281,142,-142.0
282,92,-92.0
283,167,-167.0
284,147,-147.0
285,181,-181.0
286,149,-149.0
287,200,-200.0
288,168,-168.0
289,173,-173.0
290,86,-86.0
291,157,-157.0
292,153,-153.0
293,86,-86.0
294,181,-181.0
295,151,-151.0
296,157,-157.0
297,160,-160.0
298,103,-103.0
299,147,-147.0
300,181,-181.0
301,158,-158.0
302,99,-99.0
303,158,-158.0
304,157,-157.0
305,152,-152.0
306,85,-85.0
307,85,-85.0
308,159,-159.0
309,87,-87.0
310,89,-89.0
311,175,-175.0
312,158,-158.0
313,154,-154.0
314,200,-200.0
315,95,-95.0
316,139,-139.0
317,200,-200.0
318,105,-105.0
319,163,-163.0
320,179,-179.0
321,176,-176.0
322,95,-95.0
323,85,-85.0
324,143,-143.0
325,148,-148.0
326,143,-143.0
327,170,-170.0
328,164,-164.0
329,139,-139.0
330,84,-84.0
331,86,-86.0
332,88,-88.0
333,163,-163.0
334,100,-100.0
335,174,-174.0
336,138,-138.0
337,154,-154.0
338,151,-151.0
339,157,-157.0
340,200,-200.0
341,147,-147.0
342,89,-89.0
343,94,-94.0
344,147,-147.0
345,147,-147.0
346,159,-159.0
347,84,-84.0
348,200,-200.0
349,150,-150.0
350,115,-115.0
351,150,-150.0
352,144,-144.0
353,83,-83.0
354,97,-97.0
355,150,-150.0
356,150,-150.0
357,159,-159.0
358,94,-94.0
359,143,-143.0
360,152,-152.0
361,142,-142.0
362,200,-200.0
363,145,-145.0
364,173,-173.0
365,158,-158.0
366,181,-181.0
367,96,-96.0
368,149,-149.0
369,147,-147.0
370,89,-89.0
371,110,-110.0
372,155,-155.0
373,153,-153.0
374,161,-161.0
375,151,-151.0
376,182,-182.0
377,152,-152.0
378,85,-85.0
379,157,-157.0
380,179,-179.0
381,150,-150.0
382,155,-155.0
383,185,-185.0
384,142,-142.0
385,86,-86.0
386,154,-154.0
387,104,-104.0
388,145,-145.0
389,114,-114.0
390,106,-106.0
391,114,-114.0
392,200,-200.0
393,140,-140.0
394,149,-149.0
395,156,-156.0
396,87,-87.0
397,89,-89.0
398,144,-144.0
399,118,-118.0
400,92,-92.0
401,159,-159.0
402,143,-143.0
403,165,-165.0
404,97,-97.0
405,161,-161.0
406,102,-102.0
407,143,-143.0
408,152,-152.0
409,162,-162.0
410,93,-93.0
411,166,-166.0
412,170,-170.0
413,165,-165.0
414,172,-172.0
415,161,-161.0
416,164,-164.0
417,162,-162.0
418,149,-149.0
419,149,-149.0
420,143,-143.0
421,159,-159.0
422,104,-104.0
423,157,-157.0
424,153,-153.0
425,86,-86.0
426,161,-161.0
427,148,-148.0
428,92,-92.0
429,84,-84.0
430,178,-178.0
431,151,-151.0
432,144,-144.0
433,148,-148.0
434,169,-169.0
435,105,-105.0
436,150,-150.0
437,139,-139.0
438,147,-147.0
439,85,-85.0
440,176,-176.0
441,89,-89.0
442,167,-167.0
443,97,-97.0
444,173,-173.0
445,153,-153.0
446,102,-102.0
447,154,-154.0
448,200,-200.0
449,150,-150.0
450,159,-159.0
451,163,-163.0
452,136,-136.0
453,155,-155.0
454,84,-84.0
455,89,-89.0
456,84,-84.0
457,86,-86.0
458,151,-151.0
459,148,-148.0
460,110,-110.0
461,143,-143.0
462,116,-116.0
463,109,-109.0
464,107,-107.0
465,154,-154.0
466,164,-164.0
467,147,-147.0
468,142,-142.0
469,138,-138.0
470,142,-142.0
471,94,-94.0
472,153,-153.0
473,144,-144.0
474,179,-179.0
475,160,-160.0
476,102,-102.0
477,157,-157.0
478,144,-144.0
479,88,-88.0
480,95,-95.0
481,143,-143.0
482,87,-87.0
483,145,-145.0
484,95,-95.0
485,155,-155.0
486,139,-139.0
487,140,-140.0
488,143,-143.0
489,152,-152.0
490,92,-92.0
491,149,-149.0
492,87,-87.0
493,143,-143.0
494,143,-143.0
495,145,-145.0
496,200,-200.0
497,96,-96.0
498,91,-91.0
499,158,-158.0
500,147,-147.0
501,108,-108.0
502,90,-90.0
503,152,-152.0
504,91,-91.0
505,139,-139.0
506,140,-140.0
507,90,-90.0
508,144,-144.0
509,154,-154.0
510,139,-139.0
511,147,-147.0
512,161,-161.0
513,147,-147.0
514,139,-139.0
515,91,-91.0
516,86,-86.0
517,144,-144.0
518,158,-158.0
519,90,-90.0
520,139,-139.0
521,118,-118.0
522,90,-90.0
523,113,-113.0
524,141,-141.0
525,152,-152.0
526,94,-94.0
527,147,-147.0
528,146,-146.0
529,161,-161.0
530,153,-153.0
531,156,-156.0
532,155,-155.0
533,150,-150.0
534,101,-101.0
535,94,-94.0
536,145,-145.0
537,139,-139.0
538,120,-120.0
539,85,-85.0
540,152,-152.0
541,84,-84.0
542,147,-147.0
543,150,-150.0
544,85,-85.0
545,123,-123.0
546,170,-170.0
547,157,-157.0
548,84,-84.0
549,165,-165.0
550,162,-162.0
551,145,-145.0
552,104,-104.0
553,88,-88.0
554,200,-200.0
555,139,-139.0
556,95,-95.0
557,143,-143.0
558,200,-200.0
559,105,-105.0
560,97,-97.0
561,148,-148.0
562,167,-167.0
563,140,-140.0
564,94,-94.0
565,159,-159.0
566,90,-90.0
567,147,-147.0
568,165,-165.0
569,148,-148.0
570,143,-143.0
571,144,-144.0
572,200,-200.0
573,146,-146.0
574,84,-84.0
575,150,-150.0
576,85,-85.0
577,151,-151.0
578,84,-84.0
579,152,-152.0
580,148,-148.0
581,90,-90.0
582,160,-160.0
583,91,-91.0
584,152,-152.0
585,107,-107.0
586,156,-156.0
587,92,-92.0
588,161,-161.0
589,189,-189.0
590,129,-129.0
591,133,-133.0
592,142,-142.0
593,159,-159.0
594,147,-147.0
595,152,-152.0
596,145,-145.0
597,141,-141.0
598,88,-88.0
599,160,-160.0
600,106,-106.0
601,146,-146.0
602,98,-98.0
603,148,-148.0
604,85,-85.0
605,142,-142.0
606,143,-143.0
607,149,-149.0
608,163,-163.0
609,109,-109.0
610,134,-134.0
611,86,-86.0
612,131,-131.0
613,146,-146.0
614,91,-91.0
615,108,-108.0
616,138,-138.0
617,161,-161.0
618,145,-145.0
619,89,-89.0
620,146,-146.0
621,139,-139.0
622,131,-131.0
623,89,-89.0
624,90,-90.0
625,165,-165.0
626,143,-143.0
627,168,-168.0
628,129,-129.0
629,90,-90.0
630,145,-145.0
631,145,-145.0
632,93,-93.0
633,104,-104.0
634,161,-161.0
635,92,-92.0
636,94,-94.0
637,167,-167.0
638,88,-88.0
639,152,-152.0
640,135,-135.0
641,90,-90.0
642,92,-92.0
643,91,-91.0
644,147,-147.0
645,101,-101.0
646,140,-140.0
647,145,-145.0
648,87,-87.0
649,96,-96.0
650,143,-143.0
651,145,-145.0
652,135,-135.0
653,154,-154.0
654,170,-170.0
655,87,-87.0
656,141,-141.0
657,103,-103.0
658,142,-142.0
659,144,-144.0
660,112,-112.0
661,169,-169.0
662,165,-165.0
663,149,-149.0
664,145,-145.0
665,86,-86.0
666,146,-146.0
667,162,-162.0
668,164,-164.0
669,141,-141.0
670,154,-154.0
671,87,-87.0
672,141,-141.0
673,143,-143.0
674,146,-146.0
675,87,-87.0
676,97,-97.0
677,142,-142.0
678,94,-94.0
679,166,-166.0
680,143,-143.0
681,87,-87.0
682,139,-139.0
683,164,-164.0
684,88,-88.0
685,140,-140.0
686,146,-146.0
687,147,-147.0
688,175,-175.0
689,200,-200.0
690,140,-140.0
691,89,-89.0
692,139,-139.0
693,142,-142.0
694,94,-94.0
695,100,-100.0
696,162,-162.0
697,144,-144.0
698,150,-150.0
699,137,-137.0
700,99,-99.0
701,137,-137.0
702,135,-135.0
703,140,-140.0
704,148,-148.0
705,144,-144.0
706,141,-141.0
707,139,-139.0
708,90,-90.0
709,152,-152.0
710,146,-146.0
711,142,-142.0
712,150,-150.0
713,144,-144.0
714,90,-90.0
715,93,-93.0
716,146,-146.0
717,145,-145.0
718,158,-158.0
719,146,-146.0
720,145,-145.0
721,142,-142.0
722,145,-145.0
723,144,-144.0
724,149,-149.0
725,155,-155.0
726,155,-155.0
727,151,-151.0
728,102,-102.0
729,188,-188.0
730,86,-86.0
731,140,-140.0
732,84,-84.0
733,147,-147.0
734,200,-200.0
735,189,-189.0
736,146,-146.0
737,151,-151.0
738,97,-97.0
739,200,-200.0
740,85,-85.0
741,97,-97.0
742,177,-177.0
743,141,-141.0
744,153,-153.0
745,140,-140.0
746,152,-152.0
747,139,-139.0
748,141,-141.0
749,142,-142.0
750,144,-144.0
751,137,-137.0
752,143,-143.0
753,146,-146.0
754,146,-146.0
755,149,-149.0
756,154,-154.0
757,200,-200.0
758,147,-147.0
759,156,-156.0
760,200,-200.0
761,200,-200.0
762,151,-151.0
763,97,-97.0
764,160,-160.0
765,200,-200.0
766,92,-92.0
767,153,-153.0
768,146,-146.0
769,200,-200.0
770,150,-150.0
771,150,-150.0
772,200,-200.0
773,149,-149.0
774,148,-148.0
775,200,-200.0
776,200,-200.0
777,156,-156.0
778,150,-150.0
779,144,-144.0
780,147,-147.0
781,147,-147.0
782,143,-143.0
783,153,-153.0
784,153,-153.0
785,158,-158.0
786,156,-156.0
787,149,-149.0
788,157,-157.0
789,160,-160.0
790,158,-158.0
791,159,-159.0
792,84,-84.0
793,92,-92.0
794,162,-162.0
795,148,-148.0
796,169,-169.0
797,142,-142.0
798,156,-156.0
799,200,-200.0
800,161,-161.0
801,200,-200.0
802,160,-160.0
803,173,-173.0
804,152,-152.0
805,90,-90.0
806,145,-145.0
807,148,-148.0
808,171,-171.0
809,151,-151.0
810,157,-157.0
811,146,-146.0
812,152,-152.0
813,151,-151.0
814,144,-144.0
815,99,-99.0
816,162,-162.0
817,153,-153.0
818,162,-162.0
819,152,-152.0
820,164,-164.0
821,146,-146.0
822,169,-169.0
823,156,-156.0
824,141,-141.0
825,160,-160.0
826,88,-88.0
827,167,-167.0
828,144,-144.0
829,148,-148.0
830,145,-145.0
831,173,-173.0
832,104,-104.0
833,161,-161.0
834,156,-156.0
835,125,-125.0
836,97,-97.0
837,100,-100.0
838,91,-91.0
839,158,-158.0
840,159,-159.0
841,150,-150.0
842,86,-86.0
843,85,-85.0
844,155,-155.0
845,162,-162.0
846,93,-93.0
847,150,-150.0
848,148,-148.0
849,155,-155.0
850,146,-146.0
851,87,-87.0
852,161,-161.0
853,89,-89.0
854,161,-161.0
855,93,-93.0
856,131,-131.0
857,146,-146.0
858,167,-167.0
859,123,-123.0
860,155,-155.0
861,150,-150.0
862,162,-162.0
863,159,-159.0
864,85,-85.0
865,200,-200.0
866,200,-200.0
867,183,-183.0
868,155,-155.0
869,170,-170.0
870,157,-157.0
871,200,-200.0
872,84,-84.0
873,200,-200.0
874,126,-126.0
875,152,-152.0
876,179,-179.0
877,200,-200.0
878,157,-157.0
879,107,-107.0
880,187,-187.0
881,178,-178.0
882,200,-200.0
883,163,-163.0
884,176,-176.0
885,171,-171.0
886,126,-126.0
887,88,-88.0
888,107,-107.0
889,180,-180.0
890,141,-141.0
891,141,-141.0
892,153,-153.0
893,88,-88.0
894,140,-140.0
895,114,-114.0
896,109,-109.0
897,99,-99.0
898,94,-94.0
899,148,-148.0
900,154,-154.0
901,147,-147.0
902,160,-160.0
903,172,-172.0
904,100,-100.0
905,150,-150.0
906,162,-162.0
907,89,-89.0
908,180,-180.0
909,84,-84.0
910,90,-90.0
911,172,-172.0
912,175,-175.0
913,112,-112.0
914,139,-139.0
915,145,-145.0
916,84,-84.0
917,158,-158.0
918,176,-176.0
919,160,-160.0
920,115,-115.0
921,200,-200.0
922,136,-136.0
923,173,-173.0
924,139,-139.0
925,86,-86.0
926,200,-200.0
927,143,-143.0
928,150,-150.0
929,137,-137.0
930,118,-118.0
931,100,-100.0
932,200,-200.0
933,152,-152.0
934,136,-136.0
935,139,-139.0
936,129,-129.0
937,171,-171.0
938,148,-148.0
939,153,-153.0
940,136,-136.0
941,91,-91.0
942,131,-131.0
943,145,-145.0
944,139,-139.0
945,156,-156.0
946,130,-130.0
947,120,-120.0
948,170,-170.0
949,161,-161.0
950,99,-99.0
951,138,-138.0
952,185,-185.0
953,200,-200.0
954,142,-142.0
955,146,-146.0
956,90,-90.0
957,141,-141.0
958,159,-159.0
959,95,-95.0
960,154,-154.0
961,200,-200.0
962,155,-155.0
963,93,-93.0
964,143,-143.0
965,144,-144.0
966,118,-118.0
967,141,-141.0
968,141,-141.0
969,165,-165.0
970,87,-87.0
971,114,-114.0
972,93,-93.0
973,148,-148.0
974,144,-144.0
975,163,-163.0
976,110,-110.0
977,175,-175.0
978,149,-149.0
979,94,-94.0
980,151,-151.0
981,124,-124.0
982,155,-155.0
983,110,-110.0
984,144,-144.0
985,87,-87.0
986,102,-102.0
987,126,-126.0
988,156,-156.0
989,103,-103.0
990,141,-141.0
991,88,-88.0
992,145,-145.0
993,113,-113.0
994,153,-153.0
995,154,-154.0
996,92,-92.0
997,93,-93.0
998,144,-144.0
999,112,-112.0
1000,93,-93.0
