{
    "model_info": "common16",
    "episodes": [
        25,
        30,
        19,
        47,
        26,
        33,
        37,
        54,
        48,
        45,
        59,
        78,
        51,
        41,
        60,
        38,
        42,
        187,
        46,
        96,
        75,
        47,
        39,
        25,
        103,
        38,
        35,
        28,
        56,
        43,
        31,
        36,
        31,
        25,
        20,
        30,
        50,
        31,
        29,
        33,
        38,
        26,
        30,
        18,
        25,
        18,
        29,
        30,
        30,
        22,
        25,
        23,
        18,
        25,
        36,
        43,
        32,
        18,
        24,
        34,
        35,
        22,
        19,
        46,
        24,
        42,
        30,
        35,
        34,
        46,
        33,
        42,
        54,
        43,
        45,
        62,
        120,
        52,
        108,
        44,
        72,
        52,
        81,
        67,
        71,
        72,
        86,
        96,
        66,
        47,
        39,
        73,
        79,
        24,
        34,
        99,
        92,
        232,
        71,
        83,
        62,
        128,
        80,
        74,
        99,
        72,
        103,
        150,
        64,
        47,
        138,
        101,
        86,
        54,
        95,
        199,
        150,
        137,
        91,
        74,
        105,
        160,
        83,
        112,
        194,
        99,
        79,
        116,
        139,
        119,
        130,
        114,
        160,
        164,
        124,
        139,
        128,
        125,
        123,
        50,
        91,
        76,
        50,
        109,
        114,
        82,
        116,
        116,
        92,
        73,
        115,
        107,
        424,
        109,
        149,
        119,
        111,
        116,
        138,
        139,
        115,
        113,
        132,
        143,
        108,
        151,
        121,
        135,
        142,
        131,
        130,
        110,
        111,
        113,
        79,
        104,
        94,
        81,
        86,
        83,
        43,
        98,
        126,
        106,
        43,
        100,
        102,
        95,
        41,
        83,
        87,
        45,
        99,
        41,
        103,
        101,
        37,
        103,
        102,
        49,
        104,
        123,
        106,
        68,
        105,
        106,
        117,
        110,
        128,
        105,
        121,
        128,
        109,
        115,
        104,
        103,
        71,
        126,
        118,
        51,
        140,
        116,
        138,
        104,
        101,
        116,
        108,
        112,
        120,
        96,
        50,
        104,
        118,
        99,
        104,
        107,
        108,
        122,
        105,
        124,
        137,
        110,
        117,
        112,
        123,
        126,
        137,
        122,
        120,
        103,
        116,
        111,
        106,
        97,
        110,
        119,
        107,
        98,
        112,
        103,
        65,
        118,
        127,
        115,
        123,
        124,
        127,
        125,
        115,
        93,
        140,
        109,
        112,
        137,
        146,
        119,
        118,
        115,
        113,
        129,
        118,
        119,
        127,
        141,
        149,
        129,
        176,
        178,
        163,
        176,
        135,
        164,
        185,
        106,
        121,
        191,
        113,
        126,
        225,
        127,
        159,
        165,
        156,
        255,
        134,
        159,
        150,
        156,
        204,
        136,
        143,
        192,
        121,
        130,
        140,
        160,
        130,
        141,
        138,
        122,
        169,
        109,
        125,
        121,
        110,
        119,
        128,
        123,
        111,
        131,
        145,
        143,
        122,
        132,
        124,
        126,
        133,
        99,
        118,
        129,
        117,
        107,
        154,
        126,
        129,
        116,
        117,
        101,
        109,
        104,
        109,
        30,
        118,
        103,
        110,
        114,
        111,
        123,
        109,
        110,
        100,
        96,
        111,
        121,
        114,
        122,
        131,
        140,
        121,
        128,
        165,
        158,
        146,
        140,
        162,
        137,
        145,
        141,
        147,
        152,
        144,
        147,
        142,
        133,
        135,
        147,
        131,
        136,
        148,
        136,
        155,
        158,
        156,
        158,
        145,
        174,
        178,
        182,
        193,
        172,
        173,
        195,
        192,
        204,
        239,
        469,
        214,
        202,
        267,
        226,
        201,
        261,
        339,
        387,
        289,
        268,
        298,
        122,
        500,
        500,
        500,
        314,
        237,
        287,
        449,
        251,
        142,
        296,
        221,
        198,
        183,
        174,
        256,
        317,
        243,
        245,
        243,
        291,
        308,
        251,
        249,
        296,
        232,
        178,
        261,
        229,
        133,
        148,
        127,
        116,
        110,
        127,
        127,
        134,
        175,
        135,
        32,
        144,
        134,
        126,
        133,
        121,
        123,
        139,
        141,
        146,
        126,
        135,
        130,
        117,
        130,
        109,
        106,
        37,
        115,
        39,
        115,
        123,
        115,
        129,
        136,
        148,
        121,
        128,
        150,
        133,
        139,
        133,
        143,
        144,
        141,
        162,
        137,
        170,
        159,
        159,
        152,
        36,
        160,
        156,
        164,
        171,
        171,
        178,
        177,
        167,
        173,
        182,
        173,
        164,
        182,
        186,
        180,
        185,
        167,
        186,
        180,
        185,
        179,
        186,
        176,
        185,
        181,
        173,
        187,
        193,
        195,
        198,
        193,
        186,
        188,
        240,
        241,
        270,
        307,
        326,
        318,
        254,
        323,
        319,
        330,
        337,
        427,
        500,
        478,
        500,
        500,
        500,
        500,
        500,
        500,
        500,
        500,
        500,
        500,
        500,
        500,
        500,
        500,
        500,
        500,
        500,
        500,
        500,
        500,
        335,
        500,
        500,
        500,
        500,
        500,
        500,
        500,
        415,
        500,
        500,
        294,
        500,
        142,
        419,
        500,
        500,
        500,
        500,
        258,
        500,
        500,
        500,
        500,
        500,
        500,
        478,
        500,
        500,
        500,
        500,
        500,
        500,
        500,
        500,
        500,
        403,
        279,
        223,
        173,
        181,
        24,
        156,
        154,
        15,
        151,
        20,
        21,
        143,
        28,
        22,
        150,
        19,
        18,
        16,
        18,
        19,
        148,
        164,
        158,
        16,
        23,
        177,
        20,
        23,
        169,
        18,
        24,
        154,
        23,
        25,
        170,
        182,
        183,
        172,
        180,
        244,
        192,
        191,
        233,
        210,
        250,
        264,
        358,
        286,
        394,
        409,
        417,
        400,
        452,
        82,
        500,
        402,
        470,
        430,
        81,
        459,
        491,
        369,
        380,
        423,
        425,
        344,
        339,
        329,
        334,
        321,
        321,
        315,
        334,
        315,
        297,
        287,
        297,
        232,
        314,
        292,
        296,
        257,
        256,
        217,
        220,
        91,
        273,
        99,
        227,
        93,
        221,
        204,
        206,
        202,
        198,
        210,
        197,
        195,
        187,
        209,
        185,
        193,
        180,
        178,
        177,
        24,
        23,
        191,
        170,
        180,
        172,
        186,
        186,
        171,
        165,
        170,
        29,
        171,
        35,
        167,
        180,
        176,
        168,
        178,
        195,
        171,
        170,
        182,
        160,
        182,
        180,
        174,
        166,
        173,
        173,
        166,
        170,
        166,
        170,
        173,
        167,
        170,
        180,
        180,
        167,
        170,
        188,
        178,
        31,
        165,
        166,
        187,
        167,
        168,
        176,
        161,
        163,
        160,
        167,
        166,
        159,
        177,
        163,
        169,
        167,
        156,
        167,
        172,
        163,
        151,
        181,
        171,
        187,
        164,
        162,
        157,
        166,
        146,
        159,
        167,
        157,
        159,
        155,
        159,
        159,
        169,
        140,
        26,
        156,
        194,
        164,
        184,
        83,
        165,
        169,
        171,
        173,
        178,
        169,
        163,
        180,
        160,
        25,
        178,
        183,
        191,
        178,
        185,
        190,
        180,
        193,
        192,
        192,
        205,
        199,
        221,
        207,
        28,
        195,
        199,
        191,
        194,
        198,
        189,
        216,
        252,
        201,
        211,
        202,
        213,
        202,
        208,
        202,
        197,
        237,
        219,
        255,
        237,
        217,
        219,
        69,
        248,
        241,
        215,
        230,
        205,
        209,
        203,
        198,
        193,
        216,
        197,
        265,
        264,
        277,
        245,
        264,
        272,
        287,
        296,
        321,
        329,
        313,
        341,
        353,
        448,
        367,
        500,
        411,
        461,
        500,
        500,
        500,
        500,
        500,
        500,
        500,
        500,
        500,
        500,
        500,
        404,
        487,
        335,
        431,
        401,
        357,
        384,
        371,
        325,
        355,
        381,
        322,
        362,
        326,
        350,
        311,
        317,
        354,
        333,
        331,
        329,
        369,
        425,
        377,
        417,
        379,
        420,
        460,
        431,
        500,
        500,
        381,
        500,
        500,
        500,
        500,
        500,
        500,
        500,
        500,
        500,
        95,
        500,
        500,
        500,
        500,
        500,
        500,
        500,
        500,
        500,
        500,
        500,
        500,
        496,
        500,
        382,
        500,
        500,
        450,
        463,
        500,
        461,
        473,
        478,
        457,
        442,
        441,
        431,
        430,
        468,
        444,
        463,
        500,
        500,
        500,
        500,
        500,
        500,
        500,
        500,
        500,
        500,
        500,
        500,
        500,
        500,
        500,
        500,
        500,
        500,
        500,
        500,
        500,
        500,
        500,
        110,
        500,
        500,
        500,
        500,
        500,
        500,
        500,
        500,
        500,
        500,
        500,
        500,
        500,
        500,
        500,
        500,
        500,
        500,
        500,
        500,
        500,
        500,
        500,
        500
    ],
    "durations": [
        1.362197,
        0.015725,
        0.001032,
        0.017298,
        0.002228,
        0.0,
        0.015623,
        0.015627,
        0.015624,
        0.015624,
        0.015625,
        0.016826,
        0.02092,
        0.0,
        0.015625,
        0.015627,
        0.015624,
        0.050418,
        0.002215,
        0.031252,
        0.015625,
        0.015627,
        0.015878,
        0.001048,
        0.021256,
        0.015628,
        0.015624,
        0.0,
        0.015625,
        0.015625,
        0.0,
        0.016803,
        0.0,
        0.015626,
        0.0,
        0.017989,
        0.003272,
        0.015625,
        0.0,
        0.015627,
        0.0,
        0.020809,
        0.008001,
        0.002033,
        0.0,
        0.0,
        0.015625,
        0.0,
        0.015627,
        0.0,
        0.01991,
        0.001279,
        0.0,
        0.015626,
        0.0,
        0.015625,
        0.0,
        0.016821,
        0.0,
        0.015623,
        0.0,
        0.015625,
        0.0,
        0.015625,
        0.0,
        0.02132,
        0.0,
        0.015624,
        0.015743,
        0.0,
        0.015627,
        0.015627,
        0.015623,
        0.0,
        0.015626,
        0.02153,
        0.032471,
        0.015626,
        0.015626,
        0.015623,
        0.015625,
        0.022022,
        0.015626,
        0.015626,
        0.03125,
        0.015625,
        0.015625,
        0.021068,
        0.031252,
        0.0,
        0.015624,
        0.015625,
        0.031249,
        0.0,
        0.015729,
        0.019869,
        0.015629,
        0.062497,
        0.021023,
        0.015626,
        0.015626,
        0.031236,
        0.015624,
        0.021119,
        0.031252,
        0.015626,
        0.015626,
        0.052166,
        0.015624,
        0.0,
        0.03125,
        0.015624,
        0.036668,
        0.015625,
        0.015629,
        0.046873,
        0.03662,
        0.046876,
        0.015626,
        0.015622,
        0.036627,
        0.031251,
        0.031252,
        0.031247,
        0.03662,
        0.031253,
        0.015624,
        0.031251,
        0.03665,
        0.031249,
        0.031252,
        0.036621,
        0.031248,
        0.04688,
        0.034559,
        0.032599,
        0.031251,
        0.031248,
        0.03674,
        0.0,
        0.031251,
        0.015626,
        0.015622,
        0.03472,
        0.01888,
        0.015629,
        0.015626,
        0.032405,
        0.020303,
        0.031251,
        0.031254,
        0.015622,
        0.117307,
        0.031704,
        0.035521,
        0.031352,
        0.016654,
        0.036963,
        0.03125,
        0.032368,
        0.031253,
        0.036967,
        0.032373,
        0.031251,
        0.034653,
        0.0336,
        0.031254,
        0.031246,
        0.037939,
        0.03125,
        0.031252,
        0.03663,
        0.016671,
        0.031249,
        0.015627,
        0.031249,
        0.021973,
        0.031251,
        0.015624,
        0.015626,
        0.0,
        0.035851,
        0.017897,
        0.03125,
        0.015626,
        0.01674,
        0.036828,
        0.015625,
        0.01564,
        0.01561,
        0.032366,
        0.0,
        0.036801,
        0.0,
        0.031249,
        0.032502,
        0.0,
        0.036672,
        0.015626,
        0.015626,
        0.032406,
        0.031253,
        0.032386,
        0.015627,
        0.034559,
        0.016853,
        0.032373,
        0.031255,
        0.036785,
        0.015623,
        0.032413,
        0.031252,
        0.036005,
        0.031426,
        0.016664,
        0.031243,
        0.02109,
        0.032394,
        0.031254,
        0.0,
        0.049173,
        0.018961,
        0.031251,
        0.031252,
        0.036619,
        0.016657,
        0.031252,
        0.031252,
        0.037375,
        0.010046,
        0.015627,
        0.03125,
        0.031252,
        0.020949,
        0.031254,
        0.031248,
        0.031252,
        0.021042,
        0.03125,
        0.031252,
        0.031251,
        0.03659,
        0.031249,
        0.031252,
        0.015623,
        0.020897,
        0.031251,
        0.031248,
        0.03679,
        0.03125,
        0.031251,
        0.015626,
        0.03674,
        0.015628,
        0.031248,
        0.031252,
        0.037862,
        0.015628,
        0.031249,
        0.031253,
        0.016738,
        0.021238,
        0.031252,
        0.031251,
        0.032485,
        0.036861,
        0.031247,
        0.032384,
        0.032709,
        0.01995,
        0.032461,
        0.031253,
        0.0202,
        0.04688,
        0.032388,
        0.035771,
        0.015631,
        0.015609,
        0.032426,
        0.036718,
        0.031251,
        0.032574,
        0.034553,
        0.031252,
        0.032363,
        0.031252,
        0.052403,
        0.032374,
        0.051537,
        0.046879,
        0.036047,
        0.036846,
        0.05136,
        0.027,
        0.029998,
        0.040664,
        0.03125,
        0.035834,
        0.04802,
        0.031249,
        0.052604,
        0.032281,
        0.049178,
        0.05028,
        0.046877,
        0.035891,
        0.032436,
        0.046878,
        0.052538,
        0.031254,
        0.031249,
        0.053848,
        0.031254,
        0.034593,
        0.034864,
        0.031254,
        0.035795,
        0.032408,
        0.031254,
        0.031249,
        0.052756,
        0.031253,
        0.03125,
        0.020372,
        0.032488,
        0.031254,
        0.031252,
        0.035915,
        0.016834,
        0.031247,
        0.036914,
        0.032747,
        0.031251,
        0.035837,
        0.032746,
        0.031251,
        0.031253,
        0.021128,
        0.032385,
        0.031253,
        0.031245,
        0.021275,
        0.048304,
        0.031252,
        0.037043,
        0.015627,
        0.03125,
        0.031252,
        0.020287,
        0.032634,
        0.031251,
        0.0,
        0.042436,
        0.021046,
        0.031253,
        0.031252,
        0.015621,
        0.037122,
        0.031251,
        0.031248,
        0.015629,
        0.021245,
        0.032504,
        0.031263,
        0.035651,
        0.032416,
        0.031251,
        0.031251,
        0.038062,
        0.031251,
        0.03125,
        0.038095,
        0.031248,
        0.03125,
        0.037552,
        0.031252,
        0.046873,
        0.036673,
        0.031251,
        0.046876,
        0.037584,
        0.031254,
        0.031248,
        0.037923,
        0.031252,
        0.031251,
        0.032485,
        0.035727,
        0.046878,
        0.032437,
        0.035857,
        0.046871,
        0.032408,
        0.035789,
        0.046874,
        0.048406,
        0.036565,
        0.048011,
        0.052386,
        0.032387,
        0.052448,
        0.052534,
        0.048168,
        0.05248,
        0.063615,
        0.116204,
        0.052523,
        0.04829,
        0.067169,
        0.063898,
        0.053874,
        0.062504,
        0.085021,
        0.10046,
        0.068451,
        0.078129,
        0.082931,
        0.034782,
        0.119444,
        0.156304,
        0.150177,
        0.08275,
        0.068294,
        0.068013,
        0.117512,
        0.062504,
        0.036704,
        0.079392,
        0.069435,
        0.051402,
        0.048295,
        0.031247,
        0.052852,
        0.083618,
        0.063782,
        0.068341,
        0.062501,
        0.06931,
        0.085387,
        0.062503,
        0.063402,
        0.082694,
        0.064969,
        0.053532,
        0.067953,
        0.063645,
        0.031249,
        0.038095,
        0.031251,
        0.031253,
        0.033607,
        0.019652,
        0.031249,
        0.03125,
        0.036787,
        0.046878,
        0.0,
        0.03125,
        0.03672,
        0.031247,
        0.046879,
        0.021152,
        0.031252,
        0.046873,
        0.036638,
        0.031249,
        0.031254,
        0.047045,
        0.021901,
        0.031251,
        0.031248,
        0.037015,
        0.031252,
        0.0,
        0.03125,
        0.015625,
        0.033752,
        0.020051,
        0.031253,
        0.032391,
        0.036702,
        0.04688,
        0.032454,
        0.033597,
        0.03261,
        0.032392,
        0.031254,
        0.036901,
        0.048121,
        0.031251,
        0.037082,
        0.048041,
        0.031252,
        0.036057,
        0.048774,
        0.049241,
        0.035584,
        0.0,
        0.046875,
        0.035872,
        0.048046,
        0.046876,
        0.053578,
        0.046874,
        0.036586,
        0.04688,
        0.046873,
        0.036713,
        0.046877,
        0.05218,
        0.046877,
        0.046884,
        0.052254,
        0.046881,
        0.037624,
        0.046876,
        0.046878,
        0.052254,
        0.046876,
        0.052254,
        0.046875,
        0.049004,
        0.033505,
        0.046873,
        0.053355,
        0.046878,
        0.052608,
        0.046875,
        0.064058,
        0.03556,
        0.048029,
        0.063489,
        0.063637,
        0.067234,
        0.07249,
        0.079064,
        0.08487,
        0.067222,
        0.095186,
        0.083789,
        0.084853,
        0.082676,
        0.11498,
        0.131855,
        0.130694,
        0.131861,
        0.131947,
        0.138506,
        0.131769,
        0.131484,
        0.130334,
        0.130424,
        0.130417,
        0.136906,
        0.13171,
        0.131838,
        0.132862,
        0.131698,
        0.130734,
        0.138027,
        0.13198,
        0.131906,
        0.146453,
        0.131837,
        0.134574,
        0.080383,
        0.132562,
        0.136511,
        0.130137,
        0.13076,
        0.131829,
        0.132861,
        0.1307,
        0.115964,
        0.136283,
        0.130742,
        0.083659,
        0.131612,
        0.032484,
        0.116421,
        0.131952,
        0.136361,
        0.131176,
        0.133035,
        0.078126,
        0.134583,
        0.131842,
        0.131444,
        0.131463,
        0.132905,
        0.137394,
        0.116201,
        0.133007,
        0.146583,
        0.132036,
        0.134119,
        0.117293,
        0.132952,
        0.147437,
        0.131471,
        0.135074,
        0.100395,
        0.079411,
        0.053851,
        0.046873,
        0.052786,
        0.0,
        0.046877,
        0.035692,
        0.0,
        0.04825,
        0.0,
        0.0,
        0.046874,
        0.0,
        0.018039,
        0.035685,
        0.0,
        0.0,
        0.015624,
        0.0,
        0.0,
        0.046873,
        0.037709,
        0.046876,
        0.0,
        0.0,
        0.044352,
        0.005999,
        0.005997,
        0.038294,
        0.0,
        0.015627,
        0.03762,
        0.0,
        0.015624,
        0.046877,
        0.048084,
        0.036551,
        0.048001,
        0.051542,
        0.063637,
        0.052402,
        0.047952,
        0.052574,
        0.063698,
        0.052605,
        0.079237,
        0.084975,
        0.083961,
        0.099259,
        0.115345,
        0.100431,
        0.115296,
        0.113946,
        0.016904,
        0.131082,
        0.115689,
        0.115835,
        0.114891,
        0.031248,
        0.117154,
        0.131863,
        0.098374,
        0.099623,
        0.100556,
        0.11515,
        0.099603,
        0.085018,
        0.079257,
        0.100474,
        0.083943,
        0.083631,
        0.07934,
        0.084917,
        0.083866,
        0.082356,
        0.064082,
        0.084072,
        0.06378,
        0.068073,
        0.084081,
        0.068132,
        0.081819,
        0.066278,
        0.046877,
        0.067896,
        0.01561,
        0.067836,
        0.031253,
        0.062501,
        0.021073,
        0.062502,
        0.052205,
        0.046878,
        0.063648,
        0.051166,
        0.046874,
        0.052477,
        0.046877,
        0.052394,
        0.046878,
        0.035769,
        0.062506,
        0.046975,
        0.036582,
        0.062606,
        0.0,
        0.0,
        0.052549,
        0.048035,
        0.051574,
        0.046874,
        0.053479,
        0.046878,
        0.032394,
        0.064845,
        0.044995,
        0.008003,
        0.043998,
        0.009002,
        0.043998,
        0.047,
        0.046,
        0.044015,
        0.045985,
        0.050002,
        0.044001,
        0.044,
        0.047,
        0.041002,
        0.046986,
        0.046003,
        0.045001,
        0.043,
        0.044999,
        0.046999,
        0.042998,
        0.044,
        0.042998,
        0.045,
        0.045987,
        0.044,
        0.043998,
        0.045999,
        0.047,
        0.044002,
        0.045014,
        0.047984,
        0.045999,
        0.009,
        0.043002,
        0.043999,
        0.049,
        0.041998,
        0.042986,
        0.046015,
        0.041987,
        0.042996,
        0.042002,
        0.043002,
        0.042001,
        0.041,
        0.046,
        0.042003,
        0.042996,
        0.042997,
        0.040001,
        0.043999,
        0.045001,
        0.043999,
        0.039001,
        0.046999,
        0.045,
        0.049001,
        0.04301,
        0.04199,
        0.04,
        0.043,
        0.039004,
        0.041997,
        0.043001,
        0.040996,
        0.043,
        0.039001,
        0.037677,
        0.036795,
        0.046876,
        0.032379,
        0.015626,
        0.036723,
        0.048069,
        0.05139,
        0.048089,
        0.015629,
        0.049294,
        0.033533,
        0.048029,
        0.040576,
        0.048052,
        0.05128,
        0.031236,
        0.048005,
        0.052389,
        0.0,
        0.055104,
        0.047001,
        0.045033,
        0.036695,
        0.062614,
        0.049213,
        0.034485,
        0.048012,
        0.052436,
        0.047992,
        0.052453,
        0.063614,
        0.051468,
        0.047994,
        0.0,
        0.051487,
        0.048017,
        0.052438,
        0.047996,
        0.046876,
        0.053731,
        0.062498,
        0.052888,
        0.062501,
        0.053808,
        0.046874,
        0.053862,
        0.064847,
        0.051282,
        0.046879,
        0.052654,
        0.062497,
        0.053274,
        0.07826,
        0.053099,
        0.064636,
        0.050157,
        0.015625,
        0.067914,
        0.062499,
        0.063056,
        0.046875,
        0.05229,
        0.062501,
        0.052251,
        0.046876,
        0.052182,
        0.062502,
        0.052208,
        0.062505,
        0.067931,
        0.07813,
        0.069126,
        0.069202,
        0.062501,
        0.069391,
        0.084855,
        0.07925,
        0.084869,
        0.082824,
        0.09917,
        0.079462,
        0.130693,
        0.083866,
        0.131964,
        0.120877,
        0.122485,
        0.121366,
        0.13161,
        0.14605,
        0.130452,
        0.132563,
        0.137325,
        0.131748,
        0.132995,
        0.131868,
        0.131817,
        0.137203,
        0.093753,
        0.136675,
        0.078127,
        0.11469,
        0.115337,
        0.085035,
        0.100557,
        0.10054,
        0.079326,
        0.099494,
        0.100556,
        0.069267,
        0.100123,
        0.078124,
        0.099185,
        0.084017,
        0.082276,
        0.078131,
        0.0992,
        0.083642,
        0.083476,
        0.093751,
        0.114792,
        0.084675,
        0.116289,
        0.100594,
        0.099928,
        0.133154,
        0.115158,
        0.131806,
        0.130875,
        0.100452,
        0.130913,
        0.133036,
        0.117208,
        0.131828,
        0.131031,
        0.115761,
        0.130428,
        0.130416,
        0.134608,
        0.015625,
        0.126924,
        0.133324,
        0.130449,
        0.13051,
        0.12146,
        0.131663,
        0.130764,
        0.130764,
        0.133013,
        0.131994,
        0.137215,
        0.132872,
        0.132022,
        0.130975,
        0.099377,
        0.131839,
        0.125769,
        0.116866,
        0.11706,
        0.130464,
        0.116515,
        0.130594,
        0.130393,
        0.114979,
        0.115855,
        0.11522,
        0.116337,
        0.115284,
        0.117354,
        0.116253,
        0.116258,
        0.130812,
        0.145599,
        0.118489,
        0.146434,
        0.116379,
        0.136402,
        0.130804,
        0.133286,
        0.132,
        0.130965,
        0.138738,
        0.130979,
        0.132015,
        0.131998,
        0.136397,
        0.132484,
        0.125693,
        0.130528,
        0.130531,
        0.145998,
        0.135955,
        0.130501,
        0.130493,
        0.031251,
        0.130528,
        0.130467,
        0.135767,
        0.130404,
        0.13039,
        0.130482,
        0.131367,
        0.130824,
        0.13272,
        0.136275,
        0.131776,
        0.132822,
        0.130785,
        0.131785,
        0.131385,
        0.13144,
        0.135688,
        0.130316,
        0.130354,
        0.130527,
        0.130534,
        0.131533,
        0.137155,
        0.132765
    ]
}