episodes,steps,rewards
0,200,-200.0
1,200,-200.0
2,200,-200.0
3,200,-200.0
4,200,-200.0
5,200,-200.0
6,200,-200.0
7,200,-200.0
8,186,-186.0
9,200,-200.0
10,200,-200.0
11,200,-200.0
12,200,-200.0
13,200,-200.0
14,200,-200.0
15,200,-200.0
16,200,-200.0
17,200,-200.0
18,200,-200.0
19,200,-200.0
20,200,-200.0
21,200,-200.0
22,200,-200.0
23,200,-200.0
24,200,-200.0
25,200,-200.0
26,200,-200.0
27,200,-200.0
28,200,-200.0
29,200,-200.0
30,200,-200.0
31,200,-200.0
32,200,-200.0
33,200,-200.0
34,200,-200.0
35,200,-200.0
36,200,-200.0
37,200,-200.0
38,200,-200.0
39,200,-200.0
40,200,-200.0
41,200,-200.0
42,200,-200.0
43,200,-200.0
44,200,-200.0
45,200,-200.0
46,200,-200.0
47,200,-200.0
48,200,-200.0
49,200,-200.0
50,197,-197.0
51,200,-200.0
52,200,-200.0
53,200,-200.0
54,200,-200.0
55,113,-113.0
56,200,-200.0
57,200,-200.0
58,200,-200.0
59,200,-200.0
60,200,-200.0
61,200,-200.0
62,200,-200.0
63,200,-200.0
64,200,-200.0
65,200,-200.0
66,200,-200.0
67,200,-200.0
68,200,-200.0
69,200,-200.0
70,200,-200.0
71,200,-200.0
72,200,-200.0
73,200,-200.0
74,200,-200.0
75,200,-200.0
76,170,-170.0
77,200,-200.0
78,200,-200.0
79,200,-200.0
80,200,-200.0
81,200,-200.0
82,152,-152.0
83,149,-149.0
84,156,-156.0
85,200,-200.0
86,200,-200.0
87,200,-200.0
88,171,-171.0
89,200,-200.0
90,168,-168.0
91,186,-186.0
92,200,-200.0
93,200,-200.0
94,200,-200.0
95,200,-200.0
96,200,-200.0
97,200,-200.0
98,152,-152.0
99,200,-200.0
100,200,-200.0
101,200,-200.0
102,200,-200.0
103,200,-200.0
104,193,-193.0
105,200,-200.0
106,200,-200.0
107,200,-200.0
108,200,-200.0
109,112,-112.0
110,200,-200.0
111,174,-174.0
112,131,-131.0
113,163,-163.0
114,167,-167.0
115,188,-188.0
116,167,-167.0
117,168,-168.0
118,200,-200.0
119,114,-114.0
120,118,-118.0
121,200,-200.0
122,198,-198.0
123,200,-200.0
124,95,-95.0
125,200,-200.0
126,200,-200.0
127,165,-165.0
128,189,-189.0
129,182,-182.0
130,200,-200.0
131,105,-105.0
132,196,-196.0
133,140,-140.0
134,200,-200.0
135,186,-186.0
136,145,-145.0
137,200,-200.0
138,90,-90.0
139,200,-200.0
140,159,-159.0
141,200,-200.0
142,152,-152.0
143,143,-143.0
144,192,-192.0
145,200,-200.0
146,148,-148.0
147,200,-200.0
148,172,-172.0
149,200,-200.0
150,156,-156.0
151,200,-200.0
152,155,-155.0
153,200,-200.0
154,200,-200.0
155,174,-174.0
156,200,-200.0
157,179,-179.0
158,200,-200.0
159,137,-137.0
160,114,-114.0
161,200,-200.0
162,175,-175.0
163,200,-200.0
164,139,-139.0
165,88,-88.0
166,152,-152.0
167,157,-157.0
168,178,-178.0
169,200,-200.0
170,200,-200.0
171,130,-130.0
172,135,-135.0
173,97,-97.0
174,150,-150.0
175,171,-171.0
176,157,-157.0
177,157,-157.0
178,200,-200.0
179,91,-91.0
180,145,-145.0
181,108,-108.0
182,200,-200.0
183,200,-200.0
184,90,-90.0
185,154,-154.0
186,170,-170.0
187,200,-200.0
188,152,-152.0
189,90,-90.0
190,101,-101.0
191,110,-110.0
192,157,-157.0
193,146,-146.0
194,87,-87.0
195,88,-88.0
196,162,-162.0
197,147,-147.0
198,137,-137.0
199,150,-150.0
200,89,-89.0
201,173,-173.0
202,140,-140.0
203,148,-148.0
204,95,-95.0
205,159,-159.0
206,171,-171.0
207,87,-87.0
208,93,-93.0
209,92,-92.0
210,143,-143.0
211,159,-159.0
212,200,-200.0
213,200,-200.0
214,85,-85.0
215,133,-133.0
216,153,-153.0
217,143,-143.0
218,89,-89.0
219,154,-154.0
220,105,-105.0
221,150,-150.0
222,149,-149.0
223,153,-153.0
224,86,-86.0
225,144,-144.0
226,147,-147.0
227,142,-142.0
228,138,-138.0
229,164,-164.0
230,173,-173.0
231,131,-131.0
232,93,-93.0
233,149,-149.0
234,119,-119.0
235,88,-88.0
236,200,-200.0
237,149,-149.0
238,88,-88.0
239,94,-94.0
240,94,-94.0
241,111,-111.0
242,133,-133.0
243,84,-84.0
244,156,-156.0
245,95,-95.0
246,152,-152.0
247,149,-149.0
248,200,-200.0
249,85,-85.0
250,143,-143.0
251,95,-95.0
252,159,-159.0
253,129,-129.0
254,85,-85.0
255,146,-146.0
256,143,-143.0
257,146,-146.0
258,106,-106.0
259,149,-149.0
260,141,-141.0
261,150,-150.0
262,132,-132.0
263,145,-145.0
264,92,-92.0
265,145,-145.0
266,98,-98.0
267,145,-145.0
268,148,-148.0
269,178,-178.0
270,135,-135.0
271,151,-151.0
272,147,-147.0
273,143,-143.0
274,109,-109.0
275,104,-104.0
276,148,-148.0
277,136,-136.0
278,143,-143.0
279,147,-147.0
280,92,-92.0
281,156,-156.0
282,145,-145.0
283,137,-137.0
284,90,-90.0
285,152,-152.0
286,90,-90.0
287,146,-146.0
288,99,-99.0
289,87,-87.0
290,85,-85.0
291,133,-133.0
292,87,-87.0
293,140,-140.0
294,93,-93.0
295,136,-136.0
296,147,-147.0
297,85,-85.0
298,134,-134.0
299,85,-85.0
300,143,-143.0
301,153,-153.0
302,151,-151.0
303,147,-147.0
304,142,-142.0
305,147,-147.0
306,147,-147.0
307,142,-142.0
308,87,-87.0
309,99,-99.0
310,149,-149.0
311,149,-149.0
312,150,-150.0
313,148,-148.0
314,144,-144.0
315,137,-137.0
316,141,-141.0
317,146,-146.0
318,155,-155.0
319,152,-152.0
320,148,-148.0
321,160,-160.0
322,139,-139.0
323,138,-138.0
324,200,-200.0
325,142,-142.0
326,87,-87.0
327,139,-139.0
328,151,-151.0
329,148,-148.0
330,147,-147.0
331,152,-152.0
332,164,-164.0
333,146,-146.0
334,108,-108.0
335,200,-200.0
336,152,-152.0
337,128,-128.0
338,86,-86.0
339,101,-101.0
340,156,-156.0
341,163,-163.0
342,94,-94.0
343,153,-153.0
344,159,-159.0
345,146,-146.0
346,156,-156.0
347,157,-157.0
348,151,-151.0
349,148,-148.0
350,200,-200.0
351,200,-200.0
352,147,-147.0
353,89,-89.0
354,143,-143.0
355,148,-148.0
356,145,-145.0
357,152,-152.0
358,87,-87.0
359,142,-142.0
360,147,-147.0
361,149,-149.0
362,153,-153.0
363,94,-94.0
364,200,-200.0
365,139,-139.0
366,149,-149.0
367,200,-200.0
368,154,-154.0
369,157,-157.0
370,141,-141.0
371,200,-200.0
372,156,-156.0
373,148,-148.0
374,149,-149.0
375,152,-152.0
376,149,-149.0
377,165,-165.0
378,152,-152.0
379,161,-161.0
380,146,-146.0
381,98,-98.0
382,146,-146.0
383,83,-83.0
384,155,-155.0
385,144,-144.0
386,157,-157.0
387,101,-101.0
388,92,-92.0
389,148,-148.0
390,163,-163.0
391,193,-193.0
392,86,-86.0
393,148,-148.0
394,151,-151.0
395,107,-107.0
396,153,-153.0
397,111,-111.0
398,144,-144.0
399,200,-200.0
400,154,-154.0
401,200,-200.0
402,200,-200.0
403,178,-178.0
404,149,-149.0
405,151,-151.0
406,94,-94.0
407,158,-158.0
408,158,-158.0
409,89,-89.0
410,163,-163.0
411,88,-88.0
412,200,-200.0
413,105,-105.0
414,142,-142.0
415,159,-159.0
416,94,-94.0
417,164,-164.0
418,150,-150.0
419,87,-87.0
420,145,-145.0
421,148,-148.0
422,99,-99.0
423,90,-90.0
424,89,-89.0
425,92,-92.0
426,159,-159.0
427,152,-152.0
428,87,-87.0
429,90,-90.0
430,100,-100.0
431,200,-200.0
432,155,-155.0
433,200,-200.0
434,152,-152.0
435,151,-151.0
436,85,-85.0
437,200,-200.0
438,200,-200.0
439,153,-153.0
440,152,-152.0
441,157,-157.0
442,92,-92.0
443,97,-97.0
444,200,-200.0
445,200,-200.0
446,92,-92.0
447,200,-200.0
448,89,-89.0
449,200,-200.0
450,159,-159.0
451,157,-157.0
452,200,-200.0
453,200,-200.0
454,101,-101.0
455,200,-200.0
456,189,-189.0
457,89,-89.0
458,157,-157.0
459,200,-200.0
460,158,-158.0
461,200,-200.0
462,158,-158.0
463,157,-157.0
464,200,-200.0
465,200,-200.0
466,90,-90.0
467,200,-200.0
468,92,-92.0
469,155,-155.0
470,149,-149.0
471,200,-200.0
472,159,-159.0
473,146,-146.0
474,200,-200.0
475,152,-152.0
476,168,-168.0
477,154,-154.0
478,129,-129.0
479,97,-97.0
480,161,-161.0
481,152,-152.0
482,200,-200.0
483,150,-150.0
484,146,-146.0
485,154,-154.0
486,175,-175.0
487,95,-95.0
488,147,-147.0
489,163,-163.0
490,160,-160.0
491,111,-111.0
492,84,-84.0
493,143,-143.0
494,147,-147.0
495,160,-160.0
496,200,-200.0
497,200,-200.0
498,170,-170.0
499,200,-200.0
500,152,-152.0
501,149,-149.0
502,153,-153.0
503,200,-200.0
504,145,-145.0
505,200,-200.0
506,90,-90.0
507,85,-85.0
508,146,-146.0
509,200,-200.0
510,94,-94.0
511,164,-164.0
512,200,-200.0
513,193,-193.0
514,182,-182.0
515,166,-166.0
516,155,-155.0
517,200,-200.0
518,150,-150.0
519,153,-153.0
520,200,-200.0
521,144,-144.0
522,143,-143.0
523,84,-84.0
524,154,-154.0
525,200,-200.0
526,158,-158.0
527,167,-167.0
528,200,-200.0
529,84,-84.0
530,101,-101.0
531,90,-90.0
532,84,-84.0
533,152,-152.0
534,136,-136.0
535,143,-143.0
536,176,-176.0
537,86,-86.0
538,97,-97.0
539,146,-146.0
540,86,-86.0
541,159,-159.0
542,98,-98.0
543,200,-200.0
544,160,-160.0
545,157,-157.0
546,146,-146.0
547,146,-146.0
548,86,-86.0
549,200,-200.0
550,152,-152.0
551,200,-200.0
552,148,-148.0
553,154,-154.0
554,174,-174.0
555,86,-86.0
556,177,-177.0
557,156,-156.0
558,200,-200.0
559,181,-181.0
560,100,-100.0
561,150,-150.0
562,156,-156.0
563,200,-200.0
564,153,-153.0
565,85,-85.0
566,200,-200.0
567,108,-108.0
568,151,-151.0
569,151,-151.0
570,145,-145.0
571,180,-180.0
572,199,-199.0
573,200,-200.0
574,93,-93.0
575,90,-90.0
576,87,-87.0
577,145,-145.0
578,184,-184.0
579,87,-87.0
580,149,-149.0
581,88,-88.0
582,163,-163.0
583,200,-200.0
584,200,-200.0
585,200,-200.0
586,137,-137.0
587,200,-200.0
588,87,-87.0
589,145,-145.0
590,200,-200.0
591,149,-149.0
592,200,-200.0
593,153,-153.0
594,87,-87.0
595,200,-200.0
596,96,-96.0
597,95,-95.0
598,96,-96.0
599,149,-149.0
600,150,-150.0
601,86,-86.0
602,154,-154.0
603,150,-150.0
604,87,-87.0
605,157,-157.0
606,150,-150.0
607,156,-156.0
608,151,-151.0
609,85,-85.0
610,153,-153.0
611,144,-144.0
612,146,-146.0
613,149,-149.0
614,149,-149.0
615,156,-156.0
616,94,-94.0
617,159,-159.0
618,157,-157.0
619,158,-158.0
620,151,-151.0
621,101,-101.0
622,151,-151.0
623,156,-156.0
624,200,-200.0
625,94,-94.0
626,151,-151.0
627,87,-87.0
628,154,-154.0
629,91,-91.0
630,200,-200.0
631,200,-200.0
632,166,-166.0
633,168,-168.0
634,85,-85.0
635,163,-163.0
636,157,-157.0
637,107,-107.0
638,163,-163.0
639,162,-162.0
640,200,-200.0
641,158,-158.0
642,164,-164.0
643,170,-170.0
644,87,-87.0
645,158,-158.0
646,148,-148.0
647,173,-173.0
648,158,-158.0
649,188,-188.0
650,95,-95.0
651,200,-200.0
652,148,-148.0
653,155,-155.0
654,157,-157.0
655,115,-115.0
656,153,-153.0
657,131,-131.0
658,153,-153.0
659,96,-96.0
660,90,-90.0
661,139,-139.0
662,153,-153.0
663,101,-101.0
664,184,-184.0
665,152,-152.0
666,105,-105.0
667,170,-170.0
668,160,-160.0
669,89,-89.0
670,149,-149.0
671,156,-156.0
672,158,-158.0
673,200,-200.0
674,151,-151.0
675,135,-135.0
676,154,-154.0
677,111,-111.0
678,155,-155.0
679,143,-143.0
680,149,-149.0
681,88,-88.0
682,200,-200.0
683,89,-89.0
684,160,-160.0
685,200,-200.0
686,88,-88.0
687,159,-159.0
688,98,-98.0
689,91,-91.0
690,85,-85.0
691,93,-93.0
692,92,-92.0
693,92,-92.0
694,155,-155.0
695,93,-93.0
696,159,-159.0
697,83,-83.0
698,94,-94.0
699,160,-160.0
700,189,-189.0
