{
    "model_info": "split16_16",
    "episodes": [
        11,
        22,
        15,
        16,
        12,
        20,
        9,
        14,
        20,
        36,
        12,
        11,
        22,
        9,
        19,
        24,
        11,
        14,
        9,
        13,
        17,
        15,
        15,
        18,
        20,
        12,
        17,
        15,
        17,
        24,
        20,
        12,
        19,
        16,
        14,
        19,
        21,
        65,
        14,
        14,
        9,
        34,
        18,
        14,
        10,
        15,
        14,
        8,
        10,
        18,
        12,
        19,
        13,
        14,
        18,
        8,
        17,
        10,
        26,
        23,
        25,
        29,
        17,
        11,
        11,
        15,
        11,
        17,
        11,
        15,
        38,
        16,
        21,
        32,
        13,
        10,
        13,
        11,
        12,
        40,
        12,
        33,
        15,
        19,
        47,
        19,
        24,
        16,
        12,
        33,
        58,
        29,
        22,
        18,
        31,
        12,
        50,
        18,
        23,
        12,
        13,
        15,
        17,
        14,
        40,
        27,
        37,
        14,
        19,
        14,
        17,
        15,
        13,
        28,
        13,
        38,
        33,
        25,
        20,
        23,
        41,
        34,
        53,
        19,
        22,
        39,
        27,
        21,
        36,
        58,
        47,
        23,
        11,
        41,
        95,
        23,
        112,
        17,
        56,
        25,
        38,
        36,
        31,
        25,
        11,
        32,
        37,
        79,
        28,
        43,
        61,
        60,
        56,
        53,
        75,
        42,
        43,
        38,
        36,
        98,
        46,
        18,
        22,
        39,
        79,
        40,
        40,
        49,
        60,
        87,
        45,
        47,
        15,
        37,
        67,
        46,
        155,
        40,
        50,
        17,
        37,
        14,
        47,
        19,
        81,
        26,
        51,
        52,
        51,
        83,
        57,
        46,
        69,
        28,
        37,
        38,
        37,
        37,
        38,
        36,
        25,
        31,
        41,
        21,
        87,
        41,
        33,
        40,
        76,
        33,
        65,
        75,
        45,
        56,
        61,
        41,
        27,
        22,
        31,
        30,
        58,
        85,
        54,
        31,
        61,
        74,
        36,
        88,
        70,
        59,
        43,
        46,
        70,
        43,
        46,
        58,
        30,
        53,
        20,
        25,
        42,
        105,
        81,
        38,
        60,
        87,
        41,
        43,
        100,
        26,
        42,
        35,
        71,
        44,
        77,
        76,
        44,
        65,
        59,
        49,
        40,
        52,
        86,
        55,
        27,
        29,
        92,
        67,
        28,
        57,
        58,
        67,
        112,
        148,
        57,
        39,
        84,
        49,
        49,
        39,
        44,
        75,
        28,
        68,
        51,
        43,
        38,
        37,
        105,
        41,
        40,
        117,
        72,
        35,
        87,
        40,
        48,
        25,
        48,
        77,
        64,
        54,
        78,
        37,
        39,
        81,
        39,
        38,
        79,
        84,
        21,
        43,
        58,
        65,
        103,
        77,
        47,
        51,
        77,
        48,
        64,
        90,
        31,
        50,
        41,
        32,
        25,
        34,
        36,
        79,
        34,
        28,
        38,
        70,
        51,
        110,
        149,
        51,
        55,
        31,
        94,
        65,
        50,
        30,
        37,
        39,
        63,
        26,
        33,
        51,
        70,
        49,
        90,
        33,
        31,
        24,
        51,
        35,
        84,
        54,
        45,
        35,
        35,
        66,
        35,
        45,
        58,
        41,
        67,
        43,
        91,
        64,
        47,
        81,
        53,
        84,
        61,
        61,
        55,
        80,
        118,
        113,
        63,
        72,
        48,
        69,
        62,
        64,
        153,
        49,
        96,
        80,
        98,
        59,
        77,
        79,
        35,
        29,
        69,
        60,
        47,
        56,
        75,
        61,
        40,
        91,
        82,
        40,
        47,
        65,
        83,
        135,
        85,
        66,
        91,
        73,
        45,
        32,
        48,
        42,
        83,
        146,
        78,
        42,
        108,
        70,
        51,
        63,
        65,
        67,
        55,
        74,
        75,
        10,
        70,
        107,
        48,
        83,
        155,
        115,
        94,
        62,
        83,
        75,
        93,
        62,
        99,
        96,
        80,
        45,
        83,
        71,
        124,
        93,
        99,
        97,
        129,
        93,
        105,
        100,
        224,
        67,
        120,
        86,
        101,
        136,
        144,
        75,
        123,
        137,
        184,
        426,
        188,
        303,
        248,
        193,
        310,
        83,
        168,
        316,
        136,
        62,
        70,
        48,
        192,
        500,
        181,
        165,
        500,
        77,
        216,
        500,
        468,
        127,
        500,
        428,
        500,
        305,
        500,
        500,
        500,
        405,
        416,
        271,
        443,
        500,
        500,
        254,
        182,
        271,
        500,
        423,
        500,
        500,
        500,
        500,
        500,
        500,
        500,
        500,
        500,
        500,
        500,
        500,
        500,
        500,
        500,
        500,
        500,
        122,
        500,
        93,
        500,
        500,
        500,
        500,
        500,
        500,
        500,
        490,
        500,
        500,
        500,
        494,
        500,
        265,
        361,
        236,
        267,
        230,
        205,
        240,
        213,
        216,
        203,
        238,
        373,
        314,
        500,
        252,
        500,
        424,
        500,
        500,
        331,
        500,
        500,
        500,
        500,
        500,
        500,
        500,
        500,
        500,
        500,
        500,
        500,
        500,
        500,
        500,
        500,
        500,
        500,
        500,
        500,
        500,
        500,
        500,
        500,
        500,
        500,
        500,
        500,
        500,
        500,
        500,
        500,
        356,
        500,
        500,
        296,
        500,
        500,
        500,
        85,
        500,
        500,
        500,
        500,
        500,
        500,
        500,
        500,
        500,
        412,
        270,
        500,
        83,
        500,
        500,
        500,
        500,
        500,
        500,
        500,
        500,
        500,
        500,
        500,
        500,
        500,
        500,
        500,
        500,
        500,
        500,
        500,
        500,
        500,
        500,
        122,
        411,
        500,
        214,
        309,
        218,
        48,
        119,
        252,
        123,
        148,
        231,
        131,
        151,
        156,
        164,
        153,
        123,
        141,
        295,
        236,
        135,
        267,
        205,
        266,
        285,
        145,
        186,
        270,
        289,
        157,
        160,
        268,
        295,
        172,
        151,
        140,
        181,
        266,
        178,
        274,
        391,
        155,
        165,
        244,
        281,
        141,
        245,
        240,
        299,
        258,
        500,
        288,
        500,
        324,
        500,
        500,
        500,
        500,
        500,
        500,
        500,
        500,
        500,
        500,
        500,
        144,
        150,
        171,
        455,
        132,
        165,
        179,
        102,
        129,
        500,
        168,
        157,
        166,
        154,
        450,
        160,
        500,
        500,
        191,
        177,
        500,
        137,
        150,
        437,
        163,
        425,
        191,
        500,
        500,
        500,
        500,
        500,
        500,
        500,
        500,
        500,
        500,
        500,
        500,
        500,
        500,
        500,
        500,
        500,
        64,
        500,
        500,
        500,
        500,
        500,
        500,
        500,
        500,
        500,
        500,
        500,
        500,
        500,
        500,
        312,
        500,
        500,
        500,
        500,
        278,
        500,
        500,
        500,
        500,
        500,
        500,
        500,
        500,
        500,
        500,
        500,
        500,
        500,
        500,
        500,
        500,
        500,
        500,
        500,
        500,
        500,
        500,
        500,
        500,
        500,
        500,
        500,
        500,
        500,
        500,
        500,
        500,
        500,
        500,
        500,
        500,
        500,
        500,
        500,
        500,
        500,
        500,
        500,
        500,
        500,
        500,
        500,
        500,
        500,
        500,
        500,
        500,
        500,
        500,
        500
    ],
    "durations": [
        1.337005,
        0.006989,
        0.003999,
        0.005001,
        0.004,
        0.006001,
        0.002998,
        0.004002,
        0.006003,
        0.009997,
        0.004,
        0.002999,
        0.006001,
        0.002001,
        0.004998,
        0.007003,
        0.002994,
        0.003999,
        0.003002,
        0.004,
        0.003999,
        0.003998,
        0.003999,
        0.004999,
        0.006001,
        0.002999,
        0.004,
        0.003999,
        0.005,
        0.007,
        0.007003,
        0.005009,
        0.005989,
        0.005001,
        0.003998,
        0.005003,
        0.004999,
        0.017999,
        0.005004,
        0.003997,
        0.002999,
        0.010001,
        0.005,
        0.004,
        0.003,
        0.003999,
        0.003999,
        0.003001,
        0.003,
        0.006,
        0.002998,
        0.006,
        0.005005,
        0.005975,
        0.006,
        0.003,
        0.004999,
        0.003002,
        0.007999,
        0.006,
        0.006999,
        0.008001,
        0.005,
        0.004,
        0.002999,
        0.004001,
        0.004001,
        0.006,
        0.002999,
        0.005,
        0.009999,
        0.005001,
        0.005999,
        0.009003,
        0.003998,
        0.002999,
        0.004001,
        0.003,
        0.002999,
        0.011002,
        0.004002,
        0.008996,
        0.004001,
        0.007,
        0.016,
        0.006001,
        0.008001,
        0.005001,
        0.003998,
        0.009001,
        0.014997,
        0.008003,
        0.006013,
        0.004983,
        0.009,
        0.003002,
        0.014999,
        0.005,
        0.005999,
        0.003999,
        0.004,
        0.004003,
        0.004999,
        0.003998,
        0.011001,
        0.007001,
        0.008999,
        0.004001,
        0.005001,
        0.003998,
        0.005001,
        0.005003,
        0.003996,
        0.007001,
        0.004001,
        0.012999,
        0.008996,
        0.006999,
        0.005,
        0.006001,
        0.010998,
        0.010002,
        0.013998,
        0.007003,
        0.006997,
        0.01,
        0.006999,
        0.005001,
        0.009001,
        0.015999,
        0.013001,
        0.006999,
        0.003001,
        0.01,
        0.026001,
        0.007998,
        0.03,
        0.005001,
        0.015,
        0.006999,
        0.010001,
        0.009002,
        0.010007,
        0.007993,
        0.003002,
        0.008002,
        0.011999,
        0.022001,
        0.007998,
        0.010999,
        0.015984,
        0.016002,
        0.016001,
        0.014999,
        0.019999,
        0.012,
        0.012,
        0.009999,
        0.011002,
        0.025982,
        0.011999,
        0.005001,
        0.004999,
        0.010001,
        0.021998,
        0.011,
        0.010999,
        0.014003,
        0.016998,
        0.023,
        0.013,
        0.012999,
        0.005,
        0.010001,
        0.018999,
        0.012001,
        0.042999,
        0.012002,
        0.013999,
        0.005001,
        0.009998,
        0.004,
        0.012999,
        0.006,
        0.021001,
        0.006983,
        0.014,
        0.013001,
        0.013001,
        0.021999,
        0.016001,
        0.011999,
        0.018001,
        0.007002,
        0.009998,
        0.010001,
        0.010001,
        0.009999,
        0.009999,
        0.010018,
        0.006984,
        0.009985,
        0.010999,
        0.005002,
        0.025001,
        0.012001,
        0.009,
        0.009999,
        0.019999,
        0.009001,
        0.017004,
        0.019983,
        0.012004,
        0.014999,
        0.017003,
        0.031002,
        0.010999,
        0.008999,
        0.013001,
        0.011998,
        0.020999,
        0.053001,
        0.017001,
        0.011,
        0.018001,
        0.019997,
        0.010002,
        0.024002,
        0.019001,
        0.020003,
        0.014995,
        0.016001,
        0.024,
        0.014999,
        0.014998,
        0.018,
        0.009,
        0.020001,
        0.006999,
        0.009001,
        0.014001,
        0.032997,
        0.027001,
        0.013001,
        0.017999,
        0.026,
        0.012999,
        0.013,
        0.031001,
        0.008,
        0.011,
        0.01,
        0.021,
        0.012999,
        0.021,
        0.02,
        0.012001,
        0.016999,
        0.017,
        0.014,
        0.011002,
        0.013998,
        0.023999,
        0.016,
        0.007999,
        0.008067,
        0.024986,
        0.017999,
        0.011002,
        0.018998,
        0.019997,
        0.018996,
        0.031987,
        0.040001,
        0.016,
        0.010999,
        0.023009,
        0.013,
        0.012999,
        0.011002,
        0.012,
        0.021014,
        0.007987,
        0.017999,
        0.012998,
        0.012,
        0.01,
        0.012003,
        0.029989,
        0.011,
        0.011,
        0.033999,
        0.021999,
        0.010001,
        0.023003,
        0.010986,
        0.012998,
        0.007002,
        0.013001,
        0.02,
        0.018002,
        0.015997,
        0.021,
        0.01,
        0.01,
        0.022002,
        0.010996,
        0.01,
        0.021,
        0.023,
        0.006001,
        0.011999,
        0.015999,
        0.018003,
        0.027999,
        0.020999,
        0.013001,
        0.015,
        0.023015,
        0.013984,
        0.017999,
        0.025003,
        0.009,
        0.012999,
        0.011,
        0.009002,
        0.006999,
        0.009998,
        0.010001,
        0.021001,
        0.010015,
        0.006989,
        0.009996,
        0.019002,
        0.013997,
        0.03,
        0.04,
        0.013999,
        0.017001,
        0.008999,
        0.026002,
        0.017994,
        0.013998,
        0.007998,
        0.01,
        0.010023,
        0.01698,
        0.008997,
        0.010003,
        0.013996,
        0.018985,
        0.014002,
        0.025997,
        0.01,
        0.008002,
        0.005999,
        0.012996,
        0.009003,
        0.021999,
        0.014999,
        0.012001,
        0.01,
        0.009001,
        0.016999,
        0.009985,
        0.012,
        0.015002,
        0.010987,
        0.017998,
        0.011999,
        0.024,
        0.017001,
        0.012998,
        0.025002,
        0.020998,
        0.029001,
        0.024,
        0.022,
        0.016,
        0.024,
        0.031001,
        0.031003,
        0.017002,
        0.019001,
        0.013002,
        0.017996,
        0.017998,
        0.018004,
        0.041998,
        0.013001,
        0.025003,
        0.021003,
        0.026,
        0.015998,
        0.021,
        0.021001,
        0.008996,
        0.008,
        0.019002,
        0.016002,
        0.013,
        0.050997,
        0.022001,
        0.017999,
        0.011,
        0.024001,
        0.023999,
        0.010999,
        0.012001,
        0.018,
        0.023,
        0.04,
        0.028001,
        0.021999,
        0.032003,
        0.029,
        0.018,
        0.011999,
        0.016,
        0.014,
        0.025,
        0.044998,
        0.024,
        0.012,
        0.029001,
        0.019001,
        0.015,
        0.017,
        0.017,
        0.018001,
        0.016002,
        0.020999,
        0.019998,
        0.003001,
        0.019,
        0.029001,
        0.013999,
        0.022,
        0.045001,
        0.0304,
        0.025999,
        0.015999,
        0.023001,
        0.019997,
        0.025,
        0.017,
        0.027002,
        0.025999,
        0.023,
        0.012001,
        0.021999,
        0.019002,
        0.033,
        0.025997,
        0.02799,
        0.027993,
        0.035002,
        0.025001,
        0.028998,
        0.028,
        0.059985,
        0.019001,
        0.032999,
        0.024,
        0.027,
        0.040001,
        0.038999,
        0.019999,
        0.034001,
        0.038001,
        0.050997,
        0.118986,
        0.051998,
        0.083417,
        0.069001,
        0.056003,
        0.084983,
        0.024001,
        0.047001,
        0.086999,
        0.040002,
        0.016001,
        0.019002,
        0.012998,
        0.057001,
        0.142,
        0.052998,
        0.048002,
        0.136999,
        0.021001,
        0.058,
        0.135999,
        0.128003,
        0.033986,
        0.133999,
        0.114999,
        0.137999,
        0.080002,
        0.138002,
        0.136996,
        0.133999,
        0.109133,
        0.111987,
        0.072004,
        0.124993,
        0.134002,
        0.131999,
        0.065983,
        0.047984,
        0.073856,
        0.135,
        0.112984,
        0.133,
        0.135001,
        0.132001,
        0.133998,
        0.132998,
        0.152024,
        0.141978,
        0.134998,
        0.133001,
        0.144,
        0.133001,
        0.144998,
        0.136001,
        0.136999,
        0.134003,
        0.132,
        0.132998,
        0.032999,
        0.131996,
        0.025,
        0.132001,
        0.131998,
        0.136002,
        0.132,
        0.133002,
        0.134999,
        0.136999,
        0.128999,
        0.132999,
        0.133001,
        0.134999,
        0.131,
        0.134001,
        0.068998,
        0.093999,
        0.063,
        0.071998,
        0.061001,
        0.052984,
        0.064,
        0.055,
        0.056,
        0.055001,
        0.062999,
        0.100999,
        0.081001,
        0.134999,
        0.066999,
        0.133002,
        0.114996,
        0.133,
        0.134,
        0.087,
        0.134984,
        0.132999,
        0.132984,
        0.131999,
        0.135003,
        0.131997,
        0.132,
        0.134002,
        0.136,
        0.134001,
        0.132987,
        0.136,
        0.136998,
        0.132001,
        0.132999,
        0.132002,
        0.135997,
        0.131999,
        0.131999,
        0.131984,
        0.137,
        0.132003,
        0.132986,
        0.132272,
        0.137005,
        0.132863,
        0.133001,
        0.132,
        0.134999,
        0.134002,
        0.132997,
        0.130999,
        0.095009,
        0.131998,
        0.132999,
        0.077002,
        0.136985,
        0.133,
        0.140001,
        0.022,
        0.137002,
        0.132999,
        0.137001,
        0.139016,
        0.134983,
        0.136004,
        0.134996,
        0.134999,
        0.143003,
        0.110997,
        0.074001,
        0.134003,
        0.021998,
        0.134001,
        0.138999,
        0.136001,
        0.133001,
        0.132984,
        0.137001,
        0.132997,
        0.136004,
        0.132987,
        0.134999,
        0.134001,
        0.131998,
        0.133004,
        0.136997,
        0.134,
        0.133992,
        0.135999,
        0.137,
        0.136005,
        0.135997,
        0.133999,
        0.136001,
        0.034002,
        0.109001,
        0.134987,
        0.056984,
        0.080998,
        0.057003,
        0.014998,
        0.032,
        0.066005,
        0.037011,
        0.038984,
        0.062,
        0.036,
        0.040001,
        0.040999,
        0.043,
        0.04,
        0.031983,
        0.039004,
        0.077996,
        0.061002,
        0.035985,
        0.072999,
        0.053003,
        0.069986,
        0.077002,
        0.038001,
        0.048997,
        0.070005,
        0.075001,
        0.043987,
        0.042997,
        0.070001,
        0.076999,
        0.046002,
        0.040998,
        0.037,
        0.048001,
        0.072002,
        0.047,
        0.074,
        0.104999,
        0.042001,
        0.046001,
        0.063999,
        0.074,
        0.04,
        0.064,
        0.061999,
        0.077985,
        0.067999,
        0.133303,
        0.077,
        0.133999,
        0.085003,
        0.138996,
        0.133001,
        0.136999,
        0.132,
        0.133002,
        0.135999,
        0.133001,
        0.133001,
        0.140997,
        0.131999,
        0.136003,
        0.038001,
        0.039001,
        0.048014,
        0.122985,
        0.034,
        0.046,
        0.045998,
        0.026987,
        0.035998,
        0.138001,
        0.046,
        0.042,
        0.047001,
        0.040001,
        0.122,
        0.043,
        0.135002,
        0.134983,
        0.052,
        0.049015,
        0.133985,
        0.036002,
        0.039999,
        0.115,
        0.044,
        0.112,
        0.054016,
        0.154986,
        0.153999,
        0.132999,
        0.133003,
        0.135996,
        0.137001,
        0.132999,
        0.133002,
        0.140999,
        0.132,
        0.133999,
        0.133004,
        0.136001,
        0.133,
        0.137041,
        0.139,
        0.138,
        0.019,
        0.140001,
        0.137998,
        0.141,
        0.142,
        0.132999,
        0.132985,
        0.134998,
        0.132999,
        0.138002,
        0.137,
        0.136993,
        0.134998,
        0.132001,
        0.133,
        0.085,
        0.134001,
        0.131002,
        0.133996,
        0.134,
        0.073002,
        0.132997,
        0.131,
        0.137,
        0.133,
        0.132001,
        0.132001,
        0.133,
        0.132002,
        0.132001,
        0.132,
        0.135999,
        0.133,
        0.131999,
        0.136,
        0.133,
        0.132001,
        0.133001,
        0.131999,
        0.139,
        0.139,
        0.141001,
        0.137999,
        0.144015,
        0.137985,
        0.135998,
        0.139001,
        0.137002,
        0.130999,
        0.134999,
        0.132001,
        0.135988,
        0.13401,
        0.136,
        0.138016,
        0.138983,
        0.150999,
        0.138,
        0.135001,
        0.134,
        0.139,
        0.148001,
        0.137999,
        0.137,
        0.139,
        0.138001,
        0.137001,
        0.134997,
        0.133999,
        0.134998,
        0.132001,
        0.137,
        0.135999,
        0.134998,
        0.135017,
        0.132986
    ]
}