{
    "model_info": "common16x16",
    "episodes": [
        15,
        17,
        28,
        12,
        43,
        31,
        22,
        43,
        60,
        25,
        40,
        32,
        34,
        14,
        15,
        15,
        24,
        16,
        16,
        29,
        19,
        37,
        14,
        10,
        18,
        32,
        26,
        16,
        19,
        15,
        14,
        25,
        19,
        22,
        12,
        18,
        70,
        19,
        44,
        47,
        42,
        38,
        90,
        32,
        90,
        18,
        26,
        35,
        23,
        37,
        43,
        21,
        96,
        14,
        46,
        84,
        24,
        74,
        99,
        38,
        96,
        23,
        25,
        75,
        66,
        88,
        71,
        79,
        72,
        21,
        21,
        58,
        15,
        116,
        128,
        113,
        109,
        87,
        117,
        27,
        118,
        17,
        99,
        12,
        146,
        121,
        135,
        105,
        28,
        99,
        20,
        37,
        200,
        75,
        195,
        166,
        23,
        174,
        28,
        16,
        17,
        53,
        23,
        14,
        18,
        204,
        216,
        125,
        63,
        188,
        186,
        182,
        370,
        236,
        337,
        413,
        275,
        500,
        371,
        500,
        466,
        255,
        213,
        398,
        500,
        497,
        500,
        328,
        326,
        362,
        500,
        500,
        500,
        500,
        500,
        418,
        500,
        500,
        500,
        109,
        437,
        267,
        175,
        154,
        162,
        172,
        209,
        124,
        133,
        137,
        203,
        154,
        146,
        170,
        266,
        500,
        379,
        387,
        500,
        404,
        500,
        500,
        500,
        434,
        500,
        500,
        500,
        500,
        500,
        500,
        500,
        500,
        329,
        350,
        292,
        145,
        64,
        28,
        149,
        116,
        117,
        109,
        126,
        126,
        209,
        168,
        259,
        209,
        184,
        262,
        187,
        221,
        274,
        246,
        236,
        219,
        202,
        253,
        320,
        232,
        270,
        227,
        314,
        308,
        282,
        331,
        369,
        351,
        334,
        326,
        356,
        341,
        381,
        500,
        500,
        500,
        500,
        500,
        500,
        500,
        500,
        500,
        500,
        500,
        500,
        500,
        500,
        500,
        500,
        500,
        500,
        500,
        500,
        500,
        500,
        500,
        500,
        500,
        500,
        500,
        500,
        500,
        500,
        500,
        500,
        500,
        132,
        115,
        97,
        27,
        100,
        32,
        27,
        112,
        24,
        18,
        20,
        28,
        19,
        16,
        23,
        18,
        19,
        41,
        33,
        21,
        31,
        38,
        24,
        28,
        29,
        34,
        34,
        31,
        36,
        35,
        104,
        109,
        30,
        117,
        103,
        103,
        112,
        120,
        111,
        108,
        114,
        107,
        105,
        114,
        130,
        111,
        126,
        116,
        105,
        111,
        130,
        121,
        119,
        130,
        125,
        122,
        129,
        179,
        156,
        136,
        142,
        116,
        130,
        120,
        133,
        118,
        112,
        106,
        117,
        122,
        101,
        106,
        108,
        112,
        115,
        110,
        106,
        96,
        99,
        99,
        97,
        111,
        32,
        47,
        105,
        101,
        112,
        102,
        24,
        97,
        98,
        43,
        104,
        107,
        104,
        106,
        112,
        108,
        120,
        155,
        245,
        218,
        225,
        248,
        500,
        500,
        500,
        500,
        500,
        500,
        500,
        500,
        276,
        500,
        500,
        500,
        500,
        500,
        500,
        500,
        500,
        500,
        500,
        500,
        500,
        500,
        500,
        500,
        500,
        500,
        500,
        500,
        500,
        500,
        500,
        500,
        500,
        500,
        500,
        500,
        500,
        500,
        500,
        500,
        500,
        500,
        500,
        500,
        500,
        500,
        500,
        500,
        500,
        500,
        500,
        500,
        500,
        500,
        500,
        500,
        500,
        500,
        500,
        500,
        500,
        500,
        500,
        500,
        454,
        500,
        500,
        500,
        500,
        500,
        500,
        500,
        454,
        500,
        500,
        500,
        500,
        500,
        500,
        500,
        500,
        500,
        500,
        500,
        500,
        500,
        448,
        500,
        500,
        500,
        500,
        500,
        500,
        500
    ],
    "durations": [
        1.521984,
        0.005984,
        0.009,
        0.003999,
        0.014002,
        0.010999,
        0.006998,
        0.012001,
        0.017001,
        0.007999,
        0.011,
        0.008999,
        0.011001,
        0.003999,
        0.004,
        0.005,
        0.006999,
        0.005002,
        0.004999,
        0.009002,
        0.005998,
        0.010001,
        0.004001,
        0.003002,
        0.005001,
        0.008998,
        0.009001,
        0.006,
        0.005,
        0.004001,
        0.004001,
        0.007,
        0.005,
        0.006,
        0.003999,
        0.005001,
        0.018999,
        0.005,
        0.012,
        0.013,
        0.012001,
        0.010999,
        0.024,
        0.009001,
        0.024,
        0.005,
        0.007001,
        0.009999,
        0.006,
        0.011001,
        0.012998,
        0.006001,
        0.026001,
        0.004999,
        0.013001,
        0.022998,
        0.007001,
        0.019,
        0.026001,
        0.01,
        0.024999,
        0.008002,
        0.006999,
        0.02,
        0.018,
        0.024,
        0.02,
        0.021,
        0.018999,
        0.006001,
        0.005999,
        0.017001,
        0.004,
        0.031,
        0.034001,
        0.032001,
        0.03,
        0.023999,
        0.031,
        0.008998,
        0.031002,
        0.005,
        0.026,
        0.002999,
        0.038999,
        0.033999,
        0.036001,
        0.029003,
        0.007997,
        0.026001,
        0.005999,
        0.010002,
        0.055,
        0.029,
        0.054,
        0.044001,
        0.006,
        0.045,
        0.008001,
        0.005,
        0.004999,
        0.015001,
        0.008,
        0.005,
        0.005,
        0.055001,
        0.058,
        0.034,
        0.018,
        0.050999,
        0.048999,
        0.048999,
        0.101001,
        0.064001,
        0.093002,
        0.111997,
        0.075,
        0.138,
        0.100999,
        0.138002,
        0.131999,
        0.069001,
        0.058001,
        0.111986,
        0.142003,
        0.14,
        0.138999,
        0.089,
        0.088,
        0.097999,
        0.138,
        0.138004,
        0.139996,
        0.139001,
        0.137999,
        0.112,
        0.138,
        0.139003,
        0.139996,
        0.028999,
        0.118001,
        0.074,
        0.046001,
        0.042002,
        0.043,
        0.045999,
        0.056001,
        0.032999,
        0.036001,
        0.037,
        0.053999,
        0.041001,
        0.04,
        0.045002,
        0.072001,
        0.136998,
        0.101004,
        0.105002,
        0.137998,
        0.112015,
        0.135988,
        0.137997,
        0.139,
        0.124002,
        0.138998,
        0.140998,
        0.139002,
        0.138998,
        0.137,
        0.138003,
        0.135001,
        0.136998,
        0.089002,
        0.093004,
        0.080998,
        0.038999,
        0.017999,
        0.008,
        0.039001,
        0.032002,
        0.031996,
        0.030001,
        0.034001,
        0.034,
        0.055,
        0.045,
        0.069999,
        0.058002,
        0.05,
        0.070001,
        0.052998,
        0.059003,
        0.072987,
        0.065994,
        0.065001,
        0.058002,
        0.053999,
        0.068002,
        0.084997,
        0.061,
        0.071999,
        0.061996,
        0.083001,
        0.082001,
        0.075998,
        0.089001,
        0.099984,
        0.093999,
        0.088999,
        0.087999,
        0.096,
        0.091001,
        0.103003,
        0.134986,
        0.136999,
        0.136997,
        0.138001,
        0.137003,
        0.138999,
        0.138997,
        0.135002,
        0.134984,
        0.140001,
        0.137001,
        0.14,
        0.137,
        0.137999,
        0.138001,
        0.137,
        0.136999,
        0.135999,
        0.135999,
        0.137002,
        0.139999,
        0.136003,
        0.135996,
        0.134999,
        0.138003,
        0.137001,
        0.136004,
        0.136001,
        0.136002,
        0.134999,
        0.134995,
        0.137003,
        0.136987,
        0.035997,
        0.031,
        0.027999,
        0.009002,
        0.026999,
        0.008999,
        0.008,
        0.03,
        0.007001,
        0.005,
        0.006,
        0.008,
        0.006,
        0.004,
        0.006003,
        0.005999,
        0.005002,
        0.013001,
        0.009999,
        0.006002,
        0.010014,
        0.009985,
        0.007002,
        0.008999,
        0.008999,
        0.010002,
        0.009997,
        0.009985,
        0.013002,
        0.011997,
        0.029,
        0.028999,
        0.008001,
        0.030985,
        0.02799,
        0.028997,
        0.030005,
        0.031983,
        0.028999,
        0.029002,
        0.031,
        0.031998,
        0.029,
        0.030999,
        0.036003,
        0.029998,
        0.033999,
        0.031003,
        0.029,
        0.031,
        0.034996,
        0.032001,
        0.032001,
        0.034998,
        0.034017,
        0.033982,
        0.034999,
        0.049001,
        0.041999,
        0.036001,
        0.037002,
        0.031998,
        0.033986,
        0.032,
        0.034998,
        0.032002,
        0.029998,
        0.029002,
        0.032002,
        0.032003,
        0.026999,
        0.029001,
        0.028998,
        0.031003,
        0.032999,
        0.031004,
        0.028996,
        0.027015,
        0.027,
        0.026987,
        0.026999,
        0.031001,
        0.008999,
        0.012999,
        0.028997,
        0.026984,
        0.03,
        0.026996,
        0.006998,
        0.024998,
        0.025986,
        0.012998,
        0.029001,
        0.030001,
        0.028,
        0.029002,
        0.030999,
        0.028999,
        0.031999,
        0.044017,
        0.065986,
        0.059013,
        0.059984,
        0.067001,
        0.137998,
        0.143997,
        0.137,
        0.138,
        0.136,
        0.137002,
        0.136,
        0.139,
        0.074999,
        0.140004,
        0.137998,
        0.139998,
        0.137001,
        0.138,
        0.135998,
        0.138999,
        0.136,
        0.150001,
        0.135996,
        0.137999,
        0.136,
        0.135,
        0.137003,
        0.137998,
        0.136998,
        0.138998,
        0.136998,
        0.136999,
        0.136,
        0.138999,
        0.136999,
        0.138001,
        0.138001,
        0.137,
        0.136004,
        0.136995,
        0.136,
        0.137999,
        0.137001,
        0.137002,
        0.139003,
        0.135987,
        0.135985,
        0.138004,
        0.137997,
        0.137,
        0.137,
        0.137999,
        0.137,
        0.137999,
        0.138017,
        0.139984,
        0.144017,
        0.136987,
        0.14,
        0.136,
        0.145001,
        0.138001,
        0.146999,
        0.171,
        0.141997,
        0.137999,
        0.137998,
        0.135999,
        0.125002,
        0.138002,
        0.137997,
        0.136,
        0.142002,
        0.134986,
        0.138001,
        0.137996,
        0.126002,
        0.136999,
        0.136999,
        0.137,
        0.137999,
        0.137983,
        0.140002,
        0.137,
        0.138001,
        0.135999,
        0.136999,
        0.137984,
        0.136986,
        0.138001,
        0.124012,
        0.136985,
        0.137003,
        0.136998,
        0.139998,
        0.137999,
        0.139001,
        0.138
    ]
}