episodes,steps,rewards
0,200,-200.0
1,200,-200.0
2,200,-200.0
3,200,-200.0
4,200,-200.0
5,200,-200.0
6,200,-200.0
7,181,-181.0
8,200,-200.0
9,200,-200.0
10,139,-139.0
11,200,-200.0
12,200,-200.0
13,200,-200.0
14,200,-200.0
15,200,-200.0
16,200,-200.0
17,200,-200.0
18,121,-121.0
19,200,-200.0
20,200,-200.0
21,200,-200.0
22,200,-200.0
23,200,-200.0
24,200,-200.0
25,200,-200.0
26,112,-112.0
27,200,-200.0
28,200,-200.0
29,200,-200.0
30,121,-121.0
31,195,-195.0
32,200,-200.0
33,200,-200.0
34,116,-116.0
35,200,-200.0
36,200,-200.0
37,169,-169.0
38,171,-171.0
39,183,-183.0
40,158,-158.0
41,190,-190.0
42,172,-172.0
43,200,-200.0
44,200,-200.0
45,200,-200.0
46,200,-200.0
47,153,-153.0
48,103,-103.0
49,200,-200.0
50,200,-200.0
51,200,-200.0
52,200,-200.0
53,200,-200.0
54,181,-181.0
55,181,-181.0
56,200,-200.0
57,200,-200.0
58,200,-200.0
59,152,-152.0
60,200,-200.0
61,200,-200.0
62,200,-200.0
63,200,-200.0
64,95,-95.0
65,200,-200.0
66,154,-154.0
67,147,-147.0
68,200,-200.0
69,200,-200.0
70,200,-200.0
71,200,-200.0
72,200,-200.0
73,200,-200.0
74,200,-200.0
75,200,-200.0
76,172,-172.0
77,200,-200.0
78,192,-192.0
79,195,-195.0
80,127,-127.0
81,200,-200.0
82,141,-141.0
83,200,-200.0
84,200,-200.0
85,200,-200.0
86,185,-185.0
87,112,-112.0
88,200,-200.0
89,133,-133.0
90,109,-109.0
91,200,-200.0
92,200,-200.0
93,200,-200.0
94,136,-136.0
95,122,-122.0
96,200,-200.0
97,180,-180.0
98,200,-200.0
99,200,-200.0
100,168,-168.0
101,156,-156.0
102,94,-94.0
103,96,-96.0
104,155,-155.0
105,200,-200.0
106,181,-181.0
107,185,-185.0
108,200,-200.0
109,200,-200.0
110,200,-200.0
111,112,-112.0
112,162,-162.0
113,89,-89.0
114,200,-200.0
115,179,-179.0
116,200,-200.0
117,152,-152.0
118,184,-184.0
119,176,-176.0
120,200,-200.0
121,200,-200.0
122,200,-200.0
123,200,-200.0
124,192,-192.0
125,200,-200.0
126,200,-200.0
127,200,-200.0
128,200,-200.0
129,160,-160.0
130,139,-139.0
131,120,-120.0
132,200,-200.0
133,182,-182.0
134,158,-158.0
135,109,-109.0
136,200,-200.0
137,91,-91.0
138,90,-90.0
139,200,-200.0
140,200,-200.0
141,169,-169.0
142,200,-200.0
143,135,-135.0
144,163,-163.0
145,200,-200.0
146,113,-113.0
147,116,-116.0
148,144,-144.0
149,200,-200.0
150,194,-194.0
151,184,-184.0
152,122,-122.0
153,159,-159.0
154,181,-181.0
155,120,-120.0
156,200,-200.0
157,179,-179.0
158,200,-200.0
159,200,-200.0
160,165,-165.0
161,181,-181.0
162,97,-97.0
163,196,-196.0
164,200,-200.0
165,200,-200.0
166,106,-106.0
167,169,-169.0
168,88,-88.0
169,140,-140.0
170,93,-93.0
171,186,-186.0
172,181,-181.0
173,189,-189.0
174,129,-129.0
175,160,-160.0
176,92,-92.0
177,160,-160.0
178,97,-97.0
179,163,-163.0
180,85,-85.0
181,90,-90.0
182,87,-87.0
183,93,-93.0
184,148,-148.0
185,92,-92.0
186,129,-129.0
187,182,-182.0
188,200,-200.0
189,154,-154.0
190,200,-200.0
191,86,-86.0
192,150,-150.0
193,147,-147.0
194,160,-160.0
195,200,-200.0
196,169,-169.0
197,87,-87.0
198,146,-146.0
199,167,-167.0
200,162,-162.0
201,134,-134.0
202,167,-167.0
203,111,-111.0
204,91,-91.0
205,200,-200.0
206,143,-143.0
207,155,-155.0
208,149,-149.0
209,176,-176.0
210,95,-95.0
211,145,-145.0
212,86,-86.0
213,89,-89.0
214,155,-155.0
215,90,-90.0
216,144,-144.0
217,155,-155.0
218,111,-111.0
219,152,-152.0
220,153,-153.0
221,142,-142.0
222,141,-141.0
223,157,-157.0
224,140,-140.0
225,104,-104.0
226,150,-150.0
227,151,-151.0
228,167,-167.0
229,163,-163.0
230,178,-178.0
231,144,-144.0
232,151,-151.0
233,184,-184.0
234,173,-173.0
235,94,-94.0
236,162,-162.0
237,195,-195.0
238,178,-178.0
239,96,-96.0
240,200,-200.0
241,90,-90.0
242,184,-184.0
243,147,-147.0
244,184,-184.0
245,107,-107.0
246,154,-154.0
247,89,-89.0
248,100,-100.0
249,162,-162.0
250,159,-159.0
251,86,-86.0
252,152,-152.0
253,146,-146.0
254,149,-149.0
255,169,-169.0
256,156,-156.0
257,98,-98.0
258,145,-145.0
259,151,-151.0
260,141,-141.0
261,200,-200.0
262,84,-84.0
263,153,-153.0
264,88,-88.0
265,160,-160.0
266,141,-141.0
267,143,-143.0
268,155,-155.0
269,146,-146.0
270,147,-147.0
271,143,-143.0
272,88,-88.0
273,155,-155.0
274,96,-96.0
275,156,-156.0
276,122,-122.0
277,147,-147.0
278,200,-200.0
279,142,-142.0
280,200,-200.0
281,87,-87.0
282,89,-89.0
283,153,-153.0
284,85,-85.0
285,167,-167.0
286,167,-167.0
287,200,-200.0
288,149,-149.0
289,150,-150.0
290,138,-138.0
291,143,-143.0
292,142,-142.0
293,194,-194.0
294,95,-95.0
295,98,-98.0
296,146,-146.0
297,163,-163.0
298,105,-105.0
299,164,-164.0
300,84,-84.0
301,150,-150.0
302,139,-139.0
303,127,-127.0
304,154,-154.0
305,95,-95.0
306,174,-174.0
307,140,-140.0
308,137,-137.0
309,136,-136.0
310,144,-144.0
311,151,-151.0
312,135,-135.0
313,146,-146.0
314,140,-140.0
315,146,-146.0
316,143,-143.0
317,86,-86.0
318,148,-148.0
319,136,-136.0
320,165,-165.0
321,167,-167.0
322,147,-147.0
323,147,-147.0
324,145,-145.0
325,144,-144.0
326,138,-138.0
327,152,-152.0
328,144,-144.0
329,142,-142.0
330,151,-151.0
331,154,-154.0
332,142,-142.0
333,99,-99.0
334,144,-144.0
335,158,-158.0
336,156,-156.0
337,147,-147.0
338,141,-141.0
339,153,-153.0
340,136,-136.0
341,146,-146.0
342,147,-147.0
343,144,-144.0
344,89,-89.0
345,84,-84.0
346,121,-121.0
347,131,-131.0
348,102,-102.0
349,100,-100.0
350,148,-148.0
351,161,-161.0
352,175,-175.0
353,200,-200.0
354,160,-160.0
355,148,-148.0
356,144,-144.0
357,101,-101.0
358,149,-149.0
359,138,-138.0
360,151,-151.0
361,154,-154.0
362,174,-174.0
363,156,-156.0
364,137,-137.0
365,149,-149.0
366,200,-200.0
367,153,-153.0
368,145,-145.0
369,148,-148.0
370,139,-139.0
371,171,-171.0
372,150,-150.0
373,87,-87.0
374,153,-153.0
375,87,-87.0
376,156,-156.0
377,200,-200.0
378,153,-153.0
379,111,-111.0
380,147,-147.0
381,146,-146.0
382,156,-156.0
383,151,-151.0
384,200,-200.0
385,200,-200.0
386,200,-200.0
387,200,-200.0
388,200,-200.0
389,157,-157.0
390,167,-167.0
391,103,-103.0
392,139,-139.0
393,163,-163.0
394,200,-200.0
395,146,-146.0
396,138,-138.0
397,200,-200.0
398,185,-185.0
399,200,-200.0
400,83,-83.0
401,200,-200.0
402,139,-139.0
403,200,-200.0
404,200,-200.0
405,146,-146.0
406,138,-138.0
407,87,-87.0
408,162,-162.0
409,136,-136.0
410,138,-138.0
411,111,-111.0
412,200,-200.0
413,91,-91.0
414,132,-132.0
415,142,-142.0
416,109,-109.0
417,200,-200.0
418,144,-144.0
419,200,-200.0
420,152,-152.0
421,101,-101.0
422,114,-114.0
423,147,-147.0
424,143,-143.0
425,200,-200.0
426,200,-200.0
427,145,-145.0
428,137,-137.0
429,141,-141.0
430,200,-200.0
431,141,-141.0
432,139,-139.0
433,200,-200.0
434,160,-160.0
435,152,-152.0
436,153,-153.0
437,144,-144.0
438,200,-200.0
439,84,-84.0
440,144,-144.0
441,200,-200.0
442,144,-144.0
443,152,-152.0
444,143,-143.0
445,200,-200.0
446,175,-175.0
447,148,-148.0
448,200,-200.0
449,200,-200.0
450,146,-146.0
451,151,-151.0
452,200,-200.0
453,158,-158.0
454,156,-156.0
455,145,-145.0
456,200,-200.0
457,149,-149.0
458,95,-95.0
459,173,-173.0
460,193,-193.0
461,200,-200.0
462,200,-200.0
463,143,-143.0
464,102,-102.0
465,200,-200.0
466,96,-96.0
467,165,-165.0
468,156,-156.0
469,89,-89.0
470,163,-163.0
471,193,-193.0
472,165,-165.0
473,187,-187.0
474,156,-156.0
475,100,-100.0
476,152,-152.0
477,151,-151.0
478,132,-132.0
479,200,-200.0
480,179,-179.0
481,112,-112.0
482,200,-200.0
483,200,-200.0
484,94,-94.0
485,150,-150.0
486,161,-161.0
487,156,-156.0
488,149,-149.0
489,181,-181.0
490,108,-108.0
491,155,-155.0
492,175,-175.0
493,187,-187.0
494,200,-200.0
495,141,-141.0
496,173,-173.0
497,143,-143.0
498,150,-150.0
499,183,-183.0
500,147,-147.0
501,155,-155.0
502,151,-151.0
503,200,-200.0
504,146,-146.0
505,144,-144.0
506,153,-153.0
507,188,-188.0
508,158,-158.0
509,155,-155.0
510,153,-153.0
511,94,-94.0
512,192,-192.0
513,150,-150.0
514,150,-150.0
515,92,-92.0
516,147,-147.0
517,153,-153.0
518,153,-153.0
519,93,-93.0
520,159,-159.0
521,153,-153.0
522,161,-161.0
523,200,-200.0
524,168,-168.0
525,103,-103.0
526,159,-159.0
527,148,-148.0
528,162,-162.0
529,167,-167.0
530,151,-151.0
531,156,-156.0
532,146,-146.0
533,155,-155.0
534,148,-148.0
535,138,-138.0
536,151,-151.0
537,148,-148.0
538,153,-153.0
539,163,-163.0
540,147,-147.0
541,200,-200.0
542,200,-200.0
543,159,-159.0
544,150,-150.0
545,95,-95.0
546,99,-99.0
547,100,-100.0
548,150,-150.0
549,152,-152.0
550,143,-143.0
551,200,-200.0
552,150,-150.0
553,152,-152.0
554,149,-149.0
555,154,-154.0
556,150,-150.0
557,160,-160.0
558,165,-165.0
559,157,-157.0
560,158,-158.0
561,154,-154.0
562,162,-162.0
563,200,-200.0
564,153,-153.0
565,98,-98.0
566,200,-200.0
567,145,-145.0
568,164,-164.0
569,156,-156.0
570,157,-157.0
571,96,-96.0
572,104,-104.0
573,200,-200.0
574,153,-153.0
575,158,-158.0
576,151,-151.0
577,147,-147.0
578,153,-153.0
579,145,-145.0
580,148,-148.0
581,200,-200.0
582,150,-150.0
583,157,-157.0
584,155,-155.0
585,145,-145.0
586,147,-147.0
587,147,-147.0
588,169,-169.0
589,200,-200.0
590,151,-151.0
591,173,-173.0
592,147,-147.0
593,157,-157.0
594,145,-145.0
595,154,-154.0
596,142,-142.0
597,200,-200.0
598,200,-200.0
599,151,-151.0
600,103,-103.0
601,163,-163.0
602,159,-159.0
603,200,-200.0
604,150,-150.0
605,157,-157.0
606,153,-153.0
607,152,-152.0
608,200,-200.0
609,200,-200.0
610,99,-99.0
611,153,-153.0
612,159,-159.0
613,150,-150.0
614,143,-143.0
615,200,-200.0
616,147,-147.0
617,148,-148.0
618,149,-149.0
619,152,-152.0
620,141,-141.0
621,147,-147.0
622,153,-153.0
623,183,-183.0
624,148,-148.0
625,153,-153.0
626,157,-157.0
627,155,-155.0
628,152,-152.0
629,157,-157.0
630,152,-152.0
631,154,-154.0
632,200,-200.0
633,158,-158.0
634,200,-200.0
635,169,-169.0
636,105,-105.0
637,168,-168.0
638,150,-150.0
639,160,-160.0
640,151,-151.0
641,161,-161.0
642,151,-151.0
643,156,-156.0
644,150,-150.0
645,143,-143.0
646,157,-157.0
647,200,-200.0
648,200,-200.0
649,167,-167.0
650,155,-155.0
651,148,-148.0
652,144,-144.0
653,145,-145.0
654,200,-200.0
655,143,-143.0
656,143,-143.0
657,154,-154.0
658,147,-147.0
659,200,-200.0
660,159,-159.0
661,151,-151.0
662,200,-200.0
663,137,-137.0
664,111,-111.0
665,143,-143.0
666,170,-170.0
667,155,-155.0
668,114,-114.0
669,170,-170.0
670,150,-150.0
671,160,-160.0
672,200,-200.0
673,200,-200.0
674,200,-200.0
675,200,-200.0
676,200,-200.0
677,148,-148.0
678,95,-95.0
679,200,-200.0
680,142,-142.0
681,148,-148.0
682,139,-139.0
683,165,-165.0
684,153,-153.0
685,200,-200.0
686,139,-139.0
687,200,-200.0
688,153,-153.0
689,141,-141.0
690,200,-200.0
691,143,-143.0
692,91,-91.0
693,187,-187.0
694,173,-173.0
695,180,-180.0
696,200,-200.0
697,200,-200.0
698,200,-200.0
699,154,-154.0
700,200,-200.0
701,200,-200.0
702,101,-101.0
703,200,-200.0
704,200,-200.0
705,156,-156.0
706,200,-200.0
707,200,-200.0
708,92,-92.0
709,200,-200.0
710,154,-154.0
711,200,-200.0
712,200,-200.0
713,200,-200.0
714,150,-150.0
715,200,-200.0
716,194,-194.0
717,200,-200.0
718,200,-200.0
719,200,-200.0
720,91,-91.0
721,159,-159.0
722,171,-171.0
723,149,-149.0
724,155,-155.0
725,169,-169.0
726,100,-100.0
727,161,-161.0
728,180,-180.0
729,200,-200.0
730,152,-152.0
731,152,-152.0
732,97,-97.0
733,200,-200.0
734,200,-200.0
735,166,-166.0
736,158,-158.0
737,102,-102.0
738,153,-153.0
739,144,-144.0
740,89,-89.0
741,95,-95.0
742,200,-200.0
743,156,-156.0
744,148,-148.0
745,155,-155.0
746,157,-157.0
747,200,-200.0
748,90,-90.0
749,200,-200.0
750,94,-94.0
751,114,-114.0
752,200,-200.0
753,148,-148.0
754,108,-108.0
755,200,-200.0
756,200,-200.0
757,200,-200.0
758,148,-148.0
759,150,-150.0
760,149,-149.0
761,154,-154.0
762,99,-99.0
763,158,-158.0
764,200,-200.0
765,148,-148.0
766,149,-149.0
767,152,-152.0
768,152,-152.0
769,161,-161.0
770,158,-158.0
771,147,-147.0
772,154,-154.0
773,142,-142.0
774,160,-160.0
775,90,-90.0
776,200,-200.0
777,148,-148.0
778,147,-147.0
779,152,-152.0
780,200,-200.0
781,159,-159.0
782,181,-181.0
783,93,-93.0
784,180,-180.0
785,146,-146.0
786,150,-150.0
787,152,-152.0
788,196,-196.0
789,153,-153.0
790,146,-146.0
791,183,-183.0
792,156,-156.0
793,156,-156.0
794,146,-146.0
795,177,-177.0
796,144,-144.0
797,200,-200.0
798,154,-154.0
799,200,-200.0
800,200,-200.0
801,85,-85.0
802,162,-162.0
803,200,-200.0
804,158,-158.0
805,144,-144.0
806,200,-200.0
807,148,-148.0
808,200,-200.0
809,145,-145.0
810,159,-159.0
811,144,-144.0
812,200,-200.0
813,144,-144.0
814,143,-143.0
815,200,-200.0
816,200,-200.0
817,200,-200.0
818,150,-150.0
819,156,-156.0
820,146,-146.0
821,158,-158.0
822,200,-200.0
823,154,-154.0
824,148,-148.0
825,143,-143.0
826,200,-200.0
827,149,-149.0
828,162,-162.0
829,143,-143.0
830,200,-200.0
831,87,-87.0
832,142,-142.0
833,155,-155.0
834,168,-168.0
835,146,-146.0
836,179,-179.0
837,160,-160.0
838,162,-162.0
839,200,-200.0
840,200,-200.0
841,139,-139.0
842,140,-140.0
843,148,-148.0
844,87,-87.0
845,98,-98.0
846,89,-89.0
847,93,-93.0
848,95,-95.0
849,154,-154.0
850,158,-158.0
851,141,-141.0
852,92,-92.0
853,200,-200.0
854,84,-84.0
855,104,-104.0
856,143,-143.0
857,145,-145.0
858,162,-162.0
859,147,-147.0
860,99,-99.0
861,141,-141.0
862,138,-138.0
863,87,-87.0
864,144,-144.0
865,199,-199.0
866,200,-200.0
867,97,-97.0
868,90,-90.0
869,108,-108.0
870,151,-151.0
871,189,-189.0
872,87,-87.0
873,147,-147.0
874,138,-138.0
875,139,-139.0
876,153,-153.0
877,144,-144.0
878,144,-144.0
879,91,-91.0
880,91,-91.0
881,92,-92.0
882,142,-142.0
883,139,-139.0
884,141,-141.0
885,145,-145.0
886,145,-145.0
887,139,-139.0
888,146,-146.0
889,177,-177.0
890,98,-98.0
891,152,-152.0
892,160,-160.0
893,162,-162.0
894,157,-157.0
895,135,-135.0
896,150,-150.0
897,101,-101.0
898,150,-150.0
899,152,-152.0
900,200,-200.0
901,173,-173.0
902,157,-157.0
903,97,-97.0
904,168,-168.0
905,157,-157.0
906,88,-88.0
907,86,-86.0
908,186,-186.0
909,108,-108.0
910,157,-157.0
911,159,-159.0
912,154,-154.0
913,168,-168.0
914,146,-146.0
915,150,-150.0
916,92,-92.0
917,146,-146.0
918,95,-95.0
919,93,-93.0
920,87,-87.0
921,107,-107.0
922,200,-200.0
923,167,-167.0
924,159,-159.0
925,90,-90.0
926,143,-143.0
927,107,-107.0
928,128,-128.0
929,161,-161.0
930,156,-156.0
931,87,-87.0
932,186,-186.0
933,88,-88.0
934,195,-195.0
935,162,-162.0
936,97,-97.0
937,146,-146.0
938,157,-157.0
939,148,-148.0
940,158,-158.0
941,144,-144.0
942,150,-150.0
943,86,-86.0
944,95,-95.0
945,177,-177.0
946,149,-149.0
947,157,-157.0
948,96,-96.0
949,147,-147.0
950,150,-150.0
951,87,-87.0
952,86,-86.0
953,155,-155.0
954,147,-147.0
955,154,-154.0
956,153,-153.0
957,85,-85.0
958,149,-149.0
959,146,-146.0
960,154,-154.0
961,146,-146.0
962,140,-140.0
963,88,-88.0
964,100,-100.0
965,87,-87.0
966,88,-88.0
967,147,-147.0
968,138,-138.0
969,181,-181.0
970,99,-99.0
971,142,-142.0
972,94,-94.0
973,137,-137.0
974,99,-99.0
975,144,-144.0
976,149,-149.0
977,141,-141.0
978,158,-158.0
979,85,-85.0
980,151,-151.0
981,87,-87.0
982,85,-85.0
983,139,-139.0
984,91,-91.0
985,137,-137.0
986,142,-142.0
987,145,-145.0
988,149,-149.0
989,164,-164.0
990,85,-85.0
991,91,-91.0
992,162,-162.0
993,135,-135.0
994,199,-199.0
995,97,-97.0
996,155,-155.0
997,174,-174.0
998,150,-150.0
999,87,-87.0
1000,93,-93.0
1001,199,-199.0
1002,150,-150.0
1003,100,-100.0
1004,91,-91.0
1005,92,-92.0
1006,94,-94.0
1007,150,-150.0
1008,139,-139.0
1009,99,-99.0
1010,95,-95.0
1011,164,-164.0
1012,147,-147.0
1013,144,-144.0
1014,200,-200.0
1015,151,-151.0
1016,89,-89.0
1017,175,-175.0
1018,200,-200.0
1019,109,-109.0
1020,200,-200.0
1021,200,-200.0
1022,150,-150.0
1023,200,-200.0
1024,136,-136.0
1025,137,-137.0
1026,90,-90.0
1027,86,-86.0
1028,133,-133.0
1029,154,-154.0
1030,92,-92.0
1031,112,-112.0
1032,97,-97.0
1033,184,-184.0
1034,97,-97.0
1035,89,-89.0
1036,110,-110.0
1037,153,-153.0
1038,111,-111.0
1039,97,-97.0
1040,200,-200.0
1041,143,-143.0
1042,149,-149.0
1043,200,-200.0
1044,110,-110.0
1045,85,-85.0
1046,108,-108.0
1047,106,-106.0
1048,163,-163.0
1049,138,-138.0
1050,105,-105.0
1051,83,-83.0
1052,146,-146.0
1053,143,-143.0
1054,160,-160.0
1055,152,-152.0
1056,161,-161.0
1057,151,-151.0
1058,147,-147.0
1059,133,-133.0
1060,175,-175.0
1061,170,-170.0
1062,105,-105.0
1063,105,-105.0
1064,153,-153.0
1065,86,-86.0
1066,138,-138.0
1067,141,-141.0
1068,145,-145.0
1069,189,-189.0
1070,153,-153.0
1071,165,-165.0
1072,185,-185.0
1073,185,-185.0
1074,155,-155.0
1075,150,-150.0
1076,110,-110.0
1077,141,-141.0
1078,154,-154.0
1079,200,-200.0
1080,200,-200.0
1081,119,-119.0
1082,132,-132.0
1083,97,-97.0
1084,182,-182.0
1085,200,-200.0
1086,134,-134.0
1087,200,-200.0
1088,148,-148.0
1089,196,-196.0
1090,200,-200.0
1091,153,-153.0
1092,124,-124.0
1093,100,-100.0
1094,140,-140.0
1095,84,-84.0
1096,198,-198.0
1097,162,-162.0
1098,124,-124.0
1099,147,-147.0
1100,156,-156.0
1101,104,-104.0
1102,119,-119.0
1103,161,-161.0
1104,153,-153.0
1105,187,-187.0
1106,110,-110.0
1107,151,-151.0
1108,105,-105.0
1109,149,-149.0
1110,156,-156.0
1111,104,-104.0
1112,140,-140.0
1113,161,-161.0
1114,157,-157.0
1115,88,-88.0
1116,150,-150.0
1117,151,-151.0
1118,146,-146.0
1119,150,-150.0
1120,147,-147.0
1121,153,-153.0
1122,152,-152.0
1123,159,-159.0
1124,163,-163.0
1125,151,-151.0
1126,120,-120.0
1127,154,-154.0
1128,172,-172.0
1129,162,-162.0
1130,177,-177.0
1131,158,-158.0
1132,87,-87.0
1133,126,-126.0
1134,122,-122.0
1135,95,-95.0
1136,172,-172.0
1137,163,-163.0
1138,174,-174.0
1139,107,-107.0
1140,91,-91.0
1141,153,-153.0
1142,127,-127.0
1143,147,-147.0
1144,168,-168.0
1145,164,-164.0
1146,144,-144.0
1147,182,-182.0
1148,169,-169.0
1149,187,-187.0
1150,168,-168.0
