episodes,steps,rewards
0,93,-158.05156272326298
1,67,-171.79092446944748
2,129,-183.58685354201307
3,87,-219.42627791747358
4,60,-111.72469197584246
5,105,-126.38288016832905
6,66,-81.9813054867813
7,82,-90.43686297589667
8,79,-143.53286396228003
9,66,-80.72505604243881
10,75,-70.4704272857466
11,105,-454.35910092332836
12,107,-245.4471105565216
13,124,-136.68134635130508
14,110,-103.14579215903682
15,415,135.50118588731127
16,1000,-17.69363228223436
17,841,-133.49802909626226
18,356,-183.44883378210932
19,1000,-116.21625722602565
20,168,-299.0844330696878
21,1000,3.6560700202191074
22,536,-193.09216593418236
23,649,-394.5942774638977
24,1000,-100.13322181273499
25,1000,-89.07611432556797
26,1000,-40.918414964974
27,1000,-64.67814327406688
28,173,-123.60362731870597
29,1000,24.57497941247444
30,1000,-19.689017630838688
31,1000,23.453330881435004
32,1000,26.624510562394
33,286,-52.23671749533504
34,158,-51.236060685106274
35,1000,-18.355561603827827
36,729,-213.79752740055494
37,1000,-48.32785916821381
38,468,221.50803392168643
39,433,236.1448068340004
40,1000,86.32665468465304
41,286,-38.28019712649812
42,624,-381.8182634290454
43,432,133.25304729191026
44,483,180.516310257332
45,267,-140.5333939814783
46,799,201.17841130657567
47,570,155.89544443535152
48,1000,86.25456018319395
49,327,257.65202401975705
50,1000,-60.03981171851474
51,367,271.1755041967049
52,655,269.8255907830214
53,391,225.21347715757997
54,242,213.38230530663753
55,310,229.95270335951633
56,1000,121.79361967945427
57,414,216.0343930030559
58,229,250.32698023525643
59,424,220.05641046636487
60,281,271.9024640272038
61,333,223.7614807400838
62,402,203.11513541255738
63,395,226.60580120337838
64,581,277.7927452564239
65,302,214.7004637783363
66,241,240.79129791602114
67,300,250.6295750643817
68,393,251.56501313728248
69,821,221.70634713499751
70,220,-11.493524010786032
71,292,251.4571495081038
72,382,237.25385280737882
73,755,217.08612136812405
74,730,286.21127417499815
75,478,198.9003241163569
76,215,208.05137424963522
77,262,273.1275155849936
78,666,275.71181093007414
79,327,242.76882136818733
80,214,268.87554869663546
81,361,270.05186754286245
82,649,214.9474881967986
83,429,233.8199262096387
84,358,274.820784623569
85,147,2.922359898302304
86,235,207.91605182904317
87,268,229.2711523555115
88,387,-85.09482362100088
89,312,181.95652950285412
90,256,291.9372850046824
91,478,154.06809161272324
92,296,245.14637574592805
93,396,254.6310296879563
94,321,287.10090196362387
95,261,270.2031765480895
96,334,251.69597488467517
97,211,249.02738448019176
98,392,276.9627160982692
99,395,206.91101278239512
100,223,247.05072856095234
