{
    "env": "CartPole-v1",
    "model_info": "common24",
    "num_episodes_solved": [
        580,
        1000,
        788,
        504,
        1367,
        2751,
        816,
        1398,
        583,
        711,
        607,
        216,
        1093,
        979,
        1221
    ]
}