episodes,steps,rewards
0,97,-287.16608593428083
1,105,-285.9637179836135
2,114,-125.62187900317224
3,82,-97.69918022084188
4,70,-93.14102260739222
5,74,-47.96880919308947
6,68,-131.46362316202743
7,107,-50.61943722162579
8,133,-347.33884025835744
9,83,-154.83713112399764
10,63,-66.57402353397333
11,60,-191.84857477185528
12,136,-205.06148579431456
13,178,-182.22627707138287
14,95,-162.8221167053119
15,121,13.880683889385807
16,807,-245.5805819722859
17,1000,-131.4475639981473
18,1000,-132.6273938261918
19,1000,-158.09275043237463
20,1000,-155.2196082149831
21,358,-204.15775012097203
22,1000,-189.55768512554093
23,1000,-191.1781462187958
24,1000,-170.26099541265853
25,1000,-155.7652866723316
26,1000,-133.37913810170193
27,707,-181.43810619901825
28,1000,-89.2864115891299
29,1000,-52.029480612819846
30,1000,-77.73539620131547
31,1000,-159.0006774371406
32,1000,-81.10023502107894
33,1000,-9.674442396395413
34,1000,-166.85505920055056
35,396,-157.15139636854997
36,1000,-148.69459486820676
37,1000,-30.575037304405726
38,1000,-102.92441326181053
39,1000,-48.905797112241025
40,1000,-39.446970338719446
41,1000,-25.335705528655932
42,1000,-33.84751171652826
43,1000,-200.0510565908559
44,1000,-52.995617030476886
45,273,-118.77262946066224
46,162,-149.3644810468071
47,962,-351.41948235694787
48,770,-186.9318884946465
49,1000,-60.66124131327048
50,1000,-45.80071720996359
