{
    "model_info": "common8x16",
    "episodes": [
        9,
        10,
        18,
        66,
        12,
        11,
        9,
        12,
        9,
        11,
        8,
        25,
        10,
        9,
        11,
        10,
        9,
        9,
        10,
        10,
        9,
        10,
        10,
        9,
        9,
        10,
        13,
        9,
        13,
        9,
        12,
        10,
        10,
        9,
        10,
        11,
        10,
        10,
        10,
        14,
        10,
        8,
        11,
        12,
        23,
        10,
        9,
        16,
        11,
        21,
        14,
        9,
        14,
        9,
        20,
        15,
        16,
        32,
        9,
        11,
        15,
        9,
        10,
        9,
        11,
        12,
        12,
        10,
        10,
        10,
        11,
        9,
        11,
        16,
        15,
        9,
        10,
        10,
        14,
        18,
        10,
        11,
        10,
        15,
        9,
        14,
        11,
        9,
        10,
        16,
        12,
        12,
        9,
        9,
        14,
        10,
        14,
        23,
        10,
        9,
        10,
        9,
        14,
        8,
        11,
        18,
        14,
        14,
        12,
        23,
        8,
        14,
        9,
        12,
        22,
        10,
        12,
        10,
        11,
        9,
        10,
        9,
        10,
        10,
        14,
        10,
        10,
        9,
        10,
        12,
        11,
        9,
        10,
        9,
        12,
        12,
        11,
        9,
        9,
        12,
        11,
        10,
        9,
        11,
        9,
        8,
        9,
        9,
        9,
        11,
        11,
        9,
        10,
        14,
        9,
        12,
        15,
        11,
        15,
        9,
        9,
        12,
        8,
        11,
        11,
        8,
        9,
        11,
        10,
        12,
        14,
        8,
        19,
        10,
        9,
        9,
        10,
        13,
        13,
        10,
        9,
        16,
        16,
        11,
        9,
        10,
        12,
        23,
        12,
        8,
        19,
        12,
        15,
        12,
        11,
        15,
        34,
        41,
        56,
        120,
        26,
        18,
        11,
        15,
        10,
        13,
        14,
        10,
        12,
        9,
        8,
        12,
        9,
        10,
        8,
        14,
        10,
        9,
        8,
        10,
        11,
        13,
        9,
        10,
        8,
        11,
        10,
        9,
        9,
        11,
        10,
        10,
        9,
        9,
        9,
        9,
        10,
        9,
        10,
        9,
        10,
        10,
        10,
        11,
        10,
        11,
        9,
        10,
        9,
        9,
        9,
        10,
        10,
        9,
        9,
        9,
        9,
        9,
        8,
        11,
        11,
        8,
        11,
        10,
        10,
        11,
        9,
        9,
        10,
        10,
        10,
        9,
        12,
        9,
        10,
        10,
        10,
        9,
        9,
        10,
        10,
        10,
        10,
        9,
        10,
        11,
        11,
        10,
        11,
        9,
        8,
        9,
        8,
        8,
        9,
        9,
        10,
        9,
        10,
        10,
        10,
        10,
        11,
        10,
        10,
        9,
        10,
        10,
        10,
        8,
        8,
        12,
        9,
        9,
        9,
        9,
        10,
        10,
        9,
        9,
        10,
        10,
        10,
        10,
        9,
        10,
        9,
        10,
        9,
        9,
        9,
        8,
        8,
        10,
        9,
        11,
        9,
        11,
        10,
        9,
        10,
        10,
        11,
        9,
        9,
        9,
        11,
        9,
        10,
        11,
        10,
        9,
        9,
        12,
        8,
        9,
        9,
        10,
        9,
        8,
        10,
        11,
        10,
        8,
        8,
        10,
        10,
        10,
        10,
        9,
        11,
        9,
        9,
        10,
        10,
        9,
        10,
        9,
        11,
        8,
        10,
        10,
        10,
        10,
        10,
        10,
        9,
        9,
        9,
        10,
        9,
        9,
        11,
        14,
        10,
        10,
        10,
        9,
        9,
        10,
        10,
        11,
        9,
        11,
        9,
        8,
        9,
        10,
        10,
        10,
        9,
        9,
        11,
        9,
        10,
        10,
        11,
        10,
        10,
        9,
        11,
        9,
        10,
        9,
        9,
        9,
        10,
        10,
        10,
        9,
        9,
        9,
        11,
        10,
        9,
        9,
        10,
        9,
        9,
        11,
        10,
        9,
        12,
        11,
        10,
        10,
        10,
        9,
        10,
        8,
        10,
        10,
        11,
        10,
        11,
        12,
        8,
        9,
        9,
        9,
        9,
        10,
        11,
        8,
        10,
        10,
        9,
        8,
        10,
        9,
        9,
        8,
        9,
        10,
        11,
        10,
        9,
        9,
        11,
        10,
        9,
        8,
        10,
        8,
        10,
        9,
        11,
        10,
        10,
        10,
        8,
        9,
        9,
        10,
        11,
        10,
        9,
        9,
        9,
        9,
        11,
        10,
        10,
        9,
        9,
        8,
        9,
        11,
        12,
        10,
        10,
        8,
        12,
        11,
        10,
        11,
        8,
        10,
        11,
        11,
        9,
        11,
        10,
        11,
        13,
        11,
        8,
        9,
        9,
        9,
        11,
        10,
        9,
        14,
        12,
        9,
        9,
        10,
        9,
        10,
        10,
        9,
        10,
        16,
        9,
        9,
        10,
        9,
        9,
        10,
        12,
        12,
        10,
        9,
        10,
        9,
        9,
        12,
        10,
        11,
        9,
        9,
        10,
        10,
        10,
        10,
        9,
        12,
        9,
        10,
        12,
        10,
        10,
        11,
        11,
        11,
        9,
        9,
        11,
        8,
        11,
        10,
        8,
        9,
        12,
        9,
        10,
        11,
        9,
        10,
        13,
        12,
        10,
        11,
        10,
        10,
        11,
        9,
        10,
        10,
        11,
        12,
        10,
        10,
        10,
        9,
        9,
        10,
        10,
        10,
        12,
        8,
        9,
        10,
        13,
        13,
        11,
        11,
        12,
        13,
        11,
        14,
        9,
        10,
        10,
        19,
        11,
        13,
        15,
        29,
        21,
        9,
        16,
        16,
        12,
        18,
        14,
        21,
        9,
        19,
        9,
        15,
        14,
        11,
        15,
        10,
        12,
        31,
        11,
        20,
        14,
        17,
        17,
        28,
        21,
        25,
        22,
        65,
        65,
        67,
        23,
        19,
        33,
        14,
        63,
        27,
        25,
        40,
        25,
        22,
        24,
        25,
        58,
        83,
        43,
        33,
        35,
        24,
        28,
        28,
        23,
        23,
        18,
        16,
        23,
        12,
        15,
        15,
        23,
        19,
        26,
        11,
        33,
        24,
        77,
        34,
        53,
        34,
        52,
        60,
        57,
        62,
        44,
        48,
        75,
        16,
        53,
        49,
        45,
        30,
        65,
        11,
        21,
        42,
        15,
        39,
        38,
        65,
        23,
        66,
        30,
        41,
        35,
        38,
        59,
        26,
        36,
        30,
        31,
        22,
        51,
        28,
        48,
        48,
        42,
        28,
        40,
        27,
        73,
        61,
        29,
        82,
        72,
        36,
        30,
        31,
        18,
        23,
        20,
        14,
        26,
        13,
        9,
        11,
        16,
        9,
        10,
        12,
        14,
        11,
        10,
        11,
        16,
        11,
        10,
        11,
        12,
        11,
        14,
        13,
        11,
        12,
        9,
        11,
        10,
        13,
        11,
        11,
        13,
        17,
        12,
        13,
        14,
        10,
        10,
        9,
        11,
        12,
        12,
        11,
        10,
        11,
        15,
        10,
        14,
        13,
        10,
        13,
        9,
        10,
        11,
        12,
        16,
        10,
        13,
        10,
        18,
        12,
        13,
        13,
        19,
        18,
        29,
        35,
        23,
        22,
        25,
        12,
        45,
        39,
        40,
        28,
        60,
        52,
        76,
        102,
        34,
        43,
        115,
        39,
        51,
        20,
        52,
        49,
        42,
        74,
        98,
        59,
        46,
        57,
        60,
        45,
        44,
        37,
        72,
        47,
        39,
        42,
        42,
        43,
        23,
        33,
        30,
        33,
        37,
        29,
        43,
        25,
        53,
        42,
        36,
        45,
        16,
        42,
        51,
        53,
        57,
        56,
        60,
        55,
        72,
        52,
        60,
        62,
        50,
        83,
        69,
        77,
        56,
        70,
        67,
        73,
        55,
        55,
        70,
        89,
        62,
        65,
        79,
        73,
        71,
        141,
        115,
        180,
        139,
        89,
        94,
        97,
        85,
        134,
        96,
        136,
        131,
        164,
        172,
        157,
        114,
        135,
        131,
        90,
        47,
        115,
        167,
        88,
        77,
        74,
        68,
        100,
        118,
        83,
        144,
        103,
        80,
        66,
        154,
        97,
        110,
        80,
        66,
        67,
        63,
        108,
        72,
        130,
        82,
        100,
        61,
        196,
        77,
        78,
        72,
        85,
        103,
        83,
        60,
        86,
        206,
        147,
        157,
        146,
        179,
        216,
        157,
        207,
        166,
        153,
        76,
        163,
        157,
        134,
        159,
        140,
        160,
        135,
        88,
        161,
        85,
        82,
        90,
        145,
        157,
        150,
        86,
        193,
        91,
        117,
        82,
        165,
        176,
        98,
        134,
        152,
        98,
        140,
        122,
        89,
        132,
        214,
        149,
        176,
        156,
        178,
        199,
        207,
        178,
        120,
        117,
        136,
        104,
        111,
        95,
        90,
        98,
        113,
        99,
        140,
        131,
        81,
        87,
        76,
        78,
        86,
        77,
        97,
        58,
        68,
        68,
        74,
        71,
        11,
        77,
        77,
        14,
        73,
        58,
        61,
        89,
        76,
        69,
        65,
        65,
        72,
        73,
        70,
        65,
        68,
        18,
        73,
        85,
        15,
        85,
        73,
        74,
        61,
        79,
        94,
        64,
        64,
        66,
        67,
        81,
        84,
        96,
        93,
        85,
        17,
        82,
        131,
        95,
        106,
        97,
        121,
        150,
        126,
        187,
        309,
        378,
        227,
        238,
        235,
        236,
        181,
        199,
        193,
        12,
        201,
        184,
        170,
        169,
        162,
        170,
        91,
        165,
        171,
        176,
        186,
        19,
        193,
        161,
        179,
        182,
        302,
        184,
        184,
        224,
        173,
        191,
        168,
        187,
        170,
        161,
        176,
        197,
        170,
        174,
        181,
        170,
        180,
        175,
        177,
        181,
        208,
        206,
        203,
        249,
        237,
        206,
        233,
        197,
        264,
        265,
        227,
        227,
        215,
        271,
        225,
        268,
        263,
        386,
        364,
        373,
        500,
        396,
        339,
        500,
        500,
        500,
        500,
        500,
        350,
        213,
        192,
        201,
        237,
        309,
        500,
        500,
        500,
        500,
        500,
        500,
        362,
        387,
        383,
        500,
        500,
        269,
        65,
        189,
        94,
        207,
        471,
        500,
        443,
        293,
        305,
        256,
        235,
        200,
        172,
        179,
        154,
        159,
        138,
        28,
        138,
        133,
        21,
        23,
        139,
        27,
        20,
        21,
        14,
        13,
        20,
        15,
        16,
        15,
        11,
        12,
        16,
        19,
        13,
        20,
        14,
        22,
        17,
        13,
        18,
        16,
        34,
        121,
        19,
        20,
        17,
        18,
        122,
        35,
        28,
        33,
        125,
        119,
        32,
        144,
        18,
        139,
        145,
        130,
        131,
        147,
        137,
        142,
        152,
        165,
        140,
        170,
        179,
        164,
        191,
        169,
        174,
        180,
        178,
        194,
        182,
        189,
        185,
        221,
        187,
        200,
        228,
        273,
        242,
        312,
        41,
        233,
        253,
        243,
        271,
        27,
        258,
        251,
        311,
        50,
        330,
        243,
        325,
        284,
        293,
        323,
        324,
        54,
        353,
        73,
        458,
        114,
        61,
        86,
        54,
        134,
        94,
        95,
        52,
        132,
        65,
        197,
        87,
        500,
        500,
        500,
        500,
        400,
        399,
        440,
        362,
        500,
        429,
        487,
        310,
        252,
        358,
        283,
        289,
        278,
        396,
        269,
        263,
        223,
        221,
        283,
        258,
        254,
        332,
        304,
        213,
        298,
        281,
        284,
        365,
        326,
        293,
        294,
        462,
        271,
        369,
        500,
        346,
        500,
        317,
        367,
        273,
        390,
        490,
        452,
        491,
        440,
        436,
        500,
        429,
        113,
        488,
        83,
        144,
        149,
        45,
        56,
        54,
        63,
        56,
        53,
        105,
        133,
        91,
        90,
        52,
        59,
        52,
        14,
        21,
        48,
        11,
        60,
        100,
        78,
        83,
        56,
        47,
        54,
        54,
        14,
        22,
        114,
        55,
        104,
        109,
        67,
        14,
        96,
        98,
        14,
        31,
        82,
        86,
        83,
        100,
        18,
        94,
        176,
        176,
        125,
        91,
        170,
        80,
        162,
        86,
        72,
        500,
        173,
        500,
        500,
        500,
        500,
        500,
        500,
        270,
        500,
        500,
        500,
        500,
        500,
        500,
        500,
        500,
        500,
        500,
        500,
        500,
        500,
        500,
        500,
        500,
        500,
        500,
        482,
        442,
        451,
        67,
        397,
        388,
        351,
        342,
        382,
        424,
        500,
        432,
        408,
        366,
        350,
        345,
        316,
        328,
        284,
        295,
        358,
        55,
        287,
        332,
        316,
        311,
        317,
        335,
        328,
        330,
        378,
        467,
        490,
        436,
        484,
        500,
        500,
        500,
        440,
        379,
        358,
        298,
        340,
        341,
        66,
        286,
        277,
        271,
        261,
        267,
        233,
        221,
        30,
        223,
        209,
        211,
        184,
        175,
        185,
        185,
        20,
        180,
        19,
        213,
        210,
        201,
        34,
        213,
        183,
        186,
        215,
        215,
        220,
        201,
        210,
        230,
        216,
        230,
        215,
        263,
        263,
        286,
        319,
        315,
        353,
        53,
        369,
        402,
        393,
        54,
        72,
        302,
        264,
        340,
        361,
        419,
        500,
        500,
        500,
        500,
        500,
        500,
        500,
        500,
        500,
        500,
        500,
        500,
        67,
        500,
        500,
        500,
        500,
        500,
        500,
        500,
        500,
        500,
        500,
        500,
        500,
        500,
        500,
        500,
        500,
        500,
        500,
        500,
        500,
        500,
        500,
        500,
        500,
        500,
        500,
        91,
        500,
        500,
        500,
        500,
        77,
        500,
        500,
        500,
        500,
        500,
        500,
        500,
        500,
        500,
        500,
        500,
        500,
        500,
        500,
        500,
        500,
        500,
        500,
        500,
        500,
        500,
        500,
        500,
        500,
        500,
        500,
        500,
        500,
        500,
        500,
        500,
        500,
        500,
        500,
        500,
        500,
        500,
        500,
        473,
        179,
        27,
        187,
        25,
        128,
        155,
        29,
        164,
        199,
        165,
        179,
        170,
        181,
        96,
        374,
        268,
        370,
        485,
        107,
        500,
        500,
        79,
        500,
        500,
        500,
        500,
        500,
        95,
        500,
        500,
        500,
        500,
        500,
        500,
        500,
        500,
        500,
        500,
        500,
        500,
        500,
        81,
        500,
        500,
        92,
        500,
        39,
        87,
        500,
        500,
        500,
        75,
        500,
        500,
        500,
        89,
        500,
        500,
        97,
        500,
        91,
        86,
        500,
        500,
        500,
        500,
        500,
        500,
        500,
        500,
        100,
        500,
        107,
        500,
        500,
        500,
        106,
        500,
        500,
        500,
        500,
        500,
        500,
        104,
        500,
        500,
        500,
        108,
        500,
        500,
        500,
        104,
        500,
        37,
        500,
        103,
        500,
        500,
        500,
        95,
        500,
        500,
        24,
        500,
        22,
        97,
        500,
        500,
        29,
        500,
        25,
        500,
        500,
        123,
        20,
        136,
        500,
        115,
        500,
        122,
        500,
        29,
        500,
        22,
        500,
        500,
        500,
        500,
        500,
        500,
        500,
        500,
        500,
        500,
        500,
        500,
        500,
        500,
        500,
        500,
        500,
        500,
        500,
        129,
        500,
        500,
        500,
        500,
        500,
        500,
        500,
        500,
        500,
        500,
        500,
        500,
        500,
        500,
        500,
        500,
        500,
        500,
        500,
        500,
        500,
        500,
        500,
        500,
        500,
        500,
        500,
        500,
        500,
        500,
        500,
        500,
        500,
        500,
        500,
        500,
        500,
        209,
        500,
        500,
        208,
        500,
        500,
        500,
        431,
        336,
        213,
        500,
        429,
        221,
        486,
        226,
        235,
        262,
        229,
        460,
        243,
        211,
        256,
        458,
        500,
        500,
        500,
        500,
        500,
        500,
        500,
        500,
        500,
        500,
        500,
        500,
        500,
        500,
        500,
        500,
        500,
        500,
        500,
        500,
        500,
        500,
        500,
        500,
        500,
        500,
        246,
        500,
        109,
        95,
        349,
        500,
        500,
        325,
        500,
        162,
        500,
        119,
        500,
        148,
        500,
        408,
        500,
        500,
        500,
        500,
        500,
        500,
        500,
        500,
        500,
        500,
        500,
        500,
        500,
        500,
        500,
        500,
        500,
        500,
        500,
        500,
        500,
        500,
        500,
        500,
        365,
        500,
        131,
        455,
        500,
        500,
        444,
        229,
        318,
        168,
        500,
        313,
        148,
        152,
        500,
        468,
        500,
        500,
        342,
        500,
        477,
        500,
        500,
        420,
        500,
        500,
        500,
        500,
        500,
        500,
        500,
        500,
        500,
        500,
        500,
        500,
        500,
        500,
        500,
        500,
        500,
        500,
        500,
        500,
        500,
        500,
        500,
        500,
        500,
        500,
        500,
        500,
        500,
        500,
        500,
        500,
        500,
        500,
        500,
        500,
        500,
        500,
        500,
        500,
        500,
        500,
        500,
        500,
        500,
        500,
        500,
        500,
        500,
        390,
        500,
        500,
        500,
        61,
        500,
        500,
        500,
        422,
        49,
        57,
        500,
        49,
        51,
        27,
        25,
        500,
        331,
        500,
        500,
        58,
        131,
        500,
        500,
        500,
        20,
        500,
        23,
        72,
        30,
        500,
        81,
        500,
        500,
        28,
        500,
        500,
        18,
        23,
        500,
        68,
        500,
        72,
        68,
        146,
        64,
        69,
        67,
        67,
        165,
        156,
        27,
        500,
        68,
        500,
        500,
        64,
        31,
        500,
        500,
        500,
        500,
        500,
        500,
        500,
        500,
        500,
        500,
        500,
        22,
        30,
        65,
        31,
        500,
        65,
        500,
        25,
        20,
        453,
        379,
        500,
        500,
        75,
        63,
        500,
        500,
        500,
        500,
        500,
        500,
        500,
        500,
        500,
        500,
        500,
        500,
        500,
        23,
        500,
        500,
        500,
        500,
        21,
        500,
        95,
        24,
        500,
        500,
        500,
        24,
        87,
        500,
        500,
        25,
        24,
        500,
        86,
        82,
        93,
        500,
        500,
        75,
        500,
        139,
        75,
        78,
        138,
        500,
        85,
        500,
        145,
        500,
        500,
        175,
        500,
        159,
        99,
        77,
        25,
        86,
        343,
        167,
        24,
        148,
        500,
        20,
        85,
        178,
        500,
        500,
        500,
        375,
        181,
        80,
        348,
        35,
        74,
        188,
        81,
        190,
        186,
        21,
        81,
        197,
        87,
        500,
        278,
        500,
        172,
        500,
        179,
        500,
        500,
        500,
        500,
        500,
        163,
        148,
        500,
        500,
        500,
        500,
        500,
        473,
        500,
        500,
        500,
        500,
        500,
        500,
        500,
        500,
        500,
        500,
        500,
        500,
        500,
        500,
        500,
        500,
        500,
        500,
        500,
        500,
        500,
        500,
        500,
        500,
        500,
        500,
        500,
        500,
        500,
        500,
        500,
        500,
        500,
        500,
        500,
        500,
        500,
        500,
        500,
        500,
        500,
        500,
        500,
        500,
        500,
        500,
        500,
        500,
        500,
        500,
        500,
        500,
        500,
        500,
        500,
        500,
        500,
        500,
        500,
        500,
        500,
        500,
        500,
        500,
        500,
        500,
        500,
        500,
        500,
        500,
        500,
        500,
        500,
        500,
        500,
        500,
        500,
        500,
        500
    ],
    "durations": [
        1.446999,
        0.003643,
        0.005,
        0.019999,
        0.004,
        0.004,
        0.003002,
        0.004,
        0.003,
        0.002999,
        0.002002,
        0.007997,
        0.003005,
        0.002997,
        0.003,
        0.003003,
        0.001999,
        0.003,
        0.003001,
        0.003002,
        0.002998,
        0.003,
        0.003001,
        0.003,
        0.002999,
        0.002999,
        0.005002,
        0.002999,
        0.004004,
        0.002995,
        0.003999,
        0.003001,
        0.003,
        0.003,
        0.003,
        0.003,
        0.003,
        0.003002,
        0.003997,
        0.004001,
        0.003,
        0.003,
        0.003,
        0.003,
        0.006999,
        0.003001,
        0.003,
        0.005002,
        0.002998,
        0.004999,
        0.003998,
        0.003001,
        0.004,
        0.003,
        0.007002,
        0.005997,
        0.008003,
        0.009997,
        0.003,
        0.004002,
        0.003998,
        0.003,
        0.003,
        0.002,
        0.003002,
        0.003999,
        0.003,
        0.004,
        0.005001,
        0.002999,
        0.004001,
        0.003,
        0.003998,
        0.005001,
        0.004,
        0.001999,
        0.003,
        0.003,
        0.004,
        0.005,
        0.003,
        0.003001,
        0.002999,
        0.004002,
        0.002998,
        0.004001,
        0.003001,
        0.002,
        0.003001,
        0.004999,
        0.003,
        0.003,
        0.003,
        0.003002,
        0.003999,
        0.003,
        0.004,
        0.007002,
        0.002999,
        0.002999,
        0.003,
        0.001999,
        0.003,
        0.002,
        0.004,
        0.005001,
        0.003998,
        0.004002,
        0.004,
        0.005997,
        0.002,
        0.005,
        0.003001,
        0.004,
        0.005999,
        0.003,
        0.002998,
        0.004001,
        0.003001,
        0.003,
        0.002999,
        0.001999,
        0.003,
        0.002999,
        0.004001,
        0.004001,
        0.002999,
        0.003,
        0.003,
        0.00401,
        0.002991,
        0.002,
        0.002999,
        0.002001,
        0.003,
        0.004002,
        0.002999,
        0.002999,
        0.003,
        0.004001,
        0.002998,
        0.003001,
        0.003,
        0.003,
        0.003,
        0.002999,
        0.003002,
        0.002999,
        0.003,
        0.002999,
        0.004002,
        0.002999,
        0.003001,
        0.004,
        0.002999,
        0.002999,
        0.004,
        0.004,
        0.004,
        0.002,
        0.001999,
        0.003,
        0.003,
        0.003008,
        0.002992,
        0.002,
        0.003,
        0.004001,
        0.003999,
        0.004001,
        0.005,
        0.003,
        0.005001,
        0.002999,
        0.003001,
        0.003,
        0.003009,
        0.003991,
        0.004001,
        0.003999,
        0.003,
        0.004001,
        0.004,
        0.003,
        0.003,
        0.003001,
        0.003999,
        0.009,
        0.004,
        0.003,
        0.006,
        0.003,
        0.004,
        0.004001,
        0.002999,
        0.003999,
        0.009001,
        0.010999,
        0.015,
        0.032,
        0.007999,
        0.006984,
        0.004003,
        0.004998,
        0.003,
        0.004002,
        0.004997,
        0.003002,
        0.004003,
        0.002999,
        0.002998,
        0.004,
        0.002999,
        0.003001,
        0.002999,
        0.003999,
        0.003004,
        0.002,
        0.003001,
        0.002999,
        0.003,
        0.002999,
        0.002,
        0.001998,
        0.002,
        0.003999,
        0.003003,
        0.002996,
        0.003,
        0.003,
        0.002,
        0.003001,
        0.001999,
        0.002,
        0.002,
        0.003,
        0.003,
        0.002999,
        0.003001,
        0.003001,
        0.003001,
        0.002998,
        0.003,
        0.003001,
        0.002999,
        0.003003,
        0.001999,
        0.003001,
        0.002999,
        0.004004,
        0.003999,
        0.002999,
        0.002999,
        0.001999,
        0.002001,
        0.002,
        0.002,
        0.003001,
        0.003001,
        0.003999,
        0.003,
        0.003001,
        0.002999,
        0.002998,
        0.003,
        0.003,
        0.001999,
        0.001999,
        0.004,
        0.003009,
        0.002992,
        0.002009,
        0.003003,
        0.003004,
        0.002996,
        0.003003,
        0.002997,
        0.003001,
        0.002999,
        0.003003,
        0.003001,
        0.003002,
        0.003,
        0.002998,
        0.002999,
        0.003,
        0.003,
        0.003,
        0.002999,
        0.001985,
        0.002,
        0.003,
        0.003001,
        0.001999,
        0.001998,
        0.003001,
        0.002999,
        0.003002,
        0.002999,
        0.003,
        0.003003,
        0.003,
        0.002998,
        0.003,
        0.003,
        0.003001,
        0.004,
        0.002998,
        0.002991,
        0.002998,
        0.002999,
        0.003,
        0.002999,
        0.003,
        0.003,
        0.003002,
        0.002999,
        0.003,
        0.004,
        0.003,
        0.002999,
        0.003003,
        0.002998,
        0.003001,
        0.003003,
        0.004999,
        0.003997,
        0.003001,
        0.002999,
        0.002999,
        0.003,
        0.002999,
        0.003001,
        0.003,
        0.003,
        0.002999,
        0.002,
        0.003002,
        0.003001,
        0.002997,
        0.003,
        0.003,
        0.004003,
        0.002999,
        0.002999,
        0.002999,
        0.005002,
        0.004,
        0.003999,
        0.004001,
        0.002999,
        0.003008,
        0.00299,
        0.004003,
        0.002998,
        0.004003,
        0.002999,
        0.002999,
        0.003003,
        0.001998,
        0.003001,
        0.004997,
        0.003003,
        0.002006,
        0.001999,
        0.003004,
        0.003,
        0.003,
        0.002999,
        0.003001,
        0.002999,
        0.002999,
        0.003002,
        0.002999,
        0.003001,
        0.002,
        0.002999,
        0.003002,
        0.002999,
        0.003996,
        0.004003,
        0.003001,
        0.002997,
        0.003002,
        0.002999,
        0.003,
        0.003,
        0.004002,
        0.002999,
        0.002998,
        0.003001,
        0.001999,
        0.004006,
        0.004997,
        0.003001,
        0.004001,
        0.002998,
        0.003002,
        0.002998,
        0.003,
        0.003,
        0.003986,
        0.003,
        0.003999,
        0.003016,
        0.001989,
        0.003,
        0.002999,
        0.004,
        0.003004,
        0.002988,
        0.002998,
        0.003001,
        0.003001,
        0.002999,
        0.003001,
        0.003,
        0.003007,
        0.003,
        0.002999,
        0.003004,
        0.002001,
        0.003001,
        0.002998,
        0.003001,
        0.002002,
        0.002,
        0.003003,
        0.002997,
        0.002999,
        0.003001,
        0.002999,
        0.003,
        0.003002,
        0.002,
        0.002003,
        0.001998,
        0.002,
        0.003001,
        0.003999,
        0.003001,
        0.002999,
        0.003003,
        0.003997,
        0.003,
        0.003,
        0.002999,
        0.003001,
        0.003003,
        0.001999,
        0.003,
        0.003,
        0.003,
        0.003001,
        0.003,
        0.003004,
        0.002999,
        0.002996,
        0.003003,
        0.002999,
        0.001999,
        0.003001,
        0.002998,
        0.003001,
        0.002999,
        0.003,
        0.003002,
        0.002,
        0.002002,
        0.003001,
        0.003,
        0.001999,
        0.001999,
        0.002999,
        0.003,
        0.003,
        0.003,
        0.003,
        0.003001,
        0.002999,
        0.003001,
        0.001999,
        0.003001,
        0.001999,
        0.003002,
        0.003001,
        0.002998,
        0.002,
        0.003,
        0.003,
        0.003003,
        0.002,
        0.002003,
        0.002002,
        0.003,
        0.003001,
        0.002999,
        0.003001,
        0.002999,
        0.001999,
        0.003002,
        0.003003,
        0.003996,
        0.003997,
        0.002999,
        0.002004,
        0.001998,
        0.002998,
        0.005001,
        0.003001,
        0.002997,
        0.003001,
        0.002999,
        0.002998,
        0.003001,
        0.003002,
        0.002001,
        0.002998,
        0.003001,
        0.003002,
        0.002999,
        0.002999,
        0.003,
        0.003002,
        0.003,
        0.003,
        0.002006,
        0.002003,
        0.004005,
        0.002994,
        0.004001,
        0.002998,
        0.003003,
        0.005998,
        0.004001,
        0.003001,
        0.003,
        0.003998,
        0.003002,
        0.002998,
        0.003002,
        0.002999,
        0.003002,
        0.004997,
        0.003,
        0.003001,
        0.003001,
        0.001998,
        0.001996,
        0.004001,
        0.003,
        0.003,
        0.003001,
        0.002999,
        0.003004,
        0.002998,
        0.003002,
        0.002999,
        0.003003,
        0.003996,
        0.003001,
        0.004001,
        0.004004,
        0.004,
        0.004002,
        0.003997,
        0.003,
        0.003013,
        0.001992,
        0.002987,
        0.003003,
        0.002001,
        0.002999,
        0.003003,
        0.003002,
        0.002998,
        0.002,
        0.003001,
        0.003998,
        0.002,
        0.002999,
        0.003001,
        0.002002,
        0.002,
        0.003998,
        0.003003,
        0.002997,
        0.004,
        0.003002,
        0.003,
        0.004,
        0.004,
        0.005,
        0.004002,
        0.002998,
        0.002991,
        0.002997,
        0.003003,
        0.003997,
        0.003,
        0.003,
        0.004,
        0.002983,
        0.002984,
        0.003001,
        0.002999,
        0.003001,
        0.002999,
        0.003001,
        0.003001,
        0.003998,
        0.003003,
        0.002984,
        0.003005,
        0.003984,
        0.005003,
        0.003999,
        0.004987,
        0.005997,
        0.004,
        0.003999,
        0.005002,
        0.004002,
        0.002996,
        0.004001,
        0.007,
        0.003998,
        0.005003,
        0.004999,
        0.008998,
        0.007988,
        0.002996,
        0.005002,
        0.003998,
        0.004,
        0.005002,
        0.003999,
        0.005,
        0.002,
        0.006,
        0.002996,
        0.004002,
        0.003998,
        0.003,
        0.004001,
        0.003001,
        0.002999,
        0.008001,
        0.002997,
        0.006002,
        0.006,
        0.004997,
        0.005002,
        0.007999,
        0.00701,
        0.007988,
        0.006004,
        0.017,
        0.020001,
        0.018154,
        0.005999,
        0.005001,
        0.009001,
        0.004,
        0.019005,
        0.008994,
        0.007001,
        0.010999,
        0.007,
        0.007001,
        0.006999,
        0.010002,
        0.016999,
        0.021,
        0.011998,
        0.009001,
        0.009002,
        0.006002,
        0.009002,
        0.007999,
        0.006002,
        0.005997,
        0.005,
        0.004003,
        0.007,
        0.003998,
        0.004002,
        0.003998,
        0.006001,
        0.005001,
        0.007001,
        0.002999,
        0.009,
        0.007,
        0.021003,
        0.009996,
        0.014,
        0.009,
        0.014001,
        0.015999,
        0.015004,
        0.015985,
        0.012014,
        0.015002,
        0.020999,
        0.004998,
        0.014,
        0.015003,
        0.013999,
        0.007998,
        0.017,
        0.004001,
        0.006001,
        0.013,
        0.007,
        0.011999,
        0.011001,
        0.015999,
        0.007002,
        0.017998,
        0.008002,
        0.011002,
        0.009002,
        0.009999,
        0.015002,
        0.007998,
        0.009,
        0.007999,
        0.009003,
        0.005998,
        0.013,
        0.008,
        0.013,
        0.013002,
        0.011998,
        0.011012,
        0.013001,
        0.008,
        0.018999,
        0.016001,
        0.008001,
        0.019998,
        0.019,
        0.012004,
        0.009994,
        0.009001,
        0.005001,
        0.006002,
        0.006,
        0.003997,
        0.007,
        0.002999,
        0.002,
        0.004003,
        0.005974,
        0.002983,
        0.004001,
        0.004003,
        0.004004,
        0.003003,
        0.002998,
        0.003011,
        0.003988,
        0.003001,
        0.002,
        0.003002,
        0.003749,
        0.003,
        0.004004,
        0.003996,
        0.003001,
        0.004001,
        0.002002,
        0.002988,
        0.004001,
        0.005,
        0.003002,
        0.002999,
        0.004002,
        0.004999,
        0.004001,
        0.003998,
        0.004001,
        0.004002,
        0.004,
        0.002997,
        0.003001,
        0.002999,
        0.003001,
        0.002998,
        0.003002,
        0.002998,
        0.004004,
        0.002997,
        0.004001,
        0.004001,
        0.002997,
        0.004002,
        0.003,
        0.003999,
        0.003,
        0.004984,
        0.006017,
        0.002988,
        0.003988,
        0.002997,
        0.007001,
        0.003999,
        0.003999,
        0.004004,
        0.006008,
        0.004988,
        0.009016,
        0.010986,
        0.007998,
        0.006002,
        0.00699,
        0.004,
        0.012001,
        0.011999,
        0.014001,
        0.008001,
        0.015997,
        0.012988,
        0.019985,
        0.026002,
        0.009002,
        0.011997,
        0.030004,
        0.011,
        0.013997,
        0.006004,
        0.013996,
        0.013003,
        0.010997,
        0.022002,
        0.026001,
        0.015996,
        0.012,
        0.014987,
        0.015983,
        0.012,
        0.015002,
        0.011999,
        0.019,
        0.013003,
        0.010985,
        0.010999,
        0.011985,
        0.013999,
        0.010001,
        0.010999,
        0.009002,
        0.008997,
        0.010004,
        0.007999,
        0.011,
        0.006001,
        0.014002,
        0.011003,
        0.010998,
        0.013,
        0.005005,
        0.010998,
        0.014,
        0.014001,
        0.016006,
        0.018996,
        0.015998,
        0.013984,
        0.017986,
        0.018,
        0.016999,
        0.019001,
        0.014,
        0.023,
        0.018999,
        0.019999,
        0.017001,
        0.019002,
        0.017997,
        0.019002,
        0.015998,
        0.013984,
        0.017999,
        0.025985,
        0.018001,
        0.018,
        0.020999,
        0.021001,
        0.017995,
        0.035984,
        0.029986,
        0.046997,
        0.036986,
        0.023,
        0.024,
        0.028001,
        0.022001,
        0.033999,
        0.024999,
        0.037,
        0.037003,
        0.044015,
        0.044985,
        0.041002,
        0.028997,
        0.037,
        0.032985,
        0.024,
        0.014,
        0.033,
        0.042,
        0.025001,
        0.020997,
        0.02,
        0.018002,
        0.026002,
        0.029995,
        0.020998,
        0.036999,
        0.028002,
        0.020999,
        0.016999,
        0.037999,
        0.025002,
        0.028001,
        0.020999,
        0.017003,
        0.016985,
        0.015999,
        0.030001,
        0.018999,
        0.034002,
        0.020998,
        0.025001,
        0.016998,
        0.049002,
        0.02,
        0.019999,
        0.018999,
        0.023001,
        0.026999,
        0.021984,
        0.016002,
        0.022,
        0.052999,
        0.038001,
        0.041999,
        0.038001,
        0.046001,
        0.055,
        0.043,
        0.059004,
        0.042995,
        0.04,
        0.022001,
        0.041999,
        0.043003,
        0.033996,
        0.043001,
        0.036003,
        0.040998,
        0.033001,
        0.023,
        0.040999,
        0.024,
        0.021998,
        0.026999,
        0.039001,
        0.044012,
        0.037989,
        0.023,
        0.049014,
        0.023986,
        0.030998,
        0.026005,
        0.042999,
        0.046996,
        0.029002,
        0.035014,
        0.040989,
        0.025999,
        0.035996,
        0.031002,
        0.023983,
        0.035002,
        0.055985,
        0.040001,
        0.043999,
        0.038997,
        0.044998,
        0.050988,
        0.055,
        0.047999,
        0.031999,
        0.032001,
        0.036999,
        0.027001,
        0.029001,
        0.023999,
        0.027998,
        0.025998,
        0.028,
        0.025001,
        0.038999,
        0.036999,
        0.024003,
        0.022985,
        0.021002,
        0.019984,
        0.023004,
        0.020997,
        0.026824,
        0.016998,
        0.017998,
        0.017001,
        0.019,
        0.018999,
        0.003984,
        0.022,
        0.021,
        0.004002,
        0.021003,
        0.017993,
        0.019016,
        0.022984,
        0.019998,
        0.018001,
        0.019002,
        0.015986,
        0.018002,
        0.021003,
        0.020998,
        0.019003,
        0.021998,
        0.005001,
        0.019,
        0.026003,
        0.005998,
        0.021984,
        0.018998,
        0.018986,
        0.015997,
        0.019998,
        0.023999,
        0.019002,
        0.018998,
        0.018981,
        0.018,
        0.024001,
        0.021997,
        0.024999,
        0.023998,
        0.021999,
        0.003998,
        0.020988,
        0.033985,
        0.027,
        0.028999,
        0.026004,
        0.030996,
        0.038002,
        0.031995,
        0.048015,
        0.080987,
        0.104013,
        0.059986,
        0.062999,
        0.061001,
        0.063997,
        0.048999,
        0.050999,
        0.051001,
        0.005,
        0.049999,
        0.048,
        0.045002,
        0.042999,
        0.040997,
        0.047001,
        0.024997,
        0.044004,
        0.044,
        0.045983,
        0.047002,
        0.005002,
        0.048998,
        0.043,
        0.049001,
        0.047998,
        0.086017,
        0.049986,
        0.047001,
        0.062015,
        0.048988,
        0.049995,
        0.043002,
        0.050003,
        0.044999,
        0.044003,
        0.043997,
        0.049996,
        0.050003,
        0.049001,
        0.047001,
        0.046997,
        0.047999,
        0.047015,
        0.046987,
        0.049996,
        0.054002,
        0.053,
        0.052998,
        0.069,
        0.076011,
        0.053988,
        0.059,
        0.052,
        0.069004,
        0.069997,
        0.060002,
        0.060997,
        0.056999,
        0.072,
        0.056987,
        0.071987,
        0.068995,
        0.103005,
        0.099998,
        0.099001,
        0.137997,
        0.106004,
        0.088986,
        0.136,
        0.137,
        0.138015,
        0.135986,
        0.137998,
        0.092005,
        0.055999,
        0.047981,
        0.050002,
        0.059985,
        0.078,
        0.138,
        0.138002,
        0.142997,
        0.132002,
        0.139998,
        0.140003,
        0.096999,
        0.102999,
        0.100001,
        0.157001,
        0.139014,
        0.071985,
        0.018003,
        0.055002,
        0.032995,
        0.06,
        0.129003,
        0.139999,
        0.118998,
        0.077004,
        0.079995,
        0.067004,
        0.059997,
        0.051004,
        0.045002,
        0.049998,
        0.038984,
        0.039999,
        0.035999,
        0.008,
        0.034999,
        0.034999,
        0.007014,
        0.00599,
        0.036001,
        0.007999,
        0.006002,
        0.005998,
        0.004001,
        0.003998,
        0.005998,
        0.004,
        0.004,
        0.004003,
        0.003997,
        0.004001,
        0.003997,
        0.005002,
        0.003998,
        0.005002,
        0.004001,
        0.007,
        0.005001,
        0.003997,
        0.005,
        0.004999,
        0.010985,
        0.03,
        0.004998,
        0.004999,
        0.005001,
        0.004999,
        0.031001,
        0.009998,
        0.007003,
        0.008001,
        0.030998,
        0.030001,
        0.009003,
        0.036002,
        0.005003,
        0.034998,
        0.037998,
        0.035001,
        0.032985,
        0.036998,
        0.03899,
        0.036993,
        0.039,
        0.043001,
        0.038005,
        0.044015,
        0.044984,
        0.043998,
        0.048002,
        0.043,
        0.044002,
        0.048004,
        0.044999,
        0.051002,
        0.047999,
        0.049001,
        0.046998,
        0.061012,
        0.050988,
        0.050998,
        0.063001,
        0.067999,
        0.063003,
        0.085005,
        0.012997,
        0.059001,
        0.067001,
        0.061999,
        0.072003,
        0.007995,
        0.065002,
        0.065,
        0.079999,
        0.013004,
        0.084983,
        0.065001,
        0.082999,
        0.072986,
        0.073983,
        0.086002,
        0.082999,
        0.014002,
        0.091983,
        0.019001,
        0.120999,
        0.030999,
        0.017001,
        0.023,
        0.014002,
        0.036996,
        0.025455,
        0.023997,
        0.013997,
        0.033002,
        0.016999,
        0.048997,
        0.022001,
        0.134999,
        0.132997,
        0.131526,
        0.131997,
        0.103997,
        0.102283,
        0.116718,
        0.098998,
        0.142,
        0.113999,
        0.131999,
        0.082003,
        0.065004,
        0.092997,
        0.077998,
        0.081005,
        0.069995,
        0.103999,
        0.068004,
        0.072996,
        0.060002,
        0.057998,
        0.074999,
        0.069001,
        0.069005,
        0.087987,
        0.084,
        0.057995,
        0.079014,
        0.079986,
        0.075997,
        0.103004,
        0.088001,
        0.076999,
        0.074999,
        0.124999,
        0.069998,
        0.101003,
        0.138998,
        0.091001,
        0.138002,
        0.085001,
        0.100999,
        0.073999,
        0.104007,
        0.131001,
        0.118997,
        0.131998,
        0.121003,
        0.117997,
        0.133982,
        0.113982,
        0.030001,
        0.132996,
        0.022003,
        0.038998,
        0.041,
        0.011998,
        0.015001,
        0.016999,
        0.018001,
        0.016,
        0.014999,
        0.027998,
        0.034998,
        0.024,
        0.024999,
        0.014996,
        0.014983,
        0.012998,
        0.006007,
        0.005996,
        0.012983,
        0.004001,
        0.016003,
        0.026998,
        0.022002,
        0.024,
        0.015,
        0.012996,
        0.015002,
        0.016004,
        0.004,
        0.006998,
        0.030999,
        0.014996,
        0.027001,
        0.030002,
        0.017001,
        0.003997,
        0.025999,
        0.025999,
        0.003998,
        0.009002,
        0.021,
        0.023997,
        0.021998,
        0.025003,
        0.005,
        0.024015,
        0.047994,
        0.04599,
        0.032004,
        0.023997,
        0.046002,
        0.021001,
        0.041999,
        0.026997,
        0.018999,
        0.141,
        0.047987,
        0.142998,
        0.134999,
        0.134003,
        0.141013,
        0.134986,
        0.133998,
        0.070002,
        0.135998,
        0.138,
        0.135998,
        0.142998,
        0.138001,
        0.139988,
        0.134989,
        0.133001,
        0.136001,
        0.139,
        0.134003,
        0.134,
        0.137995,
        0.145996,
        0.140001,
        0.134998,
        0.135002,
        0.134001,
        0.126999,
        0.116998,
        0.128003,
        0.019996,
        0.111001,
        0.101002,
        0.091983,
        0.089003,
        0.099999,
        0.108002,
        0.138012,
        0.114987,
        0.108999,
        0.096997,
        0.091001,
        0.092001,
        0.088999,
        0.086999,
        0.074002,
        0.077998,
        0.093999,
        0.013998,
        0.076996,
        0.086,
        0.082013,
        0.082985,
        0.082998,
        0.087986,
        0.086,
        0.086999,
        0.101997,
        0.123999,
        0.130999,
        0.117001,
        0.129998,
        0.134001,
        0.138998,
        0.140001,
        0.122998,
        0.104002,
        0.093001,
        0.076996,
        0.087004,
        0.086996,
        0.019001,
        0.070985,
        0.069997,
        0.073,
        0.069998,
        0.071001,
        0.062013,
        0.055984,
        0.008,
        0.059001,
        0.053996,
        0.056001,
        0.045999,
        0.043995,
        0.048003,
        0.052,
        0.006003,
        0.045999,
        0.005999,
        0.057001,
        0.054998,
        0.052999,
        0.008999,
        0.056999,
        0.052999,
        0.049998,
        0.057999,
        0.056998,
        0.056985,
        0.054999,
        0.052997,
        0.061003,
        0.060999,
        0.057997,
        0.055,
        0.075,
        0.068998,
        0.074984,
        0.088002,
        0.083998,
        0.093002,
        0.013998,
        0.102004,
        0.117002,
        0.102001,
        0.014987,
        0.019003,
        0.076998,
        0.067996,
        0.089999,
        0.097002,
        0.123001,
        0.137001,
        0.140998,
        0.134998,
        0.136001,
        0.130984,
        0.134002,
        0.132997,
        0.134,
        0.136998,
        0.135998,
        0.133983,
        0.135998,
        0.019001,
        0.139997,
        0.138005,
        0.137999,
        0.138998,
        0.135001,
        0.135995,
        0.134999,
        0.134,
        0.135996,
        0.133002,
        0.135001,
        0.132986,
        0.135997,
        0.131998,
        0.133,
        0.135,
        0.133998,
        0.134996,
        0.133996,
        0.133,
        0.132987,
        0.133998,
        0.129996,
        0.137003,
        0.132997,
        0.136999,
        0.022995,
        0.135,
        0.135002,
        0.133999,
        0.134983,
        0.020004,
        0.133999,
        0.138998,
        0.134002,
        0.134998,
        0.134,
        0.135998,
        0.133998,
        0.135001,
        0.148996,
        0.149985,
        0.135998,
        0.132002,
        0.132999,
        0.130003,
        0.132996,
        0.135983,
        0.138996,
        0.137001,
        0.133999,
        0.134998,
        0.132015,
        0.132986,
        0.134999,
        0.135001,
        0.131997,
        0.134002,
        0.137998,
        0.132998,
        0.155996,
        0.207001,
        0.162002,
        0.156997,
        0.146,
        0.161998,
        0.152,
        0.143999,
        0.145001,
        0.137001,
        0.125998,
        0.046,
        0.006983,
        0.048003,
        0.008997,
        0.036002,
        0.040004,
        0.008997,
        0.042999,
        0.052016,
        0.042985,
        0.045998,
        0.047001,
        0.046002,
        0.023998,
        0.096999,
        0.072003,
        0.101,
        0.131001,
        0.028001,
        0.135985,
        0.138004,
        0.021,
        0.140998,
        0.139999,
        0.134999,
        0.134002,
        0.137983,
        0.024,
        0.134002,
        0.138001,
        0.139,
        0.132999,
        0.135003,
        0.136998,
        0.137,
        0.135998,
        0.135001,
        0.143999,
        0.134001,
        0.133002,
        0.14,
        0.022999,
        0.136004,
        0.133002,
        0.023999,
        0.132997,
        0.01302,
        0.023982,
        0.134001,
        0.134002,
        0.131999,
        0.019,
        0.139999,
        0.140001,
        0.137003,
        0.022996,
        0.139999,
        0.137001,
        0.025999,
        0.135,
        0.023003,
        0.022,
        0.134006,
        0.146002,
        0.152998,
        0.145004,
        0.140995,
        0.139002,
        0.139998,
        0.137,
        0.027999,
        0.136001,
        0.028001,
        0.138,
        0.139015,
        0.132983,
        0.028003,
        0.134001,
        0.147999,
        0.136,
        0.138999,
        0.134001,
        0.135,
        0.025999,
        0.137,
        0.137,
        0.159006,
        0.027999,
        0.134,
        0.133,
        0.135002,
        0.028001,
        0.137,
        0.011,
        0.136997,
        0.028003,
        0.134995,
        0.138984,
        0.132002,
        0.024999,
        0.133,
        0.134999,
        0.006,
        0.131998,
        0.006,
        0.024999,
        0.136,
        0.135,
        0.008003,
        0.136998,
        0.007001,
        0.136998,
        0.137001,
        0.030999,
        0.006001,
        0.034,
        0.137001,
        0.03,
        0.136995,
        0.030982,
        0.137002,
        0.007999,
        0.137003,
        0.00701,
        0.136987,
        0.132983,
        0.137002,
        0.134001,
        0.131001,
        0.13332,
        0.133003,
        0.131998,
        0.133002,
        0.131998,
        0.133001,
        0.134001,
        0.134,
        0.137999,
        0.133002,
        0.139001,
        0.136002,
        0.138996,
        0.137,
        0.032998,
        0.132999,
        0.137002,
        0.137002,
        0.137997,
        0.139001,
        0.136007,
        0.134984,
        0.133998,
        0.135,
        0.142003,
        0.134983,
        0.135997,
        0.131003,
        0.134001,
        0.133999,
        0.135002,
        0.135002,
        0.131996,
        0.133986,
        0.133,
        0.135001,
        0.134999,
        0.131997,
        0.132002,
        0.132999,
        0.133,
        0.13998,
        0.132998,
        0.135002,
        0.138001,
        0.136001,
        0.136003,
        0.134998,
        0.135998,
        0.144998,
        0.133999,
        0.134999,
        0.054002,
        0.137018,
        0.13898,
        0.053998,
        0.132983,
        0.133984,
        0.134004,
        0.113998,
        0.087001,
        0.055998,
        0.140001,
        0.112997,
        0.055001,
        0.129001,
        0.062997,
        0.063018,
        0.071001,
        0.061984,
        0.125002,
        0.072002,
        0.063994,
        0.069002,
        0.129998,
        0.135003,
        0.133,
        0.136998,
        0.143986,
        0.137998,
        0.136001,
        0.139999,
        0.135999,
        0.137,
        0.139001,
        0.139001,
        0.136004,
        0.141995,
        0.137001,
        0.133,
        0.136001,
        0.131999,
        0.141001,
        0.134999,
        0.137,
        0.137999,
        0.136,
        0.137988,
        0.135002,
        0.138,
        0.13601,
        0.061989,
        0.138003,
        0.026998,
        0.024001,
        0.093003,
        0.139996,
        0.135002,
        0.083998,
        0.139001,
        0.044002,
        0.136,
        0.029983,
        0.137001,
        0.037001,
        0.135001,
        0.107,
        0.138,
        0.138999,
        0.134999,
        0.139003,
        0.134991,
        0.133993,
        0.137999,
        0.134999,
        0.135986,
        0.135998,
        0.132999,
        0.134,
        0.138001,
        0.134999,
        0.135001,
        0.135999,
        0.139001,
        0.135999,
        0.139002,
        0.133997,
        0.136001,
        0.136999,
        0.138003,
        0.138999,
        0.099999,
        0.141001,
        0.034997,
        0.127002,
        0.138999,
        0.138003,
        0.119,
        0.060999,
        0.084,
        0.043,
        0.135,
        0.084003,
        0.037998,
        0.042,
        0.137,
        0.125,
        0.134001,
        0.136,
        0.087999,
        0.136002,
        0.128997,
        0.133,
        0.134001,
        0.110998,
        0.130998,
        0.139004,
        0.134,
        0.133999,
        0.134999,
        0.139002,
        0.140985,
        0.133999,
        0.14,
        0.134,
        0.135999,
        0.135999,
        0.137004,
        0.134985,
        0.139002,
        0.136015,
        0.137984,
        0.142,
        0.135999,
        0.132,
        0.135999,
        0.135998,
        0.134,
        0.137001,
        0.138999,
        0.138,
        0.136,
        0.14,
        0.139,
        0.138001,
        0.139002,
        0.135997,
        0.133999,
        0.138,
        0.134999,
        0.135,
        0.139002,
        0.141002,
        0.142998,
        0.144002,
        0.143999,
        0.139001,
        0.137999,
        0.132001,
        0.137998,
        0.136986,
        0.140998,
        0.136001,
        0.137,
        0.103,
        0.139,
        0.132999,
        0.134999,
        0.020016,
        0.131986,
        0.138,
        0.136,
        0.113,
        0.012999,
        0.015001,
        0.134,
        0.012999,
        0.013,
        0.008001,
        0.007,
        0.136,
        0.088999,
        0.134001,
        0.138,
        0.014999,
        0.034002,
        0.137,
        0.139,
        0.140998,
        0.006001,
        0.133999,
        0.006,
        0.019001,
        0.010001,
        0.135,
        0.021016,
        0.139984,
        0.137,
        0.008001,
        0.133999,
        0.135998,
        0.005,
        0.006001,
        0.140998,
        0.017996,
        0.153002,
        0.022998,
        0.020001,
        0.038002,
        0.016999,
        0.017999,
        0.017002,
        0.020001,
        0.043998,
        0.038999,
        0.007001,
        0.135998,
        0.022001,
        0.135999,
        0.145999,
        0.018001,
        0.009002,
        0.132997,
        0.133998,
        0.134001,
        0.131999,
        0.131986,
        0.137,
        0.141985,
        0.137,
        0.133998,
        0.134983,
        0.137998,
        0.005999,
        0.007998,
        0.016001,
        0.007996,
        0.135002,
        0.017998,
        0.134003,
        0.006999,
        0.005998,
        0.123002,
        0.105001,
        0.132998,
        0.136001,
        0.020997,
        0.017002,
        0.133986,
        0.137998,
        0.134004,
        0.134996,
        0.138002,
        0.137996,
        0.135985,
        0.135997,
        0.136003,
        0.141,
        0.139998,
        0.137,
        0.136996,
        0.008001,
        0.132994,
        0.140002,
        0.141,
        0.135977,
        0.006003,
        0.137996,
        0.025013,
        0.006983,
        0.136018,
        0.141985,
        0.137001,
        0.006998,
        0.021001,
        0.137999,
        0.137988,
        0.005999,
        0.005998,
        0.134001,
        0.021999,
        0.021003,
        0.024,
        0.132998,
        0.134999,
        0.021001,
        0.131002,
        0.034999,
        0.021,
        0.021002,
        0.035999,
        0.135,
        0.021987,
        0.138,
        0.039001,
        0.134998,
        0.132998,
        0.045,
        0.132999,
        0.039996,
        0.024999,
        0.019998,
        0.007001,
        0.021999,
        0.088999,
        0.042,
        0.007,
        0.038999,
        0.137001,
        0.006002,
        0.021998,
        0.046998,
        0.130002,
        0.132,
        0.134001,
        0.098,
        0.044984,
        0.019997,
        0.087999,
        0.008987,
        0.018998,
        0.048002,
        0.021001,
        0.048001,
        0.049996,
        0.006981,
        0.021001,
        0.051003,
        0.022997,
        0.138,
        0.074999,
        0.139002,
        0.046998,
        0.137,
        0.045999,
        0.133986,
        0.133,
        0.133004,
        0.134999,
        0.133,
        0.039997,
        0.039,
        0.134999,
        0.133001,
        0.137,
        0.139005,
        0.136001,
        0.127999,
        0.131998,
        0.133016,
        0.134985,
        0.134002,
        0.137999,
        0.132999,
        0.133998,
        0.132999,
        0.135,
        0.134002,
        0.131998,
        0.14,
        0.133998,
        0.136003,
        0.132999,
        0.133001,
        0.136002,
        0.133998,
        0.132997,
        0.132,
        0.131997,
        0.131998,
        0.133003,
        0.135998,
        0.136999,
        0.139001,
        0.134999,
        0.134999,
        0.137999,
        0.135002,
        0.135,
        0.134,
        0.138001,
        0.133985,
        0.133997,
        0.133999,
        0.135999,
        0.134001,
        0.133998,
        0.133001,
        0.132996,
        0.131998,
        0.134999,
        0.139002,
        0.140002,
        0.133001,
        0.137985,
        0.138998,
        0.138001,
        0.134,
        0.134,
        0.135,
        0.134002,
        0.132999,
        0.137998,
        0.136999,
        0.135985,
        0.133,
        0.134998,
        0.137003,
        0.135,
        0.134997,
        0.146002,
        0.139998,
        0.135999,
        0.135997,
        0.135997,
        0.138999,
        0.137,
        0.138001,
        0.134995,
        0.138,
        0.134998,
        0.137995,
        0.136999,
        0.135001,
        0.143998,
        0.146995,
        0.139013
    ]
}