episodes,steps,rewards
0,129,-239.35130626464377
1,127,-161.18505675447784
2,169,-130.7911261289455
3,165,-84.38790570129403
4,63,-76.05448177382752
5,107,-67.22840362935455
6,974,-334.02935474762467
7,73,-227.10479173154914
8,98,-475.6126836116048
9,97,-408.78698428826226
10,113,-328.12639577216356
11,187,-462.4893223894652
12,110,-112.96296815497055
13,145,-288.3274723306097
14,114,-303.7149002131773
15,142,-347.17521971576855
16,200,-296.71096360568697
17,145,-388.40321142440337
18,355,-172.78108669970146
19,282,-14.661573250423146
20,194,-129.20619406071376
21,199,-79.10291266729593
22,158,-121.7254189965343
23,380,-106.66098375541837
24,589,-191.49551391846728
25,438,-355.19246220395405
26,307,-207.26091936288262
27,1000,-53.004282796363725
28,696,-11.41264448328225
29,315,-51.85195459407315
30,1000,-13.375662266654507
31,806,-152.6381381686852
32,1000,-72.86665249118299
33,450,-1.348425625924861
34,1000,-66.0829627198983
35,145,-104.12195537582657
36,318,-14.59514132969447
37,625,-22.5420881619561
38,1000,58.196644218374516
39,542,-42.241717544567884
40,171,26.280961123236054
41,371,17.60730660973354
42,889,-332.48756157675047
43,210,13.185577653749803
44,191,15.200824006180923
45,641,-94.43029075572714
46,1000,-17.70988751654115
47,812,-64.3192807913677
48,731,232.6441676905346
49,285,29.373489017686353
50,198,-289.2719769923569
51,675,-304.6674052696867
52,179,-57.233634590848766
53,180,282.4221899156332
54,466,-15.126341775686996
55,333,169.888889532902
56,94,14.735724324675786
57,129,20.968984520475715
58,254,251.7130262641051
59,80,-131.36972100205801
60,1000,-58.57706347250046
61,71,-41.14175060701609
62,238,-301.44531760123357
63,186,-130.2380926521295
64,451,-28.37954811699845
65,783,185.13404230465548
66,262,-73.0085670797826
67,117,-52.85869718925056
68,161,51.42840625244446
69,224,281.4064962204928
70,136,-272.021411461322
71,358,-13.829187326576786
72,133,21.95989566718103
73,285,48.810476024440305
74,239,2.152043395752102
75,174,54.63608076540436
76,154,-210.36964431875452
77,304,-105.12093414667659
78,762,-134.62071326918021
79,1000,13.233432695068403
80,85,-119.15128833621866
81,1000,86.66195171571218
82,948,176.75815150993114
83,1000,51.37323568810821
84,433,-134.49779655386772
85,171,-9.818903642468698
86,359,17.50890762322335
87,820,-492.74488066901944
88,1000,98.4140460608608
89,380,246.2761691885866
90,250,-217.41154135217005
91,254,15.397069050028833
92,523,231.2431742436729
93,1000,2.2073888438190945
94,690,182.98450377734338
95,172,-143.5156196338342
96,126,-93.3467152027618
97,1000,-61.18539130545308
98,1000,-153.942496981741
99,117,-232.50700802732072
100,94,-48.31126891634014
101,93,-120.9707311003114
102,500,241.54179567175692
103,616,232.45230604782964
104,485,252.10350177093719
105,445,-86.05835760513969
106,658,-290.2305364051706
107,170,12.313232577653352
108,1000,6.3337947732348
109,128,-149.36330463794468
110,825,168.6884850135998
111,1000,35.462836566373824
112,823,232.7936323313527
113,885,123.17434807575032
114,632,220.09769962115865
115,1000,-35.779561195758035
116,999,117.89432705198004
117,511,199.90242424423175
118,204,-146.7545578125667
119,267,-35.46874488823228
120,976,118.83853467015527
121,616,199.15918324850338
122,678,208.4704606083265
123,504,265.7930520889669
124,347,251.98372542851126
125,506,226.37707878436316
126,382,216.99053906799068
127,358,252.9274157241033
128,1000,-69.62906810026121
129,963,182.56627822972888
130,183,-66.8333807201158
131,132,-1.3668349985375983
132,1000,-85.9680036278517
133,520,190.05758196693262
134,1000,-105.09162000452291
135,137,58.36853921744702
136,459,204.24162165079554
137,382,-52.388044211215075
138,121,-2.499989246782434
139,1000,5.803290300236889
140,123,33.48760371677474
141,85,-68.17541206970307
142,758,204.36393633288276
143,697,188.99691330853733
144,377,-275.59537672674867
145,380,-292.1160717884393
146,102,-55.77119759460308
147,793,184.529678527822
148,423,-37.86587732235747
149,134,39.8459100633886
150,470,211.68323095877935
