episodes,steps,rewards
0,95,-428.5682614779306
1,79,-137.9162707238786
2,56,-110.74895392820983
3,141,22.322124767381894
4,82,-104.03848258008627
5,123,-353.4503911981403
6,124,-325.5387312210747
7,86,-132.54491596800665
8,59,-96.56038316718396
9,99,-321.63816771753335
10,107,-94.16032503156033
11,125,-192.96198101200736
12,72,-127.39683139869852
13,89,-697.6997831723036
14,155,-164.3709624753266
15,102,-137.89639256466646
16,148,-51.462045612339566
17,115,-30.621643111422202
18,83,-78.57636332701252
19,155,-132.39622408156893
20,250,-121.30980930041969
21,363,-321.40889363634506
22,133,-211.1662209472961
23,137,-39.54377768692724
24,191,-105.74656930477457
25,215,-210.39582285843096
26,130,-622.252059589823
27,149,-70.40012464845134
28,439,-1181.5851809741714
29,533,-1237.299993861059
30,295,-6.737161439340284
31,1000,-217.36781575965236
32,1000,-181.86584539524762
33,1000,-116.36760012962392
34,1000,-128.85377955878576
35,1000,-131.98158115045777
36,181,-165.73716890760124
37,758,-199.80438053048962
38,221,-469.91213131269154
39,266,10.546319739482811
40,917,-148.945892911169
41,783,-146.63908940327877
42,922,-250.0656356726116
43,1000,-58.7620156631034
44,1000,-134.35588748656357
45,685,155.98443652205663
46,1000,-68.05871512027635
47,670,-118.28082268292098
48,458,-110.95856870648775
49,929,-95.3222231150074
50,876,-219.4004221672843
51,837,-146.64240174981506
52,1000,-177.3638610833525
53,1000,-89.01221166874588
54,788,-126.90352557825595
55,72,-344.98575895732176
56,1000,-61.46006738624607
57,1000,-67.6543021834208
58,1000,-78.0474860663799
59,419,-179.70880002064317
60,168,-137.6114490726282
61,84,-192.27385965195353
62,1000,-96.19280918370691
63,335,-608.7615107490925
64,1000,-137.08625218461586
65,1000,-89.47539065720848
66,950,127.13419794855557
67,1000,-26.718974371266658
68,249,-146.1245348535364
69,360,-182.33526695072902
70,651,-255.141408004267
71,174,-153.9503646767584
72,330,-257.7189876426621
73,1000,-82.62396474359632
74,1000,-55.51706221205156
75,221,-70.57629597625855
76,1000,-59.54292708333295
77,175,-107.05720495740576
78,245,-534.9442492565709
79,981,-349.50120247826953
80,720,-116.85522581313684
81,920,-171.5732353191489
82,94,-89.77891858475816
83,1000,-84.81272450070715
84,1000,-220.7783662953367
85,1000,-132.44059184606485
86,1000,-112.27716978702993
87,1000,-32.47740936527026
88,1000,-110.10403838859234
89,1000,-64.6383451190692
90,388,-38.189565390868836
91,720,-200.67580898106425
92,63,-169.89456647663124
93,122,-127.1248123334152
94,80,-187.86297317143578
95,58,-196.38974870329832
96,57,-132.42003088928936
97,71,-41.59826327579161
98,197,-114.71684865702208
99,1000,-16.975737533039197
100,1000,-2.2344376688608096
