{
    "model_info": "common128",
    "episodes": [
        38,
        21,
        26,
        11,
        13,
        12,
        11,
        28,
        29,
        23,
        23,
        14,
        10,
        12,
        10,
        12,
        12,
        9,
        12,
        10,
        9,
        11,
        15,
        10,
        10,
        8,
        9,
        9,
        9,
        10,
        9,
        9,
        10,
        10,
        12,
        9,
        9,
        10,
        11,
        9,
        9,
        10,
        10,
        9,
        9,
        12,
        11,
        11,
        11,
        9,
        8,
        11,
        11,
        9,
        8,
        8,
        10,
        9,
        8,
        10,
        12,
        12,
        9,
        11,
        12,
        14,
        13,
        10,
        10,
        10,
        14,
        9,
        9,
        9,
        10,
        11,
        12,
        10,
        8,
        10,
        11,
        12,
        9,
        11,
        12,
        11,
        13,
        10,
        11,
        12,
        9,
        9,
        12,
        18,
        17,
        15,
        10,
        11,
        18,
        14,
        17,
        17,
        17,
        14,
        32,
        62,
        33,
        73,
        39,
        70,
        52,
        66,
        53,
        69,
        47,
        139,
        87,
        76,
        72,
        54,
        88,
        57,
        88,
        46,
        67,
        38,
        46,
        160,
        98,
        126,
        82,
        89,
        104,
        78,
        95,
        80,
        63,
        49,
        45,
        55,
        80,
        61,
        85,
        89,
        75,
        53,
        60,
        52,
        49,
        50,
        96,
        54,
        102,
        59,
        56,
        73,
        80,
        71,
        82,
        49,
        52,
        48,
        60,
        58,
        56,
        48,
        96,
        81,
        99,
        132,
        74,
        93,
        87,
        124,
        97,
        107,
        93,
        127,
        106,
        70,
        111,
        112,
        101,
        96,
        102,
        118,
        103,
        108,
        98,
        101,
        91,
        133,
        128,
        126,
        108,
        95,
        80,
        78,
        67,
        63,
        67,
        97,
        88,
        63,
        37,
        51,
        105,
        98,
        90,
        45,
        68,
        97,
        84,
        95,
        96,
        89,
        98,
        88,
        83,
        73,
        70,
        79,
        85,
        86,
        95,
        102,
        89,
        61,
        55,
        59,
        71,
        76,
        78,
        88,
        108,
        108,
        119,
        115,
        119,
        117,
        131,
        126,
        130,
        100,
        105,
        104,
        151,
        148,
        135,
        113,
        164,
        149,
        154,
        148,
        156,
        160,
        179,
        192,
        232,
        255,
        222,
        207,
        455,
        407,
        500,
        439,
        404,
        329,
        306,
        291,
        377,
        369,
        381,
        405,
        393,
        493,
        500,
        500,
        500,
        500,
        500,
        500,
        500,
        474,
        500,
        261,
        500,
        500,
        500,
        500,
        500,
        500,
        306,
        500,
        500,
        500,
        500,
        500,
        500,
        500,
        500,
        500,
        500,
        500,
        500,
        500,
        500,
        500,
        500,
        500,
        500,
        500,
        500,
        500,
        500,
        500,
        500,
        500,
        500,
        500,
        500,
        500,
        500,
        500,
        500,
        500,
        500,
        500,
        500,
        500,
        500,
        500,
        500,
        500,
        500,
        500,
        500,
        500,
        500,
        500,
        500,
        500,
        500,
        500,
        500,
        500,
        500,
        500,
        500,
        500,
        500,
        500,
        500,
        500,
        500,
        500,
        500,
        500,
        500,
        500
    ],
    "durations": [
        1.22851,
        0.016742,
        0.0,
        0.0,
        0.016572,
        0.003998,
        0.00134,
        0.0,
        0.015625,
        0.0,
        0.0,
        0.015627,
        0.0,
        0.0,
        0.0,
        0.015625,
        0.0,
        0.0,
        0.0,
        0.0,
        0.015625,
        0.0,
        0.0,
        0.0,
        0.016776,
        0.0,
        0.0,
        0.0,
        0.0,
        0.0,
        0.015623,
        0.0,
        0.0,
        0.0,
        0.0,
        0.016912,
        0.003,
        0.00125,
        0.0,
        0.0,
        0.0,
        0.0,
        0.015624,
        0.0,
        0.0,
        0.0,
        0.0,
        0.015627,
        0.0,
        0.0,
        0.0,
        0.0,
        0.015624,
        0.0,
        0.0,
        0.0,
        0.0,
        0.0,
        0.016915,
        0.0,
        0.0,
        0.0,
        0.0,
        0.015625,
        0.0,
        0.0,
        0.0,
        0.016068,
        0.002999,
        0.002239,
        0.0,
        0.0,
        0.0,
        0.0,
        0.015628,
        0.0,
        0.0,
        0.0,
        0.0,
        0.015625,
        0.0,
        0.0,
        0.0,
        0.0,
        0.015624,
        0.0,
        0.0,
        0.0,
        0.0,
        0.016743,
        0.0,
        0.0,
        0.0,
        0.0,
        0.015625,
        0.0,
        0.0,
        0.0,
        0.015625,
        0.0,
        0.0,
        0.017027,
        0.004279,
        0.0,
        0.0,
        0.015626,
        0.015627,
        0.016774,
        0.015628,
        0.015625,
        0.020106,
        0.016836,
        0.0,
        0.031447,
        0.001062,
        0.03125,
        0.036831,
        0.015625,
        0.016802,
        0.015625,
        0.015629,
        0.015624,
        0.020104,
        0.015627,
        0.015636,
        0.016741,
        0.015626,
        0.031252,
        0.021116,
        0.016772,
        0.031252,
        0.015628,
        0.035892,
        0.015625,
        0.03237,
        0.015627,
        0.015625,
        0.015625,
        0.0,
        0.020179,
        0.015626,
        0.0168,
        0.031252,
        0.015624,
        0.015628,
        0.020093,
        0.015625,
        0.016782,
        0.015626,
        0.015629,
        0.015624,
        0.015624,
        0.02119,
        0.01678,
        0.015626,
        0.015626,
        0.031249,
        0.020266,
        0.015625,
        0.021713,
        0.012999,
        0.008032,
        0.015628,
        0.015623,
        0.018198,
        0.002254,
        0.03237,
        0.015625,
        0.015626,
        0.021228,
        0.031451,
        0.016654,
        0.015625,
        0.031251,
        0.036986,
        0.015625,
        0.031251,
        0.031251,
        0.02207,
        0.015627,
        0.03125,
        0.031249,
        0.015625,
        0.036808,
        0.015627,
        0.031251,
        0.031249,
        0.022151,
        0.031249,
        0.015625,
        0.031255,
        0.037935,
        0.031253,
        0.031247,
        0.016754,
        0.035568,
        0.016855,
        0.015625,
        0.015629,
        0.01683,
        0.015627,
        0.031234,
        0.015628,
        0.015623,
        0.016757,
        0.018872,
        0.016858,
        0.031252,
        0.015624,
        0.015627,
        0.016793,
        0.020209,
        0.015625,
        0.015628,
        0.018024,
        0.020134,
        0.03125,
        0.015627,
        0.015624,
        0.016711,
        0.02108,
        0.031251,
        0.015625,
        0.015627,
        0.03247,
        0.021288,
        0.031252,
        0.015625,
        0.0,
        0.016841,
        0.015624,
        0.018927,
        0.017875,
        0.015626,
        0.032375,
        0.015628,
        0.021278,
        0.032432,
        0.031254,
        0.031248,
        0.037036,
        0.032294,
        0.031252,
        0.015625,
        0.037348,
        0.031249,
        0.031255,
        0.037591,
        0.031251,
        0.031251,
        0.053243,
        0.031251,
        0.046878,
        0.036922,
        0.031254,
        0.046875,
        0.053641,
        0.046874,
        0.053548,
        0.063682,
        0.067071,
        0.048088,
        0.131924,
        0.100394,
        0.137395,
        0.116423,
        0.124309,
        0.083344,
        0.079327,
        0.085902,
        0.09914,
        0.096002,
        0.100998,
        0.10513,
        0.106001,
        0.132999,
        0.134,
        0.133001,
        0.121215,
        0.136223,
        0.116027,
        0.144891,
        0.129986,
        0.126004,
        0.116866,
        0.068223,
        0.141412,
        0.131143,
        0.132006,
        0.126409,
        0.13332,
        0.116156,
        0.084973,
        0.138977,
        0.135165,
        0.135999,
        0.136998,
        0.138001,
        0.13,
        0.130818,
        0.130999,
        0.134,
        0.131998,
        0.128983,
        0.132986,
        0.130998,
        0.132971,
        0.140985,
        0.132998,
        0.132107,
        0.131229,
        0.131813,
        0.130999,
        0.126883,
        0.14664,
        0.118519,
        0.135606,
        0.131631,
        0.131814,
        0.116083,
        0.143707,
        0.131388,
        0.131126,
        0.132211,
        0.130584,
        0.116063,
        0.131416,
        0.13679,
        0.131779,
        0.120418,
        0.130609,
        0.13292,
        0.130767,
        0.132969,
        0.118262,
        0.131621,
        0.132856,
        0.1363,
        0.130998,
        0.132999,
        0.131001,
        0.131164,
        0.157998,
        0.139004,
        0.131998,
        0.134138,
        0.128023,
        0.115212,
        0.131906,
        0.137507,
        0.132004,
        0.116318,
        0.13124,
        0.130486,
        0.130316,
        0.130344,
        0.136592,
        0.115678,
        0.131626,
        0.130692
    ]
}