episodes,steps,rewards
0,200,-200.0
1,200,-200.0
2,200,-200.0
3,200,-200.0
4,200,-200.0
5,200,-200.0
6,200,-200.0
7,200,-200.0
8,200,-200.0
9,200,-200.0
10,200,-200.0
11,200,-200.0
12,200,-200.0
13,200,-200.0
14,200,-200.0
15,200,-200.0
16,200,-200.0
17,200,-200.0
18,200,-200.0
19,200,-200.0
20,200,-200.0
21,200,-200.0
22,200,-200.0
23,200,-200.0
24,200,-200.0
25,200,-200.0
26,200,-200.0
27,200,-200.0
28,200,-200.0
29,200,-200.0
30,200,-200.0
31,200,-200.0
32,200,-200.0
33,200,-200.0
34,200,-200.0
35,200,-200.0
36,200,-200.0
37,200,-200.0
38,200,-200.0
39,200,-200.0
40,200,-200.0
41,200,-200.0
42,200,-200.0
43,200,-200.0
44,200,-200.0
45,200,-200.0
46,200,-200.0
47,200,-200.0
48,200,-200.0
49,200,-200.0
50,200,-200.0
51,200,-200.0
52,200,-200.0
53,200,-200.0
54,200,-200.0
55,200,-200.0
56,200,-200.0
57,200,-200.0
58,200,-200.0
59,200,-200.0
60,200,-200.0
61,200,-200.0
62,200,-200.0
63,200,-200.0
64,200,-200.0
65,200,-200.0
66,200,-200.0
67,200,-200.0
68,200,-200.0
69,200,-200.0
70,200,-200.0
71,200,-200.0
72,200,-200.0
73,200,-200.0
74,200,-200.0
75,200,-200.0
76,200,-200.0
77,200,-200.0
78,200,-200.0
79,200,-200.0
80,200,-200.0
81,200,-200.0
82,200,-200.0
83,200,-200.0
84,200,-200.0
85,200,-200.0
86,200,-200.0
87,200,-200.0
88,200,-200.0
89,200,-200.0
90,200,-200.0
91,200,-200.0
92,200,-200.0
93,200,-200.0
94,200,-200.0
95,200,-200.0
96,200,-200.0
97,200,-200.0
98,200,-200.0
99,200,-200.0
100,200,-200.0
101,200,-200.0
102,200,-200.0
103,200,-200.0
104,163,-163.0
105,200,-200.0
106,200,-200.0
107,149,-149.0
108,200,-200.0
109,200,-200.0
110,200,-200.0
111,129,-129.0
112,200,-200.0
113,200,-200.0
114,200,-200.0
115,200,-200.0
116,131,-131.0
117,200,-200.0
118,200,-200.0
119,200,-200.0
120,200,-200.0
121,200,-200.0
122,200,-200.0
123,200,-200.0
124,200,-200.0
125,200,-200.0
126,200,-200.0
127,200,-200.0
128,200,-200.0
129,200,-200.0
130,128,-128.0
131,200,-200.0
132,200,-200.0
133,200,-200.0
134,200,-200.0
135,200,-200.0
136,165,-165.0
137,200,-200.0
138,200,-200.0
139,200,-200.0
140,200,-200.0
141,143,-143.0
142,200,-200.0
143,200,-200.0
144,200,-200.0
145,198,-198.0
146,200,-200.0
147,200,-200.0
148,200,-200.0
149,164,-164.0
150,200,-200.0
151,200,-200.0
152,200,-200.0
153,200,-200.0
154,200,-200.0
155,200,-200.0
156,169,-169.0
157,155,-155.0
158,200,-200.0
159,200,-200.0
160,181,-181.0
161,200,-200.0
162,200,-200.0
163,200,-200.0
164,200,-200.0
165,200,-200.0
166,153,-153.0
167,177,-177.0
168,200,-200.0
169,200,-200.0
170,143,-143.0
171,177,-177.0
172,200,-200.0
173,200,-200.0
174,200,-200.0
175,199,-199.0
176,200,-200.0
177,200,-200.0
178,141,-141.0
179,200,-200.0
180,143,-143.0
181,200,-200.0
182,200,-200.0
183,200,-200.0
184,200,-200.0
185,152,-152.0
186,200,-200.0
187,189,-189.0
188,200,-200.0
189,200,-200.0
190,200,-200.0
191,200,-200.0
192,179,-179.0
193,159,-159.0
194,149,-149.0
195,200,-200.0
196,160,-160.0
197,200,-200.0
198,143,-143.0
199,200,-200.0
200,200,-200.0
201,133,-133.0
202,200,-200.0
203,151,-151.0
204,169,-169.0
205,200,-200.0
206,200,-200.0
207,138,-138.0
208,200,-200.0
209,166,-166.0
210,200,-200.0
211,200,-200.0
212,200,-200.0
213,149,-149.0
214,87,-87.0
215,148,-148.0
216,200,-200.0
217,174,-174.0
218,200,-200.0
219,183,-183.0
220,169,-169.0
221,159,-159.0
222,146,-146.0
223,142,-142.0
224,88,-88.0
225,200,-200.0
226,155,-155.0
227,200,-200.0
228,148,-148.0
229,178,-178.0
230,117,-117.0
231,200,-200.0
232,117,-117.0
233,147,-147.0
234,111,-111.0
235,163,-163.0
236,168,-168.0
237,157,-157.0
238,110,-110.0
239,152,-152.0
240,117,-117.0
241,164,-164.0
242,132,-132.0
243,122,-122.0
244,140,-140.0
245,150,-150.0
246,149,-149.0
247,112,-112.0
248,154,-154.0
249,153,-153.0
250,134,-134.0
251,152,-152.0
252,87,-87.0
253,162,-162.0
254,149,-149.0
255,150,-150.0
256,144,-144.0
257,152,-152.0
258,166,-166.0
259,147,-147.0
260,112,-112.0
261,154,-154.0
262,133,-133.0
263,124,-124.0
264,200,-200.0
265,154,-154.0
266,153,-153.0
267,166,-166.0
268,183,-183.0
269,116,-116.0
270,119,-119.0
271,161,-161.0
272,159,-159.0
273,180,-180.0
274,200,-200.0
275,163,-163.0
276,149,-149.0
277,155,-155.0
278,139,-139.0
279,135,-135.0
280,200,-200.0
281,181,-181.0
282,172,-172.0
283,153,-153.0
284,147,-147.0
285,155,-155.0
286,154,-154.0
287,108,-108.0
288,171,-171.0
289,180,-180.0
290,164,-164.0
291,124,-124.0
292,174,-174.0
293,150,-150.0
294,161,-161.0
295,94,-94.0
296,138,-138.0
297,170,-170.0
298,141,-141.0
299,146,-146.0
300,148,-148.0
301,145,-145.0
302,142,-142.0
303,107,-107.0
304,113,-113.0
305,153,-153.0
306,84,-84.0
307,114,-114.0
308,93,-93.0
309,149,-149.0
310,137,-137.0
311,155,-155.0
312,169,-169.0
313,149,-149.0
314,158,-158.0
315,91,-91.0
316,144,-144.0
317,155,-155.0
318,148,-148.0
319,158,-158.0
320,115,-115.0
321,144,-144.0
322,171,-171.0
323,180,-180.0
324,183,-183.0
325,102,-102.0
326,189,-189.0
327,116,-116.0
328,151,-151.0
329,167,-167.0
330,147,-147.0
331,163,-163.0
332,163,-163.0
333,165,-165.0
334,143,-143.0
335,152,-152.0
336,147,-147.0
337,121,-121.0
338,116,-116.0
339,157,-157.0
340,169,-169.0
341,136,-136.0
342,168,-168.0
343,151,-151.0
344,180,-180.0
345,92,-92.0
346,125,-125.0
347,143,-143.0
348,143,-143.0
349,148,-148.0
350,148,-148.0
351,146,-146.0
352,84,-84.0
353,178,-178.0
354,150,-150.0
355,134,-134.0
356,152,-152.0
357,148,-148.0
358,151,-151.0
359,150,-150.0
360,149,-149.0
361,179,-179.0
362,87,-87.0
363,146,-146.0
364,153,-153.0
365,163,-163.0
366,150,-150.0
367,200,-200.0
368,141,-141.0
369,200,-200.0
370,144,-144.0
371,156,-156.0
372,134,-134.0
373,144,-144.0
374,163,-163.0
375,156,-156.0
376,149,-149.0
377,148,-148.0
378,133,-133.0
379,136,-136.0
380,109,-109.0
381,147,-147.0
382,152,-152.0
383,133,-133.0
384,135,-135.0
385,134,-134.0
386,131,-131.0
387,192,-192.0
388,110,-110.0
389,105,-105.0
390,141,-141.0
391,146,-146.0
392,135,-135.0
393,152,-152.0
394,133,-133.0
395,136,-136.0
396,127,-127.0
397,84,-84.0
398,142,-142.0
399,144,-144.0
400,172,-172.0
401,119,-119.0
402,162,-162.0
403,112,-112.0
404,164,-164.0
405,140,-140.0
406,143,-143.0
407,143,-143.0
408,114,-114.0
409,101,-101.0
410,113,-113.0
411,115,-115.0
412,125,-125.0
413,86,-86.0
414,108,-108.0
415,110,-110.0
416,114,-114.0
417,139,-139.0
418,189,-189.0
419,110,-110.0
420,109,-109.0
421,84,-84.0
422,114,-114.0
423,108,-108.0
424,139,-139.0
425,157,-157.0
426,131,-131.0
427,117,-117.0
428,133,-133.0
429,168,-168.0
430,164,-164.0
431,164,-164.0
432,198,-198.0
433,108,-108.0
434,141,-141.0
435,152,-152.0
436,163,-163.0
437,112,-112.0
438,154,-154.0
439,168,-168.0
440,151,-151.0
441,152,-152.0
442,90,-90.0
443,84,-84.0
444,173,-173.0
445,86,-86.0
446,169,-169.0
447,147,-147.0
448,96,-96.0
449,87,-87.0
450,103,-103.0
451,200,-200.0
452,96,-96.0
453,138,-138.0
454,96,-96.0
455,152,-152.0
456,153,-153.0
457,144,-144.0
458,143,-143.0
459,142,-142.0
460,162,-162.0
461,150,-150.0
462,176,-176.0
463,142,-142.0
464,140,-140.0
465,142,-142.0
466,150,-150.0
467,148,-148.0
468,86,-86.0
469,89,-89.0
470,156,-156.0
471,149,-149.0
472,98,-98.0
473,106,-106.0
474,88,-88.0
475,144,-144.0
476,155,-155.0
477,152,-152.0
478,86,-86.0
479,107,-107.0
480,138,-138.0
481,86,-86.0
482,167,-167.0
483,132,-132.0
484,144,-144.0
485,170,-170.0
486,135,-135.0
487,159,-159.0
488,86,-86.0
489,166,-166.0
490,134,-134.0
491,90,-90.0
492,164,-164.0
493,150,-150.0
494,142,-142.0
495,136,-136.0
496,151,-151.0
497,136,-136.0
498,88,-88.0
499,140,-140.0
500,147,-147.0
501,143,-143.0
502,140,-140.0
503,84,-84.0
504,140,-140.0
505,148,-148.0
506,142,-142.0
507,136,-136.0
508,137,-137.0
509,147,-147.0
510,130,-130.0
511,91,-91.0
512,146,-146.0
513,145,-145.0
514,145,-145.0
515,89,-89.0
516,84,-84.0
517,85,-85.0
518,89,-89.0
519,141,-141.0
520,87,-87.0
521,156,-156.0
522,142,-142.0
523,83,-83.0
524,143,-143.0
525,135,-135.0
526,200,-200.0
527,149,-149.0
528,200,-200.0
529,142,-142.0
530,166,-166.0
531,145,-145.0
532,94,-94.0
533,200,-200.0
534,89,-89.0
535,137,-137.0
536,89,-89.0
537,157,-157.0
538,95,-95.0
539,144,-144.0
540,161,-161.0
541,91,-91.0
542,200,-200.0
543,148,-148.0
544,153,-153.0
545,189,-189.0
546,94,-94.0
547,154,-154.0
548,169,-169.0
549,130,-130.0
550,181,-181.0
