episodes,steps,rewards
0,115,-213.56667834142976
1,69,-65.87251870260607
2,88,-213.63973514077207
3,150,71.30521870548921
4,109,-530.2317907120764
5,91,-138.20016965256198
6,377,-240.60352432706154
7,157,-196.0193075107711
8,102,-171.94666355557706
9,168,-127.54237553651906
10,1000,-101.40242490687903
11,322,-178.69700752031844
12,473,-344.03857626623585
13,921,-148.52070202480536
14,414,-76.49010722636618
15,1000,-165.0031961267533
16,519,-166.55902383472414
17,421,-56.60017417672728
18,331,-148.4383235950601
19,585,-275.7678966009995
20,1000,-53.426948782733994
21,1000,-75.09653999482276
22,1000,-65.4659950454031
23,216,-78.91710667991651
24,302,-185.2400327358876
25,1000,-61.65720573505686
26,1000,-73.17828688457453
27,1000,-64.83102982873683
28,1000,-64.98289832183184
29,1000,-2.26790747890436
30,198,-49.43729241808399
31,1000,-102.58525960546442
32,1000,-52.227237277299935
33,1000,-7.451253873786524
34,1000,22.12768285982335
35,520,-269.0006216880804
36,646,-146.54433593349262
37,1000,-10.321312218065625
38,1000,32.96059172930102
39,1000,-18.97807993432665
40,1000,-34.92487358199816
41,1000,5.892033667331391
42,1000,-15.174124255961482
43,744,-144.2751293158846
44,573,-261.40032442644633
45,1000,1.0663728075504075
46,1000,-69.76144692498056
47,1000,-108.77839158637273
48,1000,-66.42756726628325
49,1000,-49.274425250610406
50,1000,13.754162716469818
51,1000,-8.21196341357677
52,1000,-6.748978229867544
53,1000,8.421580318496712
54,1000,-52.41140144708663
55,1000,-16.12090526514234
56,1000,-46.30928831773231
57,1000,-10.550183327156827
58,1000,-27.667777099592872
59,1000,-50.880079154803624
60,1000,-36.98529220870599
61,1000,-21.64408180850497
62,1000,6.503448132047751
63,1000,-19.453861252953793
64,1000,-3.0009948179690493
65,1000,23.547708444129878
66,1000,-23.661750091964414
67,1000,-28.02083192089254
68,1000,-26.07773265032447
69,763,-191.16659169734885
70,1000,-0.501004098553137
71,1000,6.398329547409181
72,1000,-24.30602601706593
73,1000,-11.382053084369431
74,344,-313.43202503657227
75,1000,12.281985026209522
76,1000,16.354531836233534
77,1000,-51.64353184642514
78,1000,17.73817134289315
79,1000,20.60496506906437
80,1000,-3.1716908606154766
81,1000,15.137176304178741
82,1000,-24.493233105235404
83,1000,-37.89407816698389
84,1000,-35.29803342462249
85,1000,-71.85235864722071
86,1000,-42.31012047941139
87,1000,-22.52048613808864
88,1000,-24.50992688565101
89,1000,-3.4351573721643915
90,1000,-56.460356076012964
91,1000,-31.9519930996707
92,992,-129.89530225441808
93,700,-205.33009958997422
94,1000,-77.13050540585479
95,1000,-2.1708009365672982
96,1000,-67.0146771266633
97,1000,-8.913660467859517
98,1000,15.43400885110146
99,1000,-6.08342424149383
100,1000,-11.198203993352509
101,1000,37.892350124565915
102,1000,-40.04117149825481
103,1000,-8.651774463332162
104,1000,-41.48034845856316
105,128,-143.7502723423727
106,1000,5.684920567317315
107,1000,-120.95430708294225
108,1000,-1.6579895444252353
109,1000,-30.42991161452111
110,103,-121.74686331675439
111,1000,-1.4201923003931418
112,1000,-25.62042544750595
113,1000,43.12314326507754
114,1000,-58.29365470583416
115,1000,-65.44050654412094
116,1000,-13.043585525874736
117,1000,-13.960955066317943
118,1000,64.06890707780309
119,1000,23.77910874119631
120,1000,30.447589711871
121,1000,18.57886177603018
122,453,10.42880191729823
123,1000,-63.59698872037998
124,980,-232.91490490787945
125,232,-16.53515606200355
126,1000,-20.231835231438875
127,1000,-13.069327234033329
128,1000,32.18863143224885
129,1000,-0.8634903502149975
130,1000,-36.1983160593033
131,1000,-5.629754910587095
132,1000,7.6213144030452025
133,1000,55.6335342934015
134,167,-380.7013470124631
135,259,-267.3892313378769
136,196,-227.00437688012545
137,162,-253.89258643836928
138,397,-223.94869167817296
139,137,-398.83478769739463
140,796,-305.1839007627873
141,304,-370.4913449005403
142,197,-66.29377303191175
143,175,-350.4716229985641
144,321,-356.28751001110265
145,163,-254.9282198270122
146,696,-172.27661070561177
147,1000,-92.4801748508012
148,1000,-145.3219123873765
149,489,-240.8929998107495
150,585,-138.8664173253055
151,1000,38.7019956739209
152,1000,-122.5017646887133
153,603,185.68757610482126
154,789,176.0526543744023
155,1000,88.45763640684092
156,1000,-1.8589078947669158
157,365,217.0367649250963
158,1000,71.5548435673726
159,592,218.23599831167053
160,993,-341.03270319928083
161,1000,-111.3089885767823
162,1000,103.34190675687674
163,1000,20.889671669642276
164,1000,55.5159675990087
165,559,187.28835723239155
166,588,188.69632741234784
167,812,146.60970768354582
168,595,161.60106080934113
169,359,196.23031119886156
170,1000,115.55405102999508
171,538,245.9395995730998
172,676,178.58339806095074
173,329,240.68541554794334
174,370,231.3583265958725
175,519,214.00034882891032
176,606,230.22264103350452
177,491,212.37507792689013
178,903,91.43857001232664
179,1000,103.79856636167632
180,517,230.35035068286567
181,1000,102.68281973840581
182,625,163.64193923188085
183,599,219.2208006141903
184,376,210.2975400289418
185,683,247.4339133048398
186,299,-5.280506391375184
187,383,272.12393577760713
188,488,200.53868249016864
189,565,217.21578676714188
190,723,177.80867550712054
191,396,200.6394660662217
192,548,242.735066006837
193,390,241.34250594642162
194,277,262.08450923954626
195,145,-5.134445426460061
196,650,201.40949929427748
197,166,5.785628953630152
198,315,230.30471785764405
199,656,123.2689016919506
200,369,260.0681463504003
201,343,235.90091702991825
202,410,240.20449803388698
203,460,203.3434659499506
204,304,236.54437058047267
205,319,264.4781651911968
206,712,220.24482804769707
207,854,-198.36662223940874
208,1000,52.559596254056636
209,533,250.07934848557568
210,380,252.12479290298455
211,376,254.91760655700088
212,481,224.13336168876546
213,755,190.01540284285443
214,93,-133.74426939135395
215,1000,-27.882286400108562
216,623,177.036913601227
217,1000,-35.404369170513625
218,418,148.43017312408205
219,262,237.3875221616732
220,611,236.56152678169337
221,391,229.81235105314735
222,357,-39.70742327537715
223,278,210.8172242243466
224,345,239.982214131327
225,275,238.50058747577546
226,1000,-9.172648088695759
227,381,256.7085029545975
228,407,242.54297380328072
229,376,232.77655712844867
230,531,196.80305963777977
231,267,250.91753412869596
232,521,230.96409971443555
233,506,233.90843286533052
234,316,263.4083141351726
235,484,-249.42053132837273
236,268,-146.07901571846136
237,683,203.27196203390838
238,847,218.12714468827846
239,499,237.40729831787309
240,403,278.5651646313098
241,265,231.97904441445837
242,297,259.0846931843887
243,246,199.04537383991453
244,538,244.35672110590212
245,284,225.42627989502398
246,606,235.6071100089906
247,356,204.27567917820718
248,464,250.9868262041925
249,530,267.2964558627359
250,675,85.20467151041973
251,338,269.190562934731
252,325,236.0651902095126
253,293,194.47747038628958
254,428,222.7077093368418
255,304,260.63600416143095
256,682,243.49225309711082
257,66,-49.15979474248658
258,349,237.7280358302361
259,340,259.2710855135218
260,488,265.26521719236626
261,223,256.2563483676461
262,276,244.2271414588818
263,328,213.12098583444828
264,618,268.4752318603957
265,336,224.78394435128467
266,291,296.45264043843844
267,278,278.0119814216515
268,415,244.15085692602975
269,325,251.18520273989424
270,220,263.8166585733816
271,380,221.9035720113908
272,285,234.29377984634382
273,318,263.913043194838
274,372,261.46008936255646
275,281,236.5457056806996
276,299,231.2172109446624
277,338,233.84721816855364
278,283,259.8185308064825
279,244,228.76463593415397
280,381,271.86984807311194
281,263,252.52736341914573
282,303,260.87840830698065
283,281,235.02544489436454
284,279,-65.60638639943258
285,351,210.4228032999959
286,259,-331.57461866792147
287,310,246.1564991622855
288,335,240.919327867345
289,348,239.26382121791818
290,366,252.3147132507186
291,377,244.7408915199468
292,481,228.38938608266463
293,300,264.6600804904655
294,232,270.81323334182065
295,312,300.90141149350814
296,288,305.2470674871286
297,246,283.5825537258165
298,141,-43.06658849320756
299,249,264.23354027256414
300,307,209.69944912152485
301,441,214.59212929386598
302,288,254.5356237142343
303,134,-32.297011453469125
304,248,283.3311609868299
305,270,269.54211389173076
306,290,292.6485048714857
307,277,254.7892506723337
308,256,253.3071496295465
309,267,251.3983634565775
