episodes,steps,rewards
0,200,-200.0
1,200,-200.0
2,200,-200.0
3,200,-200.0
4,200,-200.0
5,200,-200.0
6,200,-200.0
7,200,-200.0
8,200,-200.0
9,200,-200.0
10,200,-200.0
11,200,-200.0
12,200,-200.0
13,200,-200.0
14,200,-200.0
15,200,-200.0
16,200,-200.0
17,200,-200.0
18,200,-200.0
19,200,-200.0
20,200,-200.0
21,200,-200.0
22,200,-200.0
23,200,-200.0
24,200,-200.0
25,200,-200.0
26,200,-200.0
27,200,-200.0
28,200,-200.0
29,200,-200.0
30,200,-200.0
31,200,-200.0
32,200,-200.0
33,200,-200.0
34,200,-200.0
35,200,-200.0
36,200,-200.0
37,200,-200.0
38,200,-200.0
39,200,-200.0
40,200,-200.0
41,200,-200.0
42,200,-200.0
43,200,-200.0
44,200,-200.0
45,200,-200.0
46,200,-200.0
47,200,-200.0
48,200,-200.0
49,200,-200.0
50,200,-200.0
51,200,-200.0
52,200,-200.0
53,200,-200.0
54,200,-200.0
55,200,-200.0
56,200,-200.0
57,200,-200.0
58,200,-200.0
59,200,-200.0
60,200,-200.0
61,200,-200.0
62,200,-200.0
63,200,-200.0
64,200,-200.0
65,200,-200.0
66,200,-200.0
67,200,-200.0
68,200,-200.0
69,200,-200.0
70,200,-200.0
71,200,-200.0
72,200,-200.0
73,200,-200.0
74,200,-200.0
75,200,-200.0
76,200,-200.0
77,200,-200.0
78,200,-200.0
79,200,-200.0
80,200,-200.0
81,200,-200.0
82,200,-200.0
83,200,-200.0
84,200,-200.0
85,200,-200.0
86,200,-200.0
87,200,-200.0
88,200,-200.0
89,200,-200.0
90,200,-200.0
91,200,-200.0
92,200,-200.0
93,200,-200.0
94,200,-200.0
95,191,-191.0
96,200,-200.0
97,200,-200.0
98,200,-200.0
99,200,-200.0
100,200,-200.0
101,200,-200.0
102,200,-200.0
103,200,-200.0
104,200,-200.0
105,200,-200.0
106,200,-200.0
107,200,-200.0
108,200,-200.0
109,200,-200.0
110,200,-200.0
111,200,-200.0
112,200,-200.0
113,200,-200.0
114,200,-200.0
115,200,-200.0
116,186,-186.0
117,200,-200.0
118,200,-200.0
119,200,-200.0
120,200,-200.0
121,200,-200.0
122,133,-133.0
123,186,-186.0
124,200,-200.0
125,200,-200.0
126,200,-200.0
127,200,-200.0
128,146,-146.0
129,129,-129.0
130,200,-200.0
131,200,-200.0
132,200,-200.0
133,200,-200.0
134,200,-200.0
135,144,-144.0
136,200,-200.0
137,166,-166.0
138,200,-200.0
139,100,-100.0
140,87,-87.0
141,180,-180.0
142,180,-180.0
143,184,-184.0
144,200,-200.0
145,200,-200.0
146,155,-155.0
147,170,-170.0
148,200,-200.0
149,130,-130.0
150,175,-175.0
151,200,-200.0
152,149,-149.0
153,200,-200.0
154,172,-172.0
155,151,-151.0
156,141,-141.0
157,117,-117.0
158,143,-143.0
159,169,-169.0
160,155,-155.0
161,137,-137.0
162,200,-200.0
163,171,-171.0
164,147,-147.0
165,132,-132.0
166,147,-147.0
167,148,-148.0
168,112,-112.0
169,146,-146.0
170,148,-148.0
171,146,-146.0
172,192,-192.0
173,197,-197.0
174,135,-135.0
175,136,-136.0
176,188,-188.0
177,139,-139.0
178,150,-150.0
179,151,-151.0
180,140,-140.0
181,151,-151.0
182,138,-138.0
183,139,-139.0
184,149,-149.0
185,157,-157.0
186,142,-142.0
187,157,-157.0
188,170,-170.0
189,170,-170.0
190,200,-200.0
191,163,-163.0
192,169,-169.0
193,172,-172.0
194,163,-163.0
195,152,-152.0
196,117,-117.0
197,155,-155.0
198,110,-110.0
199,167,-167.0
200,115,-115.0
201,141,-141.0
202,154,-154.0
203,88,-88.0
204,170,-170.0
205,153,-153.0
206,173,-173.0
207,114,-114.0
208,101,-101.0
209,162,-162.0
210,133,-133.0
211,151,-151.0
212,153,-153.0
213,178,-178.0
214,167,-167.0
215,158,-158.0
216,142,-142.0
217,115,-115.0
218,87,-87.0
219,155,-155.0
220,139,-139.0
221,137,-137.0
222,178,-178.0
223,111,-111.0
224,113,-113.0
225,114,-114.0
226,147,-147.0
227,155,-155.0
228,157,-157.0
229,88,-88.0
230,118,-118.0
231,169,-169.0
232,107,-107.0
233,147,-147.0
234,106,-106.0
235,191,-191.0
236,113,-113.0
237,109,-109.0
238,100,-100.0
239,168,-168.0
240,174,-174.0
241,101,-101.0
242,135,-135.0
243,176,-176.0
244,172,-172.0
245,105,-105.0
246,111,-111.0
247,158,-158.0
248,143,-143.0
249,124,-124.0
250,108,-108.0
251,140,-140.0
252,142,-142.0
253,126,-126.0
254,151,-151.0
255,121,-121.0
256,114,-114.0
257,157,-157.0
258,120,-120.0
259,100,-100.0
260,160,-160.0
261,150,-150.0
262,117,-117.0
263,111,-111.0
264,117,-117.0
265,158,-158.0
266,152,-152.0
267,149,-149.0
268,157,-157.0
269,111,-111.0
270,175,-175.0
271,141,-141.0
272,106,-106.0
273,119,-119.0
274,143,-143.0
275,107,-107.0
276,149,-149.0
277,140,-140.0
278,108,-108.0
279,142,-142.0
280,177,-177.0
281,113,-113.0
282,176,-176.0
283,136,-136.0
284,168,-168.0
285,180,-180.0
286,191,-191.0
287,123,-123.0
288,115,-115.0
289,114,-114.0
290,200,-200.0
291,106,-106.0
292,96,-96.0
293,148,-148.0
294,177,-177.0
295,144,-144.0
296,159,-159.0
297,136,-136.0
298,164,-164.0
299,171,-171.0
300,155,-155.0
301,91,-91.0
302,108,-108.0
303,157,-157.0
304,104,-104.0
305,109,-109.0
306,125,-125.0
307,101,-101.0
308,119,-119.0
309,139,-139.0
310,126,-126.0
311,183,-183.0
312,89,-89.0
313,153,-153.0
314,156,-156.0
315,114,-114.0
316,150,-150.0
317,144,-144.0
318,151,-151.0
319,100,-100.0
320,152,-152.0
321,97,-97.0
322,146,-146.0
323,161,-161.0
324,95,-95.0
325,159,-159.0
326,153,-153.0
327,166,-166.0
328,116,-116.0
329,102,-102.0
330,101,-101.0
331,91,-91.0
332,151,-151.0
333,90,-90.0
334,116,-116.0
335,159,-159.0
336,85,-85.0
337,133,-133.0
338,166,-166.0
339,117,-117.0
340,165,-165.0
341,89,-89.0
342,139,-139.0
343,96,-96.0
344,145,-145.0
345,116,-116.0
346,139,-139.0
347,164,-164.0
348,156,-156.0
349,147,-147.0
350,84,-84.0
351,147,-147.0
352,147,-147.0
353,148,-148.0
354,151,-151.0
355,149,-149.0
356,150,-150.0
357,110,-110.0
358,84,-84.0
359,142,-142.0
360,171,-171.0
361,110,-110.0
362,116,-116.0
363,90,-90.0
364,109,-109.0
365,139,-139.0
366,114,-114.0
367,84,-84.0
368,113,-113.0
369,87,-87.0
370,155,-155.0
371,136,-136.0
372,149,-149.0
373,149,-149.0
374,145,-145.0
375,136,-136.0
376,118,-118.0
377,166,-166.0
378,166,-166.0
379,146,-146.0
380,152,-152.0
381,106,-106.0
382,150,-150.0
383,200,-200.0
384,147,-147.0
385,122,-122.0
386,118,-118.0
387,154,-154.0
388,180,-180.0
389,135,-135.0
390,183,-183.0
391,152,-152.0
392,101,-101.0
393,137,-137.0
394,117,-117.0
395,149,-149.0
396,152,-152.0
397,155,-155.0
398,141,-141.0
399,138,-138.0
400,141,-141.0
401,182,-182.0
402,140,-140.0
403,123,-123.0
404,188,-188.0
405,142,-142.0
406,94,-94.0
407,111,-111.0
408,131,-131.0
409,168,-168.0
410,160,-160.0
411,108,-108.0
412,179,-179.0
413,158,-158.0
414,142,-142.0
415,115,-115.0
416,138,-138.0
417,92,-92.0
418,130,-130.0
419,147,-147.0
420,144,-144.0
421,124,-124.0
422,125,-125.0
423,85,-85.0
424,132,-132.0
425,192,-192.0
426,154,-154.0
427,162,-162.0
428,144,-144.0
429,155,-155.0
430,120,-120.0
431,151,-151.0
432,191,-191.0
433,149,-149.0
434,144,-144.0
435,139,-139.0
436,182,-182.0
437,149,-149.0
438,137,-137.0
439,164,-164.0
440,174,-174.0
441,153,-153.0
442,158,-158.0
443,192,-192.0
444,145,-145.0
445,157,-157.0
446,155,-155.0
447,158,-158.0
448,111,-111.0
449,142,-142.0
450,116,-116.0
451,192,-192.0
452,142,-142.0
453,188,-188.0
454,195,-195.0
455,109,-109.0
456,135,-135.0
457,115,-115.0
458,151,-151.0
459,151,-151.0
460,119,-119.0
461,142,-142.0
462,83,-83.0
463,144,-144.0
464,139,-139.0
465,126,-126.0
466,160,-160.0
467,152,-152.0
468,175,-175.0
469,148,-148.0
470,151,-151.0
471,147,-147.0
472,110,-110.0
473,150,-150.0
474,150,-150.0
475,149,-149.0
476,152,-152.0
477,165,-165.0
478,166,-166.0
479,148,-148.0
480,151,-151.0
481,134,-134.0
482,153,-153.0
483,88,-88.0
484,139,-139.0
485,152,-152.0
486,157,-157.0
487,84,-84.0
488,142,-142.0
489,164,-164.0
490,151,-151.0
491,109,-109.0
492,155,-155.0
493,143,-143.0
494,94,-94.0
495,141,-141.0
496,179,-179.0
497,134,-134.0
498,140,-140.0
499,134,-134.0
500,145,-145.0
501,118,-118.0
502,146,-146.0
503,111,-111.0
504,112,-112.0
505,157,-157.0
506,132,-132.0
507,148,-148.0
508,143,-143.0
509,144,-144.0
510,124,-124.0
511,125,-125.0
512,162,-162.0
513,145,-145.0
514,151,-151.0
515,117,-117.0
516,90,-90.0
517,110,-110.0
518,114,-114.0
519,130,-130.0
520,125,-125.0
521,155,-155.0
522,142,-142.0
523,101,-101.0
524,90,-90.0
525,122,-122.0
526,122,-122.0
527,99,-99.0
528,105,-105.0
529,143,-143.0
530,109,-109.0
531,102,-102.0
532,122,-122.0
533,120,-120.0
534,110,-110.0
535,173,-173.0
536,167,-167.0
537,106,-106.0
538,122,-122.0
539,140,-140.0
540,142,-142.0
541,160,-160.0
542,160,-160.0
543,154,-154.0
544,147,-147.0
545,140,-140.0
546,168,-168.0
547,89,-89.0
548,109,-109.0
549,156,-156.0
550,152,-152.0
551,113,-113.0
552,113,-113.0
553,167,-167.0
554,200,-200.0
555,107,-107.0
556,139,-139.0
557,113,-113.0
558,109,-109.0
559,109,-109.0
560,190,-190.0
561,110,-110.0
562,132,-132.0
563,153,-153.0
564,147,-147.0
565,109,-109.0
566,147,-147.0
567,162,-162.0
568,148,-148.0
569,114,-114.0
570,130,-130.0
571,160,-160.0
572,158,-158.0
573,132,-132.0
574,138,-138.0
575,90,-90.0
576,116,-116.0
577,141,-141.0
578,140,-140.0
579,138,-138.0
580,91,-91.0
581,132,-132.0
582,166,-166.0
583,126,-126.0
584,163,-163.0
585,150,-150.0
586,127,-127.0
587,185,-185.0
588,113,-113.0
589,136,-136.0
590,142,-142.0
591,148,-148.0
592,149,-149.0
593,148,-148.0
594,149,-149.0
595,144,-144.0
596,200,-200.0
597,92,-92.0
598,144,-144.0
599,150,-150.0
600,147,-147.0
601,143,-143.0
602,137,-137.0
603,152,-152.0
604,157,-157.0
605,156,-156.0
606,153,-153.0
607,147,-147.0
608,144,-144.0
609,162,-162.0
610,149,-149.0
611,141,-141.0
612,173,-173.0
613,193,-193.0
614,165,-165.0
615,178,-178.0
616,157,-157.0
617,164,-164.0
618,184,-184.0
619,200,-200.0
620,182,-182.0
621,90,-90.0
622,178,-178.0
623,160,-160.0
624,165,-165.0
625,158,-158.0
626,151,-151.0
627,162,-162.0
628,141,-141.0
629,147,-147.0
630,162,-162.0
631,155,-155.0
632,158,-158.0
633,87,-87.0
634,95,-95.0
635,157,-157.0
636,161,-161.0
637,151,-151.0
638,155,-155.0
639,148,-148.0
640,148,-148.0
641,149,-149.0
642,166,-166.0
643,168,-168.0
644,164,-164.0
645,166,-166.0
646,104,-104.0
647,151,-151.0
648,161,-161.0
649,106,-106.0
650,154,-154.0
651,99,-99.0
652,107,-107.0
653,159,-159.0
654,85,-85.0
655,161,-161.0
656,159,-159.0
657,148,-148.0
658,151,-151.0
659,87,-87.0
660,200,-200.0
661,157,-157.0
662,156,-156.0
663,195,-195.0
664,200,-200.0
665,172,-172.0
666,107,-107.0
667,182,-182.0
668,200,-200.0
669,171,-171.0
670,94,-94.0
671,105,-105.0
672,111,-111.0
673,200,-200.0
674,152,-152.0
675,170,-170.0
676,172,-172.0
677,171,-171.0
678,106,-106.0
679,159,-159.0
680,139,-139.0
681,158,-158.0
682,112,-112.0
683,154,-154.0
684,154,-154.0
685,153,-153.0
686,147,-147.0
687,155,-155.0
688,176,-176.0
689,84,-84.0
690,173,-173.0
691,158,-158.0
692,156,-156.0
693,155,-155.0
694,161,-161.0
695,150,-150.0
696,156,-156.0
697,176,-176.0
698,94,-94.0
699,160,-160.0
700,180,-180.0
701,151,-151.0
702,174,-174.0
703,169,-169.0
704,163,-163.0
705,166,-166.0
706,121,-121.0
707,162,-162.0
708,86,-86.0
709,155,-155.0
710,166,-166.0
711,177,-177.0
712,160,-160.0
713,151,-151.0
714,163,-163.0
715,171,-171.0
716,140,-140.0
717,136,-136.0
718,155,-155.0
719,160,-160.0
720,200,-200.0
721,152,-152.0
722,158,-158.0
723,144,-144.0
724,167,-167.0
725,140,-140.0
726,140,-140.0
727,200,-200.0
728,146,-146.0
729,121,-121.0
730,88,-88.0
731,157,-157.0
732,138,-138.0
733,126,-126.0
734,156,-156.0
735,169,-169.0
736,147,-147.0
737,157,-157.0
738,161,-161.0
739,104,-104.0
740,99,-99.0
741,161,-161.0
742,200,-200.0
743,159,-159.0
744,172,-172.0
745,166,-166.0
746,163,-163.0
747,103,-103.0
748,200,-200.0
749,153,-153.0
750,155,-155.0
751,200,-200.0
752,158,-158.0
753,156,-156.0
754,200,-200.0
755,155,-155.0
756,200,-200.0
757,200,-200.0
758,200,-200.0
759,200,-200.0
760,200,-200.0
761,200,-200.0
762,200,-200.0
763,170,-170.0
764,200,-200.0
765,200,-200.0
766,200,-200.0
767,168,-168.0
768,200,-200.0
769,109,-109.0
770,200,-200.0
771,200,-200.0
772,161,-161.0
773,166,-166.0
774,200,-200.0
775,180,-180.0
776,200,-200.0
777,167,-167.0
778,200,-200.0
779,176,-176.0
780,162,-162.0
781,192,-192.0
782,172,-172.0
783,114,-114.0
784,200,-200.0
785,166,-166.0
786,200,-200.0
787,200,-200.0
788,125,-125.0
789,118,-118.0
790,200,-200.0
791,103,-103.0
792,151,-151.0
793,184,-184.0
794,200,-200.0
795,92,-92.0
796,155,-155.0
797,170,-170.0
798,153,-153.0
799,157,-157.0
800,157,-157.0
801,154,-154.0
802,157,-157.0
803,161,-161.0
804,159,-159.0
805,146,-146.0
806,147,-147.0
807,157,-157.0
808,107,-107.0
809,162,-162.0
810,155,-155.0
811,163,-163.0
812,167,-167.0
813,85,-85.0
814,166,-166.0
815,160,-160.0
816,151,-151.0
817,164,-164.0
818,89,-89.0
819,161,-161.0
820,84,-84.0
821,173,-173.0
822,152,-152.0
823,89,-89.0
824,89,-89.0
825,144,-144.0
826,157,-157.0
827,97,-97.0
828,151,-151.0
829,150,-150.0
830,85,-85.0
831,94,-94.0
832,103,-103.0
833,172,-172.0
834,146,-146.0
835,162,-162.0
836,158,-158.0
837,171,-171.0
838,87,-87.0
839,164,-164.0
840,174,-174.0
841,153,-153.0
842,146,-146.0
843,147,-147.0
844,157,-157.0
845,130,-130.0
846,128,-128.0
847,149,-149.0
848,145,-145.0
849,111,-111.0
850,161,-161.0
851,159,-159.0
852,174,-174.0
853,153,-153.0
854,155,-155.0
855,155,-155.0
856,153,-153.0
857,150,-150.0
858,155,-155.0
859,156,-156.0
860,160,-160.0
861,159,-159.0
862,183,-183.0
863,153,-153.0
864,200,-200.0
865,200,-200.0
866,182,-182.0
867,200,-200.0
868,200,-200.0
869,189,-189.0
870,200,-200.0
871,200,-200.0
872,200,-200.0
873,163,-163.0
874,144,-144.0
875,165,-165.0
876,162,-162.0
877,200,-200.0
878,200,-200.0
879,162,-162.0
880,85,-85.0
881,86,-86.0
882,183,-183.0
883,159,-159.0
884,105,-105.0
885,171,-171.0
886,200,-200.0
887,88,-88.0
888,85,-85.0
889,200,-200.0
890,164,-164.0
891,152,-152.0
892,154,-154.0
893,101,-101.0
894,158,-158.0
895,181,-181.0
896,163,-163.0
897,151,-151.0
898,171,-171.0
899,155,-155.0
900,177,-177.0
901,187,-187.0
902,186,-186.0
903,198,-198.0
904,181,-181.0
905,161,-161.0
906,176,-176.0
907,174,-174.0
908,161,-161.0
909,163,-163.0
910,174,-174.0
911,171,-171.0
912,156,-156.0
913,153,-153.0
914,151,-151.0
915,164,-164.0
916,160,-160.0
917,146,-146.0
918,150,-150.0
919,153,-153.0
920,86,-86.0
921,153,-153.0
922,172,-172.0
923,156,-156.0
924,154,-154.0
925,156,-156.0
926,96,-96.0
927,151,-151.0
928,147,-147.0
929,150,-150.0
930,162,-162.0
931,156,-156.0
932,146,-146.0
933,151,-151.0
934,146,-146.0
935,148,-148.0
936,149,-149.0
937,153,-153.0
938,149,-149.0
939,106,-106.0
940,147,-147.0
941,89,-89.0
942,154,-154.0
943,88,-88.0
944,148,-148.0
945,128,-128.0
946,153,-153.0
947,104,-104.0
948,152,-152.0
949,152,-152.0
950,152,-152.0
951,154,-154.0
952,154,-154.0
953,152,-152.0
954,160,-160.0
955,150,-150.0
956,163,-163.0
957,150,-150.0
958,200,-200.0
959,153,-153.0
960,200,-200.0
961,152,-152.0
962,182,-182.0
963,200,-200.0
964,200,-200.0
965,152,-152.0
966,200,-200.0
967,154,-154.0
968,200,-200.0
969,159,-159.0
970,152,-152.0
971,168,-168.0
972,149,-149.0
973,158,-158.0
974,93,-93.0
975,148,-148.0
976,160,-160.0
977,150,-150.0
978,148,-148.0
979,158,-158.0
980,165,-165.0
981,167,-167.0
982,149,-149.0
983,154,-154.0
984,86,-86.0
985,150,-150.0
986,89,-89.0
987,153,-153.0
988,189,-189.0
989,135,-135.0
990,186,-186.0
991,167,-167.0
992,151,-151.0
993,154,-154.0
994,93,-93.0
995,184,-184.0
996,180,-180.0
997,156,-156.0
998,94,-94.0
999,165,-165.0
1000,196,-196.0
1001,160,-160.0
1002,151,-151.0
1003,96,-96.0
1004,200,-200.0
1005,177,-177.0
1006,89,-89.0
1007,192,-192.0
1008,177,-177.0
1009,99,-99.0
1010,150,-150.0
1011,103,-103.0
1012,200,-200.0
1013,118,-118.0
1014,87,-87.0
1015,154,-154.0
1016,173,-173.0
1017,96,-96.0
1018,180,-180.0
1019,98,-98.0
1020,200,-200.0
1021,148,-148.0
1022,121,-121.0
1023,163,-163.0
1024,159,-159.0
1025,181,-181.0
1026,166,-166.0
1027,101,-101.0
1028,146,-146.0
1029,164,-164.0
1030,150,-150.0
1031,169,-169.0
1032,98,-98.0
1033,169,-169.0
1034,160,-160.0
1035,200,-200.0
1036,154,-154.0
1037,143,-143.0
1038,148,-148.0
1039,171,-171.0
1040,143,-143.0
1041,149,-149.0
1042,98,-98.0
1043,184,-184.0
1044,156,-156.0
1045,177,-177.0
1046,154,-154.0
1047,106,-106.0
1048,133,-133.0
1049,150,-150.0
1050,172,-172.0
1051,141,-141.0
1052,134,-134.0
1053,189,-189.0
1054,147,-147.0
1055,111,-111.0
1056,150,-150.0
1057,163,-163.0
1058,164,-164.0
1059,103,-103.0
1060,151,-151.0
1061,178,-178.0
1062,158,-158.0
1063,160,-160.0
1064,149,-149.0
1065,147,-147.0
1066,159,-159.0
1067,155,-155.0
1068,118,-118.0
1069,100,-100.0
1070,96,-96.0
1071,99,-99.0
1072,96,-96.0
1073,148,-148.0
1074,166,-166.0
1075,165,-165.0
1076,148,-148.0
1077,147,-147.0
1078,151,-151.0
1079,154,-154.0
1080,95,-95.0
1081,164,-164.0
1082,91,-91.0
1083,96,-96.0
1084,128,-128.0
1085,145,-145.0
1086,150,-150.0
1087,108,-108.0
1088,151,-151.0
1089,151,-151.0
1090,148,-148.0
1091,144,-144.0
1092,140,-140.0
1093,149,-149.0
1094,148,-148.0
1095,149,-149.0
1096,96,-96.0
1097,154,-154.0
1098,102,-102.0
1099,119,-119.0
1100,179,-179.0
1101,150,-150.0
1102,169,-169.0
1103,152,-152.0
1104,88,-88.0
1105,146,-146.0
1106,87,-87.0
1107,144,-144.0
1108,96,-96.0
1109,89,-89.0
1110,175,-175.0
1111,140,-140.0
1112,168,-168.0
1113,181,-181.0
1114,96,-96.0
1115,152,-152.0
1116,154,-154.0
1117,159,-159.0
1118,144,-144.0
1119,162,-162.0
1120,128,-128.0
1121,171,-171.0
1122,100,-100.0
1123,156,-156.0
1124,152,-152.0
1125,149,-149.0
1126,158,-158.0
1127,151,-151.0
1128,154,-154.0
1129,154,-154.0
1130,142,-142.0
1131,178,-178.0
1132,89,-89.0
1133,160,-160.0
1134,179,-179.0
1135,153,-153.0
1136,200,-200.0
1137,150,-150.0
1138,151,-151.0
1139,142,-142.0
1140,181,-181.0
1141,182,-182.0
1142,183,-183.0
1143,179,-179.0
1144,200,-200.0
1145,199,-199.0
1146,200,-200.0
1147,156,-156.0
1148,144,-144.0
1149,146,-146.0
1150,148,-148.0
