{
    "model_info": "common32x32",
    "episodes": [
        36,
        16,
        16,
        9,
        11,
        10,
        9,
        10,
        12,
        10,
        12,
        12,
        14,
        11,
        16,
        13,
        12,
        10,
        16,
        9,
        9,
        9,
        12,
        11,
        14,
        11,
        10,
        9,
        10,
        9,
        10,
        9,
        8,
        10,
        9,
        10,
        10,
        9,
        8,
        10,
        10,
        10,
        8,
        10,
        8,
        9,
        8,
        10,
        9,
        10,
        9,
        10,
        11,
        10,
        10,
        9,
        9,
        8,
        9,
        10,
        9,
        8,
        11,
        11,
        11,
        9,
        10,
        10,
        10,
        8,
        10,
        8,
        9,
        9,
        10,
        10,
        9,
        9,
        9,
        9,
        8,
        10,
        10,
        11,
        9,
        12,
        10,
        10,
        11,
        9,
        9,
        9,
        11,
        9,
        11,
        8,
        9,
        10,
        9,
        10,
        11,
        10,
        13,
        11,
        11,
        10,
        11,
        9,
        9,
        10,
        10,
        10,
        9,
        8,
        10,
        11,
        11,
        9,
        12,
        9,
        10,
        12,
        10,
        13,
        16,
        17,
        11,
        13,
        15,
        9,
        9,
        10,
        14,
        11,
        14,
        19,
        13,
        28,
        29,
        33,
        13,
        17,
        11,
        16,
        15,
        11,
        10,
        10,
        14,
        10,
        11,
        10,
        45,
        16,
        20,
        27,
        49,
        68,
        60,
        42,
        28,
        21,
        9,
        10,
        10,
        8,
        20,
        10,
        17,
        11,
        14,
        10,
        11,
        15,
        12,
        12,
        15,
        9,
        16,
        12,
        12,
        21,
        46,
        9,
        42,
        18,
        18,
        10,
        12,
        31,
        36,
        26,
        21,
        16,
        16,
        8,
        74,
        72,
        34,
        11,
        9,
        10,
        34,
        24,
        11,
        43,
        37,
        22,
        18,
        25,
        26,
        54,
        45,
        67,
        72,
        95,
        42,
        32,
        61,
        55,
        67,
        65,
        54,
        52,
        70,
        64,
        48,
        26,
        42,
        45,
        42,
        67,
        44,
        42,
        32,
        42,
        52,
        64,
        66,
        59,
        79,
        73,
        20,
        83,
        14,
        19,
        16,
        16,
        89,
        74,
        67,
        89,
        77,
        66,
        33,
        49,
        64,
        42,
        23,
        42,
        51,
        49,
        239,
        50,
        150,
        81,
        137,
        122,
        114,
        14,
        95,
        71,
        19,
        75,
        103,
        79,
        54,
        40,
        168,
        18,
        111,
        20,
        45,
        16,
        80,
        13,
        61,
        24,
        39,
        27,
        59,
        52,
        9,
        27,
        105,
        106,
        132,
        67,
        74,
        10,
        26,
        101,
        26,
        46,
        37,
        95,
        93,
        102,
        96,
        30,
        121,
        151,
        109,
        105,
        79,
        107,
        91,
        44,
        75,
        66,
        128,
        100,
        107,
        103,
        104,
        115,
        106,
        19,
        43,
        48,
        36,
        102,
        62,
        43,
        23,
        110,
        23,
        83,
        110,
        23,
        63,
        122,
        133,
        82,
        126,
        120,
        131,
        124,
        166,
        132,
        215,
        128,
        230,
        128,
        82,
        180,
        54,
        164,
        106,
        213,
        184,
        168,
        142,
        125,
        135,
        133,
        116,
        131,
        128,
        124,
        159,
        120,
        132,
        130,
        131,
        134,
        121,
        116,
        127,
        131,
        110,
        125,
        111,
        127,
        120,
        131,
        116,
        118,
        135,
        112,
        122,
        118,
        121,
        121,
        123,
        134,
        125,
        157,
        137,
        116,
        119,
        120,
        130,
        108,
        121,
        118,
        108,
        124,
        120,
        118,
        131,
        110,
        121,
        116,
        120,
        131,
        126,
        134,
        119,
        132,
        127,
        127,
        129,
        135,
        121,
        116,
        128,
        132,
        118,
        123,
        125,
        129,
        124,
        113,
        127,
        129,
        127,
        121,
        133,
        85,
        137,
        137,
        130,
        59,
        133,
        136,
        82,
        151,
        141,
        157,
        67,
        193,
        174,
        159,
        186,
        168,
        168,
        163,
        134,
        143,
        131,
        155,
        139,
        131,
        129,
        119,
        124,
        117,
        126,
        111,
        111,
        120,
        119,
        115,
        110,
        122,
        111,
        107,
        101,
        102,
        32,
        27,
        114,
        25,
        108,
        109,
        120,
        114,
        34,
        119,
        126,
        121,
        134,
        130,
        130,
        125,
        128,
        141,
        122,
        125,
        157,
        128,
        125,
        138,
        134,
        149,
        156,
        167,
        45,
        155,
        150,
        136,
        147,
        136,
        146,
        135,
        135,
        135,
        144,
        134,
        138,
        133,
        133,
        130,
        149,
        130,
        154,
        133,
        139,
        130,
        131,
        140,
        134,
        129,
        148,
        130,
        143,
        125,
        125,
        120,
        127,
        109,
        141,
        122,
        150,
        128,
        128,
        133,
        128,
        128,
        126,
        130,
        127,
        131,
        141,
        141,
        125,
        135,
        136,
        131,
        136,
        147,
        131,
        134,
        137,
        140,
        136,
        142,
        148,
        144,
        164,
        151,
        156,
        147,
        147,
        149,
        180,
        147,
        180,
        162,
        156,
        143,
        146,
        156,
        160,
        169,
        69,
        173,
        173,
        181,
        182,
        196,
        187,
        196,
        186,
        195,
        200,
        192,
        197,
        209,
        192,
        202,
        193,
        203,
        203,
        79,
        209,
        223,
        211,
        220,
        223,
        222,
        212,
        193,
        186,
        179,
        186,
        171,
        166,
        173,
        162,
        161,
        151,
        146,
        171,
        148,
        178,
        160,
        159,
        163,
        166,
        164,
        166,
        168,
        176,
        170,
        169,
        57,
        164,
        159,
        172,
        159,
        170,
        195,
        202,
        174,
        195,
        171,
        178,
        197,
        195,
        194,
        194,
        191,
        207,
        181,
        183,
        183,
        183,
        189,
        195,
        172,
        190,
        199,
        181,
        189,
        187,
        192,
        192,
        174,
        170,
        167,
        163,
        168,
        155,
        174,
        159,
        160,
        158,
        158,
        153,
        158,
        151,
        148,
        147,
        167,
        154,
        163,
        140,
        155,
        149,
        165,
        151,
        151,
        157,
        146,
        166,
        166,
        163,
        170,
        173,
        182,
        184,
        181,
        211,
        213,
        208,
        224,
        241,
        241,
        216,
        262,
        253,
        238,
        253,
        257,
        255,
        250,
        270,
        256,
        276,
        284,
        286,
        320,
        375,
        361,
        393,
        394,
        349,
        365,
        368,
        355,
        427,
        472,
        500,
        73,
        500,
        500,
        500,
        150,
        350,
        500,
        500,
        500,
        166,
        42,
        500,
        500,
        330,
        393,
        379,
        500,
        205,
        500,
        500,
        500,
        500,
        500,
        370,
        500,
        500,
        500,
        500,
        500,
        500,
        500,
        165,
        500,
        500,
        500,
        500,
        500,
        500,
        500,
        500,
        500,
        500,
        500,
        500,
        500,
        500,
        500,
        500,
        500,
        500,
        500,
        500,
        500,
        69,
        500,
        500,
        500,
        500,
        73,
        500,
        500,
        500,
        500,
        500,
        500,
        500,
        500,
        500,
        500,
        500,
        500,
        500,
        500,
        500,
        500,
        500,
        254,
        500,
        500,
        500,
        500,
        500,
        500,
        500,
        500,
        500,
        500,
        500,
        500,
        500,
        500,
        500,
        500,
        328,
        500,
        500,
        500,
        500,
        500,
        500,
        500,
        368,
        500,
        164,
        169,
        346,
        500,
        203,
        500,
        500,
        500,
        500,
        500,
        500,
        500,
        500,
        500,
        500,
        500,
        500,
        500,
        500,
        500,
        500,
        500,
        500,
        500,
        500,
        500,
        500,
        500,
        500,
        500,
        500,
        500,
        500,
        500,
        500,
        500,
        500,
        500,
        500,
        79,
        78,
        500,
        500,
        500,
        500,
        500,
        169,
        500,
        500,
        500,
        500,
        500,
        500,
        500,
        500,
        500,
        500,
        500,
        500,
        500,
        500,
        500,
        500,
        500,
        500,
        500,
        500,
        500,
        500,
        500,
        500,
        500,
        500,
        500,
        500,
        500,
        500,
        500,
        500,
        500,
        500,
        500,
        500,
        500,
        500,
        500,
        500,
        500,
        500,
        500,
        500
    ],
    "durations": [
        1.461984,
        0.006,
        0.005001,
        0.002999,
        0.004,
        0.003,
        0.003,
        0.002999,
        0.004,
        0.003003,
        0.003003,
        0.003,
        0.004,
        0.002999,
        0.005,
        0.004,
        0.004002,
        0.003,
        0.003998,
        0.001999,
        0.002001,
        0.002999,
        0.003,
        0.003002,
        0.003999,
        0.003999,
        0.003,
        0.003,
        0.002999,
        0.003002,
        0.003,
        0.002002,
        0.002999,
        0.002999,
        0.002999,
        0.003,
        0.003002,
        0.002998,
        0.003,
        0.003002,
        0.002999,
        0.002998,
        0.002001,
        0.002997,
        0.003001,
        0.003003,
        0.002998,
        0.003001,
        0.003,
        0.002999,
        0.003,
        0.003002,
        0.003997,
        0.003,
        0.003,
        0.003,
        0.002002,
        0.002,
        0.002999,
        0.002999,
        0.002001,
        0.003001,
        0.004,
        0.002998,
        0.003001,
        0.001998,
        0.001996,
        0.003002,
        0.002998,
        0.001998,
        0.003001,
        0.001999,
        0.003,
        0.003001,
        0.002998,
        0.003001,
        0.002999,
        0.003,
        0.002002,
        0.001998,
        0.002001,
        0.003,
        0.002997,
        0.003,
        0.002999,
        0.003001,
        0.002999,
        0.003,
        0.003003,
        0.001999,
        0.002001,
        0.001998,
        0.004002,
        0.002999,
        0.003003,
        0.001999,
        0.003,
        0.003002,
        0.002997,
        0.003001,
        0.002999,
        0.003,
        0.004,
        0.004,
        0.003,
        0.003,
        0.003001,
        0.001999,
        0.002002,
        0.002001,
        0.003002,
        0.002998,
        0.003004,
        0.001999,
        0.002001,
        0.003002,
        0.003,
        0.002998,
        0.003999,
        0.003004,
        0.002999,
        0.003006,
        0.002999,
        0.004001,
        0.004,
        0.003999,
        0.002999,
        0.004002,
        0.004001,
        0.003001,
        0.002995,
        0.003,
        0.003999,
        0.003001,
        0.005001,
        0.004998,
        0.002999,
        0.008002,
        0.008,
        0.009,
        0.004,
        0.003999,
        0.003001,
        0.005002,
        0.003999,
        0.003999,
        0.002999,
        0.003002,
        0.003,
        0.002999,
        0.003,
        0.002999,
        0.011997,
        0.005002,
        0.005997,
        0.008001,
        0.013002,
        0.017999,
        0.016002,
        0.011002,
        0.007999,
        0.006001,
        0.002999,
        0.003001,
        0.002999,
        0.003002,
        0.005997,
        0.003001,
        0.004999,
        0.003003,
        0.005,
        0.002997,
        0.003013,
        0.00399,
        0.003998,
        0.003003,
        0.003999,
        0.003,
        0.005,
        0.004004,
        0.003996,
        0.006,
        0.012004,
        0.003,
        0.011,
        0.006001,
        0.004999,
        0.003002,
        0.003998,
        0.009001,
        0.010001,
        0.006999,
        0.006,
        0.004999,
        0.004004,
        0.001998,
        0.020002,
        0.02,
        0.009002,
        0.003997,
        0.003,
        0.003986,
        0.01,
        0.007,
        0.004001,
        0.011999,
        0.009998,
        0.006002,
        0.004999,
        0.006,
        0.007001,
        0.014999,
        0.012998,
        0.018,
        0.02,
        0.027,
        0.012001,
        0.008999,
        0.016002,
        0.015,
        0.019003,
        0.018996,
        0.015997,
        0.015003,
        0.019001,
        0.016999,
        0.012998,
        0.007005,
        0.011994,
        0.013,
        0.011004,
        0.017999,
        0.012,
        0.011999,
        0.009005,
        0.011996,
        0.014999,
        0.018004,
        0.018,
        0.016003,
        0.021998,
        0.019999,
        0.006002,
        0.022998,
        0.005,
        0.005,
        0.005001,
        0.004999,
        0.024,
        0.02,
        0.019001,
        0.024999,
        0.022004,
        0.018999,
        0.009998,
        0.013761,
        0.017,
        0.010984,
        0.005999,
        0.011003,
        0.013986,
        0.013999,
        0.066,
        0.015003,
        0.040999,
        0.021984,
        0.036999,
        0.033,
        0.030998,
        0.004,
        0.026002,
        0.018998,
        0.005998,
        0.020001,
        0.03,
        0.022997,
        0.015,
        0.012001,
        0.045002,
        0.004988,
        0.03,
        0.005997,
        0.012002,
        0.005997,
        0.022,
        0.003998,
        0.017001,
        0.007,
        0.010996,
        0.008002,
        0.015997,
        0.01602,
        0.002982,
        0.008002,
        0.028998,
        0.028999,
        0.036002,
        0.017998,
        0.020997,
        0.003999,
        0.008001,
        0.027,
        0.007998,
        0.011999,
        0.011003,
        0.025996,
        0.025001,
        0.027002,
        0.025999,
        0.009002,
        0.032999,
        0.041999,
        0.029999,
        0.027987,
        0.021998,
        0.029998,
        0.025003,
        0.013,
        0.019999,
        0.018999,
        0.035001,
        0.026999,
        0.029,
        0.028001,
        0.028999,
        0.030999,
        0.028996,
        0.006001,
        0.013,
        0.013,
        0.010001,
        0.026999,
        0.018003,
        0.010998,
        0.006002,
        0.029999,
        0.007002,
        0.023013,
        0.029986,
        0.006999,
        0.017,
        0.033987,
        0.036999,
        0.021999,
        0.033998,
        0.033005,
        0.035999,
        0.032987,
        0.045998,
        0.035996,
        0.059003,
        0.033987,
        0.061998,
        0.036001,
        0.023003,
        0.049003,
        0.015996,
        0.045002,
        0.029001,
        0.060997,
        0.051,
        0.046,
        0.039005,
        0.033997,
        0.036997,
        0.038002,
        0.032003,
        0.035002,
        0.035999,
        0.034002,
        0.044002,
        0.032999,
        0.036998,
        0.034999,
        0.036004,
        0.036997,
        0.033001,
        0.031002,
        0.033998,
        0.035998,
        0.030003,
        0.033996,
        0.031,
        0.034003,
        0.031999,
        0.036002,
        0.033,
        0.032999,
        0.036999,
        0.031004,
        0.032999,
        0.031999,
        0.033003,
        0.034003,
        0.033998,
        0.036999,
        0.034998,
        0.043002,
        0.038,
        0.032,
        0.032997,
        0.037001,
        0.035998,
        0.03,
        0.033001,
        0.031999,
        0.03,
        0.034001,
        0.032999,
        0.033,
        0.036002,
        0.030998,
        0.033002,
        0.032,
        0.033001,
        0.037001,
        0.034998,
        0.036002,
        0.032001,
        0.035999,
        0.035,
        0.035,
        0.037002,
        0.037,
        0.033,
        0.032,
        0.036002,
        0.035998,
        0.035001,
        0.033999,
        0.034003,
        0.034997,
        0.034,
        0.031,
        0.035002,
        0.038,
        0.034999,
        0.033,
        0.037001,
        0.023998,
        0.038,
        0.039,
        0.036,
        0.016,
        0.037,
        0.037001,
        0.023001,
        0.041998,
        0.039001,
        0.043,
        0.019,
        0.053,
        0.048001,
        0.042999,
        0.051,
        0.045999,
        0.046,
        0.045,
        0.037001,
        0.039001,
        0.035999,
        0.043,
        0.040001,
        0.036,
        0.034998,
        0.032,
        0.035001,
        0.032999,
        0.035001,
        0.029999,
        0.030001,
        0.032999,
        0.033,
        0.033002,
        0.029999,
        0.033001,
        0.030001,
        0.029001,
        0.027,
        0.028,
        0.009001,
        0.007,
        0.031,
        0.007001,
        0.028998,
        0.03,
        0.032,
        0.031001,
        0.010998,
        0.033001,
        0.034,
        0.035001,
        0.037002,
        0.035997,
        0.035002,
        0.034999,
        0.035,
        0.038998,
        0.033998,
        0.035001,
        0.043001,
        0.036001,
        0.034002,
        0.038996,
        0.037,
        0.041,
        0.043,
        0.045999,
        0.012984,
        0.043,
        0.040999,
        0.037002,
        0.039998,
        0.038,
        0.040052,
        0.037998,
        0.038,
        0.037001,
        0.039,
        0.036998,
        0.038001,
        0.037002,
        0.036999,
        0.036002,
        0.040999,
        0.035002,
        0.041999,
        0.037001,
        0.039003,
        0.035997,
        0.036001,
        0.037998,
        0.037985,
        0.035999,
        0.042003,
        0.035996,
        0.039004,
        0.034001,
        0.033999,
        0.032997,
        0.034,
        0.031001,
        0.039001,
        0.034998,
        0.039999,
        0.036002,
        0.036001,
        0.035997,
        0.034003,
        0.034984,
        0.034,
        0.034999,
        0.034985,
        0.035999,
        0.037986,
        0.038002,
        0.034,
        0.037,
        0.036999,
        0.035999,
        0.038,
        0.04,
        0.036002,
        0.037,
        0.038003,
        0.038997,
        0.036,
        0.039002,
        0.04,
        0.04,
        0.052,
        0.045,
        0.043,
        0.043001,
        0.04,
        0.042,
        0.049998,
        0.041014,
        0.047987,
        0.043999,
        0.044,
        0.038003,
        0.041001,
        0.043002,
        0.043997,
        0.048003,
        0.02,
        0.046999,
        0.046998,
        0.054005,
        0.048999,
        0.054001,
        0.054001,
        0.054999,
        0.050999,
        0.054001,
        0.056999,
        0.053,
        0.055,
        0.058001,
        0.052,
        0.056984,
        0.053,
        0.054808,
        0.058001,
        0.022003,
        0.057997,
        0.060999,
        0.058,
        0.061003,
        0.062013,
        0.060988,
        0.058012,
        0.051984,
        0.049999,
        0.048986,
        0.05,
        0.045999,
        0.044001,
        0.046998,
        0.043984,
        0.044986,
        0.040998,
        0.04,
        0.048001,
        0.041,
        0.047999,
        0.043985,
        0.044002,
        0.044997,
        0.046,
        0.045003,
        0.044997,
        0.046,
        0.048003,
        0.046,
        0.046003,
        0.016999,
        0.050001,
        0.042999,
        0.048003,
        0.043997,
        0.047001,
        0.053003,
        0.055997,
        0.047999,
        0.055983,
        0.047057,
        0.048025,
        0.051984,
        0.053001,
        0.051,
        0.053001,
        0.051001,
        0.054998,
        0.048999,
        0.049,
        0.047999,
        0.049003,
        0.049999,
        0.052999,
        0.046,
        0.049999,
        0.053004,
        0.048997,
        0.050999,
        0.049998,
        0.051003,
        0.049999,
        0.046999,
        0.046001,
        0.045998,
        0.043003,
        0.044999,
        0.040999,
        0.046532,
        0.042999,
        0.042004,
        0.041003,
        0.042003,
        0.039983,
        0.044,
        0.041001,
        0.038999,
        0.04,
        0.044001,
        0.044999,
        0.043,
        0.037999,
        0.045,
        0.040002,
        0.043998,
        0.041003,
        0.039999,
        0.044,
        0.040001,
        0.044002,
        0.043998,
        0.044141,
        0.045,
        0.046999,
        0.049,
        0.049,
        0.048,
        0.057001,
        0.057999,
        0.056999,
        0.059999,
        0.064001,
        0.064,
        0.058003,
        0.069998,
        0.066999,
        0.064004,
        0.067985,
        0.068999,
        0.067527,
        0.066004,
        0.072004,
        0.067987,
        0.072999,
        0.076001,
        0.077999,
        0.085003,
        0.1051,
        0.096998,
        0.108002,
        0.106998,
        0.092,
        0.1,
        0.1,
        0.096,
        0.115999,
        0.129004,
        0.137997,
        0.02,
        0.138999,
        0.140002,
        0.138998,
        0.04,
        0.094,
        0.139001,
        0.14,
        0.138998,
        0.043999,
        0.012,
        0.136999,
        0.137998,
        0.090002,
        0.106003,
        0.102998,
        0.137999,
        0.054983,
        0.14,
        0.139,
        0.139003,
        0.137997,
        0.138007,
        0.098,
        0.139002,
        0.140002,
        0.139998,
        0.139096,
        0.138,
        0.138002,
        0.137998,
        0.043998,
        0.137001,
        0.14,
        0.139997,
        0.141005,
        0.138998,
        0.141997,
        0.138002,
        0.138987,
        0.140002,
        0.138995,
        0.14,
        0.138984,
        0.137998,
        0.139,
        0.138998,
        0.139002,
        0.138001,
        0.138998,
        0.138001,
        0.139985,
        0.138003,
        0.018998,
        0.140001,
        0.139999,
        0.141,
        0.142001,
        0.019996,
        0.139004,
        0.137996,
        0.141002,
        0.138001,
        0.139997,
        0.14,
        0.144999,
        0.137983,
        0.14,
        0.139001,
        0.139999,
        0.140002,
        0.139998,
        0.139001,
        0.140001,
        0.138001,
        0.139998,
        0.066999,
        0.138001,
        0.139003,
        0.139,
        0.138998,
        0.138,
        0.137999,
        0.14,
        0.138999,
        0.141003,
        0.14,
        0.143998,
        0.139001,
        0.139001,
        0.138,
        0.140999,
        0.138003,
        0.089,
        0.140004,
        0.139996,
        0.138,
        0.138001,
        0.137999,
        0.141001,
        0.139,
        0.102,
        0.139998,
        0.044,
        0.044985,
        0.092999,
        0.138,
        0.054001,
        0.137999,
        0.137999,
        0.138001,
        0.14,
        0.136999,
        0.138001,
        0.138999,
        0.138003,
        0.140999,
        0.138999,
        0.14,
        0.138,
        0.139001,
        0.138999,
        0.138004,
        0.138001,
        0.136999,
        0.137999,
        0.139004,
        0.138001,
        0.138984,
        0.138999,
        0.137003,
        0.142,
        0.139002,
        0.14,
        0.141,
        0.14,
        0.138,
        0.137999,
        0.139001,
        0.139001,
        0.139001,
        0.138998,
        0.022,
        0.021,
        0.138002,
        0.142,
        0.140001,
        0.139997,
        0.139,
        0.043999,
        0.137985,
        0.136999,
        0.14,
        0.138001,
        0.138998,
        0.137999,
        0.139999,
        0.138002,
        0.137998,
        0.138,
        0.138,
        0.139,
        0.139998,
        0.14,
        0.138999,
        0.137,
        0.138998,
        0.139001,
        0.14,
        0.137,
        0.138999,
        0.137,
        0.140006,
        0.138994,
        0.139999,
        0.139,
        0.139998,
        0.144,
        0.139999,
        0.137002,
        0.138996,
        0.138015,
        0.138984,
        0.138002,
        0.139999,
        0.140002,
        0.140001,
        0.136998,
        0.139002,
        0.138997,
        0.139,
        0.140001,
        0.138999,
        0.137
    ]
}