episodes,steps,rewards
0,200,-200.0
1,200,-200.0
2,200,-200.0
3,200,-200.0
4,200,-200.0
5,200,-200.0
6,200,-200.0
7,200,-200.0
8,200,-200.0
9,200,-200.0
10,200,-200.0
11,200,-200.0
12,200,-200.0
13,200,-200.0
14,200,-200.0
15,200,-200.0
16,200,-200.0
17,200,-200.0
18,200,-200.0
19,200,-200.0
20,200,-200.0
21,200,-200.0
22,200,-200.0
23,200,-200.0
24,200,-200.0
25,200,-200.0
26,200,-200.0
27,200,-200.0
28,200,-200.0
29,200,-200.0
30,200,-200.0
31,200,-200.0
32,200,-200.0
33,200,-200.0
34,200,-200.0
35,200,-200.0
36,200,-200.0
37,200,-200.0
38,200,-200.0
39,200,-200.0
40,200,-200.0
41,200,-200.0
42,200,-200.0
43,200,-200.0
44,200,-200.0
45,200,-200.0
46,200,-200.0
47,200,-200.0
48,200,-200.0
49,200,-200.0
50,200,-200.0
51,200,-200.0
52,200,-200.0
53,200,-200.0
54,200,-200.0
55,200,-200.0
56,200,-200.0
57,200,-200.0
58,200,-200.0
59,200,-200.0
60,200,-200.0
61,200,-200.0
62,200,-200.0
63,200,-200.0
64,200,-200.0
65,200,-200.0
66,200,-200.0
67,200,-200.0
68,200,-200.0
69,200,-200.0
70,200,-200.0
71,200,-200.0
72,200,-200.0
73,200,-200.0
74,200,-200.0
75,200,-200.0
76,200,-200.0
77,200,-200.0
78,200,-200.0
79,200,-200.0
80,200,-200.0
81,200,-200.0
82,200,-200.0
83,200,-200.0
84,200,-200.0
85,185,-185.0
86,200,-200.0
87,200,-200.0
88,200,-200.0
89,200,-200.0
90,200,-200.0
91,200,-200.0
92,200,-200.0
93,200,-200.0
94,200,-200.0
95,200,-200.0
96,200,-200.0
97,200,-200.0
98,200,-200.0
99,200,-200.0
100,200,-200.0
101,200,-200.0
102,200,-200.0
103,200,-200.0
104,200,-200.0
105,200,-200.0
106,200,-200.0
107,200,-200.0
108,200,-200.0
109,200,-200.0
110,200,-200.0
111,200,-200.0
112,200,-200.0
113,178,-178.0
114,200,-200.0
115,200,-200.0
116,123,-123.0
117,200,-200.0
118,200,-200.0
119,200,-200.0
120,200,-200.0
121,200,-200.0
122,200,-200.0
123,200,-200.0
124,200,-200.0
125,200,-200.0
126,200,-200.0
127,200,-200.0
128,200,-200.0
129,200,-200.0
130,200,-200.0
131,200,-200.0
132,200,-200.0
133,200,-200.0
134,200,-200.0
135,200,-200.0
136,200,-200.0
137,200,-200.0
138,200,-200.0
139,200,-200.0
140,200,-200.0
141,197,-197.0
142,200,-200.0
143,200,-200.0
144,200,-200.0
145,200,-200.0
146,200,-200.0
147,181,-181.0
148,200,-200.0
149,200,-200.0
150,180,-180.0
151,200,-200.0
152,152,-152.0
153,158,-158.0
154,200,-200.0
155,200,-200.0
156,199,-199.0
157,200,-200.0
158,200,-200.0
159,200,-200.0
160,169,-169.0
161,169,-169.0
162,121,-121.0
163,200,-200.0
164,145,-145.0
165,116,-116.0
166,138,-138.0
167,200,-200.0
168,147,-147.0
169,158,-158.0
170,153,-153.0
171,115,-115.0
172,179,-179.0
173,177,-177.0
174,169,-169.0
175,191,-191.0
176,200,-200.0
177,177,-177.0
178,160,-160.0
179,200,-200.0
180,160,-160.0
181,150,-150.0
182,198,-198.0
183,149,-149.0
184,149,-149.0
185,141,-141.0
186,123,-123.0
187,191,-191.0
188,170,-170.0
189,181,-181.0
190,143,-143.0
191,171,-171.0
192,200,-200.0
193,152,-152.0
194,150,-150.0
195,184,-184.0
196,153,-153.0
197,200,-200.0
198,160,-160.0
199,145,-145.0
200,200,-200.0
201,164,-164.0
202,169,-169.0
203,200,-200.0
204,192,-192.0
205,200,-200.0
206,146,-146.0
207,159,-159.0
208,200,-200.0
209,141,-141.0
210,193,-193.0
211,178,-178.0
212,151,-151.0
213,200,-200.0
214,159,-159.0
215,157,-157.0
216,200,-200.0
217,164,-164.0
218,120,-120.0
219,150,-150.0
220,152,-152.0
221,200,-200.0
222,111,-111.0
223,149,-149.0
224,162,-162.0
225,89,-89.0
226,110,-110.0
227,92,-92.0
228,134,-134.0
229,145,-145.0
230,149,-149.0
231,169,-169.0
232,111,-111.0
233,155,-155.0
234,119,-119.0
235,90,-90.0
236,175,-175.0
237,150,-150.0
238,152,-152.0
239,88,-88.0
240,175,-175.0
241,105,-105.0
242,200,-200.0
243,196,-196.0
244,117,-117.0
245,143,-143.0
246,197,-197.0
247,127,-127.0
248,126,-126.0
249,120,-120.0
250,176,-176.0
251,102,-102.0
252,156,-156.0
253,145,-145.0
254,176,-176.0
255,118,-118.0
256,148,-148.0
257,86,-86.0
258,112,-112.0
259,117,-117.0
260,112,-112.0
261,112,-112.0
262,84,-84.0
263,94,-94.0
264,116,-116.0
265,99,-99.0
266,93,-93.0
267,157,-157.0
268,105,-105.0
269,126,-126.0
270,124,-124.0
271,122,-122.0
272,115,-115.0
273,165,-165.0
274,119,-119.0
275,122,-122.0
276,143,-143.0
277,116,-116.0
278,123,-123.0
279,122,-122.0
280,122,-122.0
281,132,-132.0
282,85,-85.0
283,146,-146.0
284,86,-86.0
285,153,-153.0
286,116,-116.0
287,119,-119.0
288,130,-130.0
289,140,-140.0
290,115,-115.0
291,200,-200.0
292,153,-153.0
293,165,-165.0
294,166,-166.0
295,161,-161.0
296,138,-138.0
297,144,-144.0
298,127,-127.0
299,119,-119.0
300,114,-114.0
301,120,-120.0
302,173,-173.0
303,114,-114.0
304,112,-112.0
305,110,-110.0
306,159,-159.0
307,164,-164.0
308,151,-151.0
309,103,-103.0
310,111,-111.0
311,170,-170.0
312,91,-91.0
313,186,-186.0
314,137,-137.0
315,114,-114.0
316,145,-145.0
317,156,-156.0
318,154,-154.0
319,107,-107.0
320,146,-146.0
321,148,-148.0
322,149,-149.0
323,137,-137.0
324,89,-89.0
325,97,-97.0
326,145,-145.0
327,151,-151.0
328,138,-138.0
329,143,-143.0
330,148,-148.0
331,85,-85.0
332,137,-137.0
333,146,-146.0
334,149,-149.0
335,140,-140.0
336,166,-166.0
337,170,-170.0
338,163,-163.0
339,157,-157.0
340,143,-143.0
341,145,-145.0
342,138,-138.0
343,154,-154.0
344,148,-148.0
345,176,-176.0
346,146,-146.0
347,145,-145.0
348,110,-110.0
349,140,-140.0
350,143,-143.0
351,173,-173.0
352,106,-106.0
353,138,-138.0
354,88,-88.0
355,143,-143.0
356,150,-150.0
357,136,-136.0
358,144,-144.0
359,173,-173.0
360,140,-140.0
361,153,-153.0
362,105,-105.0
363,200,-200.0
364,111,-111.0
365,95,-95.0
366,139,-139.0
367,199,-199.0
368,105,-105.0
369,106,-106.0
370,99,-99.0
371,105,-105.0
372,113,-113.0
373,95,-95.0
374,134,-134.0
375,157,-157.0
376,106,-106.0
377,146,-146.0
378,109,-109.0
379,108,-108.0
380,107,-107.0
381,96,-96.0
382,148,-148.0
383,113,-113.0
384,89,-89.0
385,113,-113.0
386,107,-107.0
387,106,-106.0
388,105,-105.0
389,119,-119.0
390,106,-106.0
391,110,-110.0
392,105,-105.0
393,90,-90.0
394,147,-147.0
395,105,-105.0
396,108,-108.0
397,117,-117.0
398,113,-113.0
399,110,-110.0
400,109,-109.0
401,107,-107.0
402,149,-149.0
403,145,-145.0
404,105,-105.0
405,168,-168.0
406,149,-149.0
407,143,-143.0
408,106,-106.0
409,104,-104.0
410,84,-84.0
411,106,-106.0
412,111,-111.0
413,154,-154.0
414,95,-95.0
415,143,-143.0
416,158,-158.0
417,189,-189.0
418,85,-85.0
419,144,-144.0
420,152,-152.0
421,151,-151.0
422,142,-142.0
423,141,-141.0
424,139,-139.0
425,106,-106.0
426,176,-176.0
427,137,-137.0
428,104,-104.0
429,105,-105.0
430,119,-119.0
431,154,-154.0
432,108,-108.0
433,114,-114.0
434,200,-200.0
435,122,-122.0
436,200,-200.0
437,129,-129.0
438,141,-141.0
439,153,-153.0
440,136,-136.0
441,125,-125.0
442,160,-160.0
443,97,-97.0
444,161,-161.0
445,88,-88.0
446,141,-141.0
447,151,-151.0
448,156,-156.0
449,184,-184.0
450,155,-155.0
451,154,-154.0
452,146,-146.0
453,147,-147.0
454,95,-95.0
455,178,-178.0
456,144,-144.0
457,140,-140.0
458,151,-151.0
459,149,-149.0
460,141,-141.0
461,90,-90.0
462,111,-111.0
463,138,-138.0
464,139,-139.0
465,98,-98.0
466,153,-153.0
467,116,-116.0
468,123,-123.0
469,116,-116.0
470,148,-148.0
471,92,-92.0
472,163,-163.0
473,99,-99.0
474,155,-155.0
475,143,-143.0
476,160,-160.0
477,138,-138.0
478,147,-147.0
479,141,-141.0
480,98,-98.0
481,147,-147.0
482,107,-107.0
483,148,-148.0
484,145,-145.0
485,109,-109.0
486,109,-109.0
487,83,-83.0
488,152,-152.0
489,162,-162.0
490,152,-152.0
491,200,-200.0
492,173,-173.0
493,144,-144.0
494,157,-157.0
495,89,-89.0
496,145,-145.0
497,134,-134.0
498,164,-164.0
499,110,-110.0
500,153,-153.0
501,155,-155.0
502,158,-158.0
503,141,-141.0
504,170,-170.0
505,137,-137.0
506,175,-175.0
507,87,-87.0
508,200,-200.0
509,93,-93.0
510,145,-145.0
511,93,-93.0
512,143,-143.0
513,156,-156.0
514,116,-116.0
515,139,-139.0
516,143,-143.0
517,84,-84.0
518,109,-109.0
519,110,-110.0
520,94,-94.0
521,143,-143.0
522,147,-147.0
523,152,-152.0
524,141,-141.0
525,169,-169.0
526,101,-101.0
527,180,-180.0
528,112,-112.0
529,153,-153.0
530,147,-147.0
531,200,-200.0
532,143,-143.0
533,141,-141.0
534,142,-142.0
535,157,-157.0
536,140,-140.0
537,114,-114.0
538,140,-140.0
539,111,-111.0
540,140,-140.0
541,136,-136.0
542,134,-134.0
543,134,-134.0
544,92,-92.0
545,113,-113.0
546,93,-93.0
547,138,-138.0
548,142,-142.0
549,133,-133.0
550,142,-142.0
551,95,-95.0
552,139,-139.0
553,168,-168.0
554,176,-176.0
555,113,-113.0
556,141,-141.0
557,175,-175.0
558,138,-138.0
559,139,-139.0
560,139,-139.0
561,85,-85.0
562,143,-143.0
563,145,-145.0
564,84,-84.0
565,143,-143.0
566,142,-142.0
567,139,-139.0
568,145,-145.0
569,162,-162.0
570,143,-143.0
571,141,-141.0
572,147,-147.0
573,148,-148.0
574,128,-128.0
575,141,-141.0
576,139,-139.0
577,176,-176.0
578,145,-145.0
579,150,-150.0
580,154,-154.0
581,139,-139.0
582,161,-161.0
583,148,-148.0
584,140,-140.0
585,161,-161.0
586,146,-146.0
587,146,-146.0
588,144,-144.0
589,139,-139.0
590,95,-95.0
591,171,-171.0
592,145,-145.0
593,155,-155.0
594,163,-163.0
595,182,-182.0
596,117,-117.0
597,166,-166.0
598,101,-101.0
599,140,-140.0
600,89,-89.0
601,85,-85.0
602,145,-145.0
603,174,-174.0
604,162,-162.0
605,153,-153.0
606,118,-118.0
607,146,-146.0
608,162,-162.0
609,157,-157.0
610,150,-150.0
611,110,-110.0
612,149,-149.0
613,142,-142.0
614,85,-85.0
615,177,-177.0
616,161,-161.0
617,152,-152.0
618,149,-149.0
619,84,-84.0
620,145,-145.0
621,159,-159.0
622,97,-97.0
623,87,-87.0
624,152,-152.0
625,161,-161.0
626,140,-140.0
627,143,-143.0
628,86,-86.0
629,155,-155.0
630,164,-164.0
631,175,-175.0
632,149,-149.0
633,144,-144.0
634,200,-200.0
635,139,-139.0
636,136,-136.0
637,167,-167.0
638,144,-144.0
639,138,-138.0
640,143,-143.0
641,146,-146.0
642,130,-130.0
643,133,-133.0
644,154,-154.0
645,175,-175.0
646,200,-200.0
647,197,-197.0
648,141,-141.0
649,173,-173.0
650,175,-175.0
651,200,-200.0
652,181,-181.0
653,144,-144.0
654,104,-104.0
655,163,-163.0
656,160,-160.0
657,162,-162.0
658,188,-188.0
659,92,-92.0
660,151,-151.0
661,152,-152.0
662,107,-107.0
663,123,-123.0
664,86,-86.0
665,168,-168.0
666,99,-99.0
667,178,-178.0
668,124,-124.0
669,138,-138.0
670,148,-148.0
671,91,-91.0
672,88,-88.0
673,99,-99.0
674,152,-152.0
675,88,-88.0
676,85,-85.0
677,84,-84.0
678,102,-102.0
679,188,-188.0
680,173,-173.0
681,86,-86.0
682,89,-89.0
683,87,-87.0
684,100,-100.0
685,177,-177.0
686,135,-135.0
687,175,-175.0
688,194,-194.0
689,90,-90.0
690,85,-85.0
691,130,-130.0
692,91,-91.0
693,99,-99.0
694,89,-89.0
695,155,-155.0
696,89,-89.0
697,144,-144.0
698,167,-167.0
699,102,-102.0
700,159,-159.0
701,96,-96.0
702,87,-87.0
703,126,-126.0
704,93,-93.0
705,149,-149.0
706,147,-147.0
707,140,-140.0
708,119,-119.0
709,150,-150.0
710,184,-184.0
711,147,-147.0
712,97,-97.0
713,142,-142.0
714,200,-200.0
715,89,-89.0
716,95,-95.0
717,85,-85.0
718,167,-167.0
719,84,-84.0
720,144,-144.0
721,87,-87.0
722,151,-151.0
723,152,-152.0
724,142,-142.0
725,151,-151.0
726,90,-90.0
727,148,-148.0
728,178,-178.0
729,159,-159.0
730,200,-200.0
731,200,-200.0
732,92,-92.0
733,164,-164.0
734,113,-113.0
735,160,-160.0
736,101,-101.0
737,146,-146.0
738,150,-150.0
739,145,-145.0
740,173,-173.0
741,148,-148.0
742,138,-138.0
743,97,-97.0
744,83,-83.0
745,149,-149.0
746,93,-93.0
747,102,-102.0
748,153,-153.0
749,94,-94.0
750,144,-144.0
751,148,-148.0
752,90,-90.0
753,155,-155.0
754,86,-86.0
755,200,-200.0
756,149,-149.0
757,149,-149.0
758,148,-148.0
759,141,-141.0
760,150,-150.0
761,154,-154.0
762,85,-85.0
763,108,-108.0
764,90,-90.0
765,149,-149.0
766,150,-150.0
767,157,-157.0
768,149,-149.0
769,146,-146.0
770,155,-155.0
771,150,-150.0
772,146,-146.0
773,149,-149.0
774,139,-139.0
775,146,-146.0
776,145,-145.0
777,86,-86.0
778,100,-100.0
779,142,-142.0
780,142,-142.0
781,156,-156.0
782,152,-152.0
783,89,-89.0
784,148,-148.0
785,138,-138.0
786,93,-93.0
787,200,-200.0
788,145,-145.0
789,102,-102.0
790,148,-148.0
791,147,-147.0
792,157,-157.0
793,145,-145.0
794,160,-160.0
795,153,-153.0
796,99,-99.0
797,105,-105.0
798,93,-93.0
799,147,-147.0
800,160,-160.0
801,200,-200.0
802,111,-111.0
803,98,-98.0
804,149,-149.0
805,174,-174.0
806,200,-200.0
807,165,-165.0
808,166,-166.0
809,89,-89.0
810,89,-89.0
811,159,-159.0
812,159,-159.0
813,100,-100.0
814,100,-100.0
815,141,-141.0
816,92,-92.0
817,110,-110.0
818,157,-157.0
819,101,-101.0
820,88,-88.0
821,158,-158.0
822,102,-102.0
823,88,-88.0
824,159,-159.0
825,154,-154.0
826,90,-90.0
827,88,-88.0
828,200,-200.0
829,176,-176.0
830,184,-184.0
831,182,-182.0
832,188,-188.0
833,169,-169.0
834,152,-152.0
835,200,-200.0
836,174,-174.0
837,162,-162.0
838,156,-156.0
839,158,-158.0
840,163,-163.0
841,163,-163.0
842,155,-155.0
843,90,-90.0
844,155,-155.0
845,159,-159.0
846,157,-157.0
847,147,-147.0
848,89,-89.0
849,159,-159.0
850,161,-161.0
851,200,-200.0
852,200,-200.0
853,152,-152.0
854,200,-200.0
855,90,-90.0
856,200,-200.0
857,200,-200.0
858,200,-200.0
859,200,-200.0
860,150,-150.0
861,106,-106.0
862,88,-88.0
863,200,-200.0
864,160,-160.0
865,146,-146.0
866,155,-155.0
867,151,-151.0
868,99,-99.0
869,96,-96.0
870,92,-92.0
871,148,-148.0
872,151,-151.0
873,149,-149.0
874,200,-200.0
875,147,-147.0
876,145,-145.0
877,89,-89.0
878,179,-179.0
879,174,-174.0
880,148,-148.0
881,90,-90.0
882,166,-166.0
883,145,-145.0
884,89,-89.0
885,190,-190.0
886,93,-93.0
887,97,-97.0
888,93,-93.0
889,173,-173.0
890,200,-200.0
891,200,-200.0
892,200,-200.0
893,200,-200.0
894,96,-96.0
895,200,-200.0
896,112,-112.0
897,113,-113.0
898,162,-162.0
899,149,-149.0
900,200,-200.0
901,88,-88.0
902,156,-156.0
903,200,-200.0
904,157,-157.0
905,116,-116.0
906,159,-159.0
907,87,-87.0
908,97,-97.0
909,155,-155.0
910,152,-152.0
911,176,-176.0
912,153,-153.0
913,89,-89.0
914,190,-190.0
915,174,-174.0
916,150,-150.0
917,168,-168.0
918,86,-86.0
919,168,-168.0
920,141,-141.0
921,200,-200.0
922,200,-200.0
923,200,-200.0
924,200,-200.0
925,149,-149.0
926,149,-149.0
927,100,-100.0
928,174,-174.0
929,154,-154.0
930,156,-156.0
931,152,-152.0
932,200,-200.0
933,145,-145.0
934,148,-148.0
935,133,-133.0
936,149,-149.0
937,102,-102.0
938,200,-200.0
939,160,-160.0
940,153,-153.0
941,114,-114.0
942,200,-200.0
943,200,-200.0
944,200,-200.0
945,146,-146.0
946,154,-154.0
947,176,-176.0
948,200,-200.0
949,149,-149.0
950,149,-149.0
951,197,-197.0
952,114,-114.0
953,92,-92.0
954,129,-129.0
955,200,-200.0
956,200,-200.0
957,200,-200.0
958,200,-200.0
959,167,-167.0
960,153,-153.0
961,189,-189.0
962,200,-200.0
963,200,-200.0
964,126,-126.0
965,84,-84.0
966,200,-200.0
967,152,-152.0
968,193,-193.0
969,192,-192.0
970,175,-175.0
971,148,-148.0
972,200,-200.0
973,157,-157.0
974,89,-89.0
975,200,-200.0
976,156,-156.0
977,200,-200.0
978,110,-110.0
979,200,-200.0
980,116,-116.0
981,178,-178.0
982,160,-160.0
983,200,-200.0
984,160,-160.0
985,200,-200.0
986,169,-169.0
987,154,-154.0
988,200,-200.0
989,87,-87.0
990,159,-159.0
991,200,-200.0
992,164,-164.0
993,200,-200.0
994,103,-103.0
995,92,-92.0
996,87,-87.0
997,157,-157.0
998,99,-99.0
999,200,-200.0
1000,84,-84.0
1001,200,-200.0
1002,200,-200.0
1003,200,-200.0
1004,126,-126.0
1005,120,-120.0
1006,118,-118.0
1007,169,-169.0
1008,106,-106.0
1009,107,-107.0
1010,109,-109.0
1011,151,-151.0
1012,153,-153.0
1013,147,-147.0
1014,153,-153.0
1015,109,-109.0
1016,163,-163.0
1017,116,-116.0
1018,167,-167.0
1019,200,-200.0
1020,200,-200.0
1021,154,-154.0
1022,90,-90.0
1023,167,-167.0
1024,147,-147.0
1025,145,-145.0
1026,104,-104.0
1027,200,-200.0
1028,146,-146.0
1029,174,-174.0
1030,100,-100.0
1031,200,-200.0
1032,162,-162.0
1033,176,-176.0
1034,162,-162.0
1035,155,-155.0
1036,158,-158.0
1037,200,-200.0
1038,146,-146.0
1039,183,-183.0
1040,102,-102.0
1041,150,-150.0
1042,166,-166.0
1043,169,-169.0
1044,180,-180.0
1045,165,-165.0
1046,164,-164.0
1047,113,-113.0
1048,114,-114.0
1049,160,-160.0
1050,169,-169.0
1051,128,-128.0
1052,94,-94.0
1053,111,-111.0
1054,146,-146.0
1055,161,-161.0
1056,120,-120.0
1057,200,-200.0
1058,91,-91.0
1059,151,-151.0
1060,88,-88.0
1061,142,-142.0
1062,164,-164.0
1063,172,-172.0
1064,200,-200.0
1065,148,-148.0
1066,93,-93.0
1067,166,-166.0
1068,88,-88.0
1069,144,-144.0
1070,153,-153.0
1071,111,-111.0
1072,157,-157.0
1073,151,-151.0
1074,144,-144.0
1075,200,-200.0
1076,163,-163.0
1077,160,-160.0
1078,91,-91.0
1079,151,-151.0
1080,101,-101.0
1081,148,-148.0
1082,150,-150.0
1083,139,-139.0
1084,167,-167.0
1085,143,-143.0
1086,105,-105.0
1087,153,-153.0
1088,90,-90.0
1089,152,-152.0
1090,141,-141.0
1091,157,-157.0
1092,200,-200.0
1093,96,-96.0
1094,157,-157.0
1095,152,-152.0
1096,174,-174.0
1097,103,-103.0
1098,91,-91.0
1099,153,-153.0
1100,158,-158.0
1101,113,-113.0
1102,151,-151.0
1103,142,-142.0
1104,153,-153.0
1105,143,-143.0
1106,140,-140.0
1107,97,-97.0
1108,154,-154.0
1109,144,-144.0
1110,142,-142.0
1111,152,-152.0
1112,200,-200.0
1113,146,-146.0
1114,145,-145.0
1115,150,-150.0
1116,92,-92.0
1117,164,-164.0
1118,200,-200.0
1119,166,-166.0
1120,146,-146.0
1121,173,-173.0
1122,147,-147.0
1123,144,-144.0
1124,91,-91.0
1125,165,-165.0
1126,87,-87.0
1127,174,-174.0
1128,96,-96.0
1129,167,-167.0
1130,153,-153.0
1131,113,-113.0
1132,120,-120.0
1133,177,-177.0
1134,173,-173.0
1135,180,-180.0
1136,145,-145.0
1137,140,-140.0
1138,148,-148.0
1139,116,-116.0
1140,178,-178.0
1141,175,-175.0
1142,89,-89.0
1143,91,-91.0
1144,96,-96.0
1145,139,-139.0
1146,143,-143.0
1147,164,-164.0
1148,150,-150.0
1149,144,-144.0
1150,90,-90.0
1151,154,-154.0
1152,103,-103.0
1153,148,-148.0
1154,171,-171.0
1155,154,-154.0
1156,146,-146.0
1157,146,-146.0
1158,151,-151.0
1159,141,-141.0
1160,142,-142.0
1161,158,-158.0
1162,145,-145.0
1163,96,-96.0
1164,156,-156.0
1165,144,-144.0
1166,149,-149.0
1167,169,-169.0
1168,141,-141.0
1169,181,-181.0
1170,103,-103.0
1171,148,-148.0
1172,144,-144.0
1173,156,-156.0
1174,152,-152.0
1175,139,-139.0
1176,142,-142.0
1177,141,-141.0
1178,110,-110.0
1179,140,-140.0
1180,149,-149.0
1181,86,-86.0
1182,101,-101.0
1183,171,-171.0
1184,145,-145.0
1185,169,-169.0
1186,148,-148.0
1187,147,-147.0
1188,152,-152.0
1189,152,-152.0
1190,129,-129.0
1191,163,-163.0
1192,196,-196.0
1193,152,-152.0
1194,173,-173.0
1195,156,-156.0
1196,139,-139.0
1197,151,-151.0
1198,159,-159.0
1199,175,-175.0
1200,143,-143.0
1201,126,-126.0
1202,145,-145.0
1203,157,-157.0
1204,88,-88.0
1205,109,-109.0
1206,118,-118.0
1207,92,-92.0
1208,155,-155.0
1209,200,-200.0
1210,171,-171.0
1211,200,-200.0
1212,200,-200.0
1213,146,-146.0
1214,200,-200.0
1215,200,-200.0
1216,190,-190.0
1217,154,-154.0
1218,200,-200.0
1219,200,-200.0
1220,122,-122.0
1221,173,-173.0
1222,143,-143.0
1223,196,-196.0
1224,150,-150.0
1225,162,-162.0
1226,163,-163.0
1227,141,-141.0
1228,160,-160.0
1229,172,-172.0
1230,200,-200.0
1231,154,-154.0
1232,129,-129.0
1233,142,-142.0
1234,93,-93.0
1235,174,-174.0
1236,112,-112.0
1237,130,-130.0
1238,87,-87.0
1239,153,-153.0
1240,108,-108.0
1241,200,-200.0
1242,163,-163.0
1243,150,-150.0
1244,144,-144.0
1245,152,-152.0
1246,176,-176.0
1247,162,-162.0
1248,200,-200.0
1249,116,-116.0
1250,142,-142.0
1251,139,-139.0
1252,200,-200.0
1253,116,-116.0
1254,90,-90.0
1255,200,-200.0
1256,152,-152.0
1257,95,-95.0
1258,170,-170.0
1259,166,-166.0
1260,200,-200.0
1261,192,-192.0
1262,98,-98.0
1263,187,-187.0
1264,151,-151.0
1265,141,-141.0
1266,179,-179.0
1267,145,-145.0
1268,144,-144.0
1269,200,-200.0
1270,200,-200.0
1271,200,-200.0
1272,93,-93.0
1273,182,-182.0
1274,153,-153.0
1275,174,-174.0
1276,200,-200.0
1277,173,-173.0
1278,163,-163.0
1279,145,-145.0
1280,173,-173.0
1281,200,-200.0
1282,180,-180.0
1283,162,-162.0
1284,152,-152.0
1285,166,-166.0
1286,153,-153.0
1287,186,-186.0
1288,200,-200.0
1289,153,-153.0
1290,84,-84.0
1291,149,-149.0
1292,200,-200.0
1293,147,-147.0
1294,99,-99.0
1295,149,-149.0
1296,91,-91.0
1297,168,-168.0
1298,85,-85.0
1299,95,-95.0
1300,164,-164.0
1301,193,-193.0
1302,200,-200.0
1303,87,-87.0
1304,143,-143.0
1305,189,-189.0
1306,170,-170.0
1307,200,-200.0
1308,186,-186.0
1309,195,-195.0
1310,200,-200.0
1311,154,-154.0
1312,84,-84.0
1313,156,-156.0
1314,90,-90.0
1315,174,-174.0
1316,200,-200.0
1317,157,-157.0
1318,200,-200.0
1319,200,-200.0
1320,156,-156.0
1321,179,-179.0
1322,200,-200.0
1323,196,-196.0
1324,200,-200.0
1325,190,-190.0
1326,200,-200.0
1327,184,-184.0
1328,200,-200.0
1329,200,-200.0
1330,150,-150.0
1331,187,-187.0
1332,190,-190.0
1333,164,-164.0
1334,162,-162.0
1335,109,-109.0
1336,165,-165.0
1337,187,-187.0
1338,84,-84.0
1339,200,-200.0
1340,134,-134.0
1341,112,-112.0
1342,171,-171.0
1343,94,-94.0
1344,149,-149.0
1345,142,-142.0
1346,102,-102.0
1347,141,-141.0
1348,192,-192.0
1349,200,-200.0
1350,85,-85.0
1351,141,-141.0
1352,161,-161.0
1353,153,-153.0
1354,131,-131.0
1355,106,-106.0
1356,141,-141.0
1357,88,-88.0
1358,97,-97.0
1359,91,-91.0
1360,170,-170.0
1361,164,-164.0
1362,101,-101.0
1363,92,-92.0
1364,200,-200.0
1365,147,-147.0
1366,159,-159.0
1367,157,-157.0
1368,152,-152.0
1369,154,-154.0
1370,101,-101.0
1371,200,-200.0
1372,200,-200.0
1373,181,-181.0
1374,198,-198.0
1375,157,-157.0
1376,91,-91.0
1377,97,-97.0
1378,95,-95.0
1379,154,-154.0
1380,154,-154.0
1381,158,-158.0
1382,175,-175.0
1383,91,-91.0
1384,92,-92.0
1385,162,-162.0
1386,150,-150.0
1387,153,-153.0
1388,96,-96.0
1389,100,-100.0
1390,147,-147.0
1391,165,-165.0
1392,152,-152.0
1393,88,-88.0
1394,106,-106.0
1395,148,-148.0
1396,92,-92.0
1397,165,-165.0
1398,182,-182.0
1399,169,-169.0
1400,141,-141.0
1401,88,-88.0
1402,152,-152.0
1403,171,-171.0
1404,94,-94.0
1405,171,-171.0
1406,163,-163.0
1407,110,-110.0
1408,150,-150.0
1409,87,-87.0
1410,167,-167.0
1411,157,-157.0
1412,155,-155.0
1413,199,-199.0
1414,177,-177.0
1415,153,-153.0
1416,91,-91.0
1417,91,-91.0
1418,145,-145.0
1419,167,-167.0
1420,198,-198.0
1421,167,-167.0
1422,85,-85.0
1423,145,-145.0
1424,135,-135.0
1425,155,-155.0
1426,147,-147.0
1427,136,-136.0
1428,200,-200.0
1429,92,-92.0
1430,179,-179.0
1431,200,-200.0
1432,87,-87.0
1433,200,-200.0
1434,180,-180.0
1435,142,-142.0
1436,200,-200.0
1437,185,-185.0
1438,159,-159.0
1439,147,-147.0
1440,153,-153.0
1441,86,-86.0
1442,92,-92.0
1443,159,-159.0
1444,99,-99.0
1445,96,-96.0
1446,173,-173.0
1447,174,-174.0
1448,188,-188.0
1449,167,-167.0
1450,164,-164.0
1451,161,-161.0
1452,172,-172.0
1453,140,-140.0
1454,155,-155.0
1455,134,-134.0
1456,87,-87.0
1457,180,-180.0
1458,200,-200.0
1459,188,-188.0
1460,160,-160.0
1461,162,-162.0
1462,100,-100.0
1463,86,-86.0
1464,146,-146.0
1465,162,-162.0
1466,200,-200.0
1467,171,-171.0
1468,200,-200.0
1469,147,-147.0
1470,145,-145.0
1471,144,-144.0
1472,152,-152.0
1473,155,-155.0
1474,166,-166.0
1475,85,-85.0
1476,161,-161.0
1477,200,-200.0
1478,145,-145.0
1479,142,-142.0
1480,143,-143.0
1481,161,-161.0
1482,111,-111.0
1483,160,-160.0
1484,157,-157.0
1485,151,-151.0
1486,93,-93.0
1487,159,-159.0
1488,200,-200.0
1489,161,-161.0
1490,163,-163.0
1491,179,-179.0
1492,91,-91.0
1493,157,-157.0
1494,160,-160.0
1495,143,-143.0
1496,150,-150.0
1497,92,-92.0
1498,86,-86.0
1499,142,-142.0
1500,156,-156.0
1501,194,-194.0
1502,141,-141.0
1503,149,-149.0
1504,191,-191.0
1505,128,-128.0
1506,97,-97.0
1507,147,-147.0
1508,140,-140.0
1509,87,-87.0
1510,126,-126.0
1511,87,-87.0
1512,162,-162.0
1513,170,-170.0
1514,200,-200.0
1515,200,-200.0
1516,87,-87.0
1517,200,-200.0
1518,84,-84.0
1519,143,-143.0
1520,161,-161.0
1521,135,-135.0
1522,200,-200.0
1523,168,-168.0
1524,200,-200.0
1525,192,-192.0
1526,106,-106.0
1527,200,-200.0
1528,108,-108.0
1529,94,-94.0
1530,199,-199.0
1531,200,-200.0
1532,200,-200.0
1533,200,-200.0
1534,196,-196.0
1535,200,-200.0
1536,200,-200.0
1537,200,-200.0
1538,200,-200.0
1539,200,-200.0
1540,200,-200.0
1541,124,-124.0
1542,200,-200.0
1543,200,-200.0
1544,94,-94.0
1545,169,-169.0
1546,109,-109.0
1547,142,-142.0
1548,163,-163.0
1549,172,-172.0
1550,102,-102.0
1551,178,-178.0
1552,161,-161.0
1553,158,-158.0
1554,164,-164.0
1555,158,-158.0
1556,157,-157.0
1557,158,-158.0
1558,172,-172.0
1559,200,-200.0
1560,179,-179.0
1561,161,-161.0
1562,161,-161.0
1563,181,-181.0
1564,164,-164.0
1565,177,-177.0
1566,170,-170.0
1567,177,-177.0
1568,152,-152.0
1569,180,-180.0
1570,166,-166.0
1571,179,-179.0
1572,173,-173.0
1573,159,-159.0
1574,162,-162.0
1575,163,-163.0
1576,164,-164.0
1577,162,-162.0
1578,200,-200.0
1579,200,-200.0
1580,194,-194.0
1581,200,-200.0
1582,200,-200.0
1583,200,-200.0
1584,169,-169.0
1585,200,-200.0
1586,200,-200.0
1587,108,-108.0
1588,200,-200.0
1589,165,-165.0
1590,159,-159.0
1591,200,-200.0
1592,147,-147.0
1593,167,-167.0
1594,200,-200.0
1595,153,-153.0
1596,142,-142.0
1597,200,-200.0
1598,162,-162.0
1599,137,-137.0
1600,155,-155.0
1601,148,-148.0
1602,168,-168.0
1603,138,-138.0
1604,200,-200.0
1605,107,-107.0
1606,108,-108.0
1607,162,-162.0
1608,112,-112.0
1609,116,-116.0
1610,158,-158.0
1611,103,-103.0
1612,166,-166.0
1613,87,-87.0
1614,115,-115.0
1615,200,-200.0
1616,200,-200.0
1617,155,-155.0
1618,112,-112.0
1619,196,-196.0
1620,163,-163.0
1621,169,-169.0
1622,123,-123.0
1623,109,-109.0
1624,200,-200.0
1625,106,-106.0
1626,200,-200.0
1627,145,-145.0
1628,163,-163.0
1629,200,-200.0
1630,190,-190.0
1631,198,-198.0
1632,162,-162.0
1633,144,-144.0
1634,87,-87.0
1635,90,-90.0
1636,149,-149.0
1637,200,-200.0
1638,108,-108.0
1639,114,-114.0
1640,158,-158.0
1641,166,-166.0
1642,176,-176.0
1643,92,-92.0
1644,98,-98.0
1645,162,-162.0
1646,168,-168.0
1647,109,-109.0
1648,189,-189.0
1649,159,-159.0
1650,141,-141.0
1651,122,-122.0
1652,158,-158.0
1653,86,-86.0
1654,167,-167.0
1655,167,-167.0
1656,177,-177.0
1657,173,-173.0
1658,200,-200.0
1659,164,-164.0
1660,168,-168.0
1661,156,-156.0
1662,153,-153.0
1663,158,-158.0
1664,157,-157.0
1665,108,-108.0
1666,168,-168.0
1667,92,-92.0
1668,149,-149.0
1669,129,-129.0
1670,159,-159.0
1671,140,-140.0
1672,168,-168.0
1673,128,-128.0
1674,117,-117.0
1675,166,-166.0
1676,162,-162.0
1677,149,-149.0
1678,159,-159.0
1679,144,-144.0
1680,95,-95.0
1681,162,-162.0
1682,110,-110.0
1683,150,-150.0
1684,152,-152.0
1685,89,-89.0
1686,150,-150.0
1687,87,-87.0
1688,109,-109.0
1689,108,-108.0
1690,160,-160.0
1691,177,-177.0
1692,152,-152.0
1693,183,-183.0
1694,123,-123.0
1695,157,-157.0
1696,169,-169.0
1697,137,-137.0
1698,200,-200.0
1699,99,-99.0
1700,156,-156.0
1701,164,-164.0
1702,200,-200.0
1703,187,-187.0
1704,156,-156.0
1705,116,-116.0
1706,139,-139.0
1707,132,-132.0
1708,134,-134.0
1709,167,-167.0
1710,134,-134.0
1711,200,-200.0
1712,185,-185.0
1713,157,-157.0
1714,158,-158.0
1715,155,-155.0
1716,159,-159.0
1717,148,-148.0
1718,163,-163.0
1719,156,-156.0
1720,162,-162.0
1721,169,-169.0
1722,124,-124.0
1723,158,-158.0
1724,102,-102.0
1725,117,-117.0
1726,166,-166.0
1727,179,-179.0
1728,167,-167.0
1729,112,-112.0
1730,149,-149.0
1731,91,-91.0
1732,156,-156.0
1733,164,-164.0
1734,173,-173.0
1735,173,-173.0
1736,177,-177.0
1737,185,-185.0
1738,120,-120.0
1739,159,-159.0
1740,103,-103.0
1741,111,-111.0
1742,163,-163.0
1743,108,-108.0
1744,167,-167.0
1745,102,-102.0
1746,108,-108.0
1747,91,-91.0
1748,173,-173.0
1749,115,-115.0
1750,119,-119.0
1751,113,-113.0
1752,116,-116.0
1753,111,-111.0
1754,110,-110.0
1755,115,-115.0
1756,192,-192.0
1757,100,-100.0
1758,89,-89.0
1759,95,-95.0
1760,114,-114.0
1761,105,-105.0
1762,150,-150.0
1763,115,-115.0
1764,179,-179.0
1765,93,-93.0
1766,86,-86.0
1767,88,-88.0
1768,106,-106.0
1769,143,-143.0
1770,88,-88.0
1771,154,-154.0
1772,95,-95.0
1773,107,-107.0
1774,164,-164.0
1775,165,-165.0
1776,167,-167.0
1777,113,-113.0
1778,110,-110.0
1779,111,-111.0
1780,172,-172.0
1781,90,-90.0
1782,104,-104.0
1783,90,-90.0
1784,159,-159.0
1785,109,-109.0
1786,105,-105.0
1787,90,-90.0
1788,177,-177.0
1789,187,-187.0
1790,164,-164.0
1791,153,-153.0
1792,164,-164.0
1793,107,-107.0
1794,119,-119.0
1795,162,-162.0
1796,158,-158.0
1797,90,-90.0
1798,161,-161.0
1799,88,-88.0
1800,156,-156.0
1801,108,-108.0
1802,92,-92.0
1803,164,-164.0
1804,167,-167.0
1805,96,-96.0
1806,164,-164.0
1807,167,-167.0
1808,161,-161.0
1809,107,-107.0
1810,160,-160.0
1811,103,-103.0
1812,172,-172.0
1813,166,-166.0
1814,200,-200.0
1815,86,-86.0
1816,159,-159.0
1817,88,-88.0
1818,160,-160.0
1819,193,-193.0
1820,200,-200.0
1821,170,-170.0
1822,106,-106.0
1823,96,-96.0
1824,162,-162.0
1825,164,-164.0
1826,102,-102.0
1827,200,-200.0
1828,99,-99.0
1829,165,-165.0
1830,177,-177.0
1831,200,-200.0
1832,148,-148.0
1833,89,-89.0
1834,85,-85.0
1835,165,-165.0
1836,107,-107.0
1837,200,-200.0
1838,174,-174.0
1839,164,-164.0
1840,168,-168.0
1841,200,-200.0
1842,163,-163.0
1843,103,-103.0
1844,161,-161.0
1845,164,-164.0
1846,185,-185.0
1847,161,-161.0
1848,200,-200.0
1849,159,-159.0
1850,159,-159.0
1851,181,-181.0
1852,159,-159.0
1853,134,-134.0
1854,158,-158.0
1855,104,-104.0
1856,174,-174.0
1857,200,-200.0
1858,100,-100.0
1859,88,-88.0
1860,88,-88.0
1861,98,-98.0
1862,158,-158.0
1863,152,-152.0
1864,154,-154.0
1865,175,-175.0
1866,159,-159.0
1867,150,-150.0
1868,164,-164.0
1869,106,-106.0
1870,86,-86.0
1871,88,-88.0
1872,87,-87.0
1873,159,-159.0
1874,101,-101.0
1875,159,-159.0
1876,142,-142.0
1877,87,-87.0
1878,94,-94.0
1879,122,-122.0
1880,160,-160.0
1881,152,-152.0
1882,173,-173.0
1883,170,-170.0
1884,94,-94.0
1885,153,-153.0
1886,147,-147.0
1887,159,-159.0
1888,90,-90.0
1889,184,-184.0
1890,175,-175.0
1891,92,-92.0
1892,95,-95.0
1893,139,-139.0
1894,181,-181.0
1895,93,-93.0
1896,165,-165.0
1897,155,-155.0
1898,122,-122.0
1899,90,-90.0
1900,168,-168.0
1901,152,-152.0
1902,121,-121.0
1903,146,-146.0
1904,146,-146.0
1905,159,-159.0
1906,159,-159.0
1907,166,-166.0
1908,177,-177.0
1909,175,-175.0
1910,85,-85.0
1911,97,-97.0
1912,154,-154.0
1913,179,-179.0
1914,169,-169.0
1915,89,-89.0
1916,152,-152.0
1917,164,-164.0
1918,110,-110.0
1919,130,-130.0
1920,93,-93.0
1921,176,-176.0
1922,156,-156.0
1923,149,-149.0
1924,165,-165.0
1925,156,-156.0
1926,93,-93.0
1927,153,-153.0
1928,160,-160.0
1929,92,-92.0
1930,116,-116.0
1931,183,-183.0
1932,84,-84.0
1933,145,-145.0
1934,149,-149.0
1935,148,-148.0
1936,85,-85.0
1937,86,-86.0
1938,90,-90.0
1939,140,-140.0
1940,158,-158.0
1941,92,-92.0
1942,98,-98.0
1943,153,-153.0
1944,162,-162.0
1945,155,-155.0
1946,178,-178.0
1947,100,-100.0
1948,163,-163.0
1949,200,-200.0
1950,130,-130.0
1951,100,-100.0
1952,163,-163.0
1953,98,-98.0
1954,115,-115.0
1955,170,-170.0
1956,157,-157.0
1957,173,-173.0
1958,146,-146.0
1959,168,-168.0
1960,156,-156.0
1961,95,-95.0
1962,87,-87.0
1963,97,-97.0
1964,168,-168.0
1965,161,-161.0
1966,165,-165.0
1967,89,-89.0
1968,181,-181.0
1969,197,-197.0
1970,167,-167.0
1971,170,-170.0
1972,173,-173.0
1973,166,-166.0
1974,164,-164.0
1975,157,-157.0
1976,118,-118.0
1977,155,-155.0
1978,195,-195.0
1979,162,-162.0
1980,153,-153.0
1981,148,-148.0
1982,146,-146.0
1983,152,-152.0
1984,176,-176.0
1985,86,-86.0
1986,150,-150.0
1987,84,-84.0
1988,96,-96.0
1989,160,-160.0
1990,161,-161.0
1991,156,-156.0
1992,89,-89.0
1993,95,-95.0
1994,147,-147.0
1995,147,-147.0
1996,90,-90.0
1997,157,-157.0
1998,100,-100.0
1999,143,-143.0
2000,89,-89.0
2001,92,-92.0
2002,158,-158.0
2003,193,-193.0
2004,167,-167.0
2005,159,-159.0
2006,155,-155.0
2007,85,-85.0
2008,179,-179.0
2009,96,-96.0
2010,157,-157.0
2011,152,-152.0
2012,144,-144.0
2013,86,-86.0
2014,98,-98.0
2015,184,-184.0
2016,91,-91.0
2017,164,-164.0
2018,141,-141.0
2019,188,-188.0
2020,151,-151.0
2021,142,-142.0
2022,146,-146.0
2023,113,-113.0
2024,145,-145.0
2025,163,-163.0
2026,104,-104.0
2027,147,-147.0
2028,165,-165.0
2029,153,-153.0
2030,93,-93.0
2031,179,-179.0
2032,145,-145.0
2033,153,-153.0
2034,153,-153.0
2035,172,-172.0
2036,86,-86.0
2037,152,-152.0
2038,93,-93.0
2039,174,-174.0
2040,107,-107.0
2041,91,-91.0
2042,84,-84.0
2043,86,-86.0
2044,152,-152.0
2045,87,-87.0
2046,144,-144.0
2047,141,-141.0
2048,91,-91.0
2049,89,-89.0
2050,167,-167.0
2051,163,-163.0
2052,169,-169.0
2053,85,-85.0
2054,176,-176.0
2055,88,-88.0
2056,93,-93.0
2057,89,-89.0
2058,88,-88.0
2059,151,-151.0
2060,154,-154.0
2061,149,-149.0
2062,128,-128.0
2063,147,-147.0
2064,149,-149.0
2065,116,-116.0
2066,149,-149.0
2067,115,-115.0
2068,115,-115.0
2069,145,-145.0
2070,115,-115.0
2071,113,-113.0
2072,113,-113.0
2073,116,-116.0
2074,117,-117.0
2075,118,-118.0
2076,125,-125.0
2077,164,-164.0
2078,111,-111.0
2079,115,-115.0
2080,120,-120.0
2081,169,-169.0
2082,121,-121.0
2083,125,-125.0
2084,131,-131.0
2085,127,-127.0
2086,111,-111.0
2087,152,-152.0
2088,122,-122.0
2089,150,-150.0
2090,116,-116.0
2091,158,-158.0
2092,116,-116.0
2093,155,-155.0
2094,119,-119.0
2095,118,-118.0
2096,121,-121.0
2097,147,-147.0
2098,137,-137.0
2099,134,-134.0
2100,127,-127.0
2101,146,-146.0
2102,95,-95.0
2103,157,-157.0
2104,156,-156.0
2105,120,-120.0
2106,109,-109.0
2107,150,-150.0
2108,117,-117.0
2109,149,-149.0
2110,154,-154.0
2111,160,-160.0
2112,148,-148.0
2113,146,-146.0
2114,158,-158.0
2115,95,-95.0
2116,94,-94.0
2117,100,-100.0
2118,101,-101.0
2119,152,-152.0
2120,136,-136.0
2121,148,-148.0
2122,145,-145.0
2123,114,-114.0
2124,84,-84.0
2125,153,-153.0
2126,150,-150.0
2127,147,-147.0
2128,158,-158.0
2129,144,-144.0
2130,145,-145.0
2131,153,-153.0
2132,114,-114.0
2133,109,-109.0
2134,106,-106.0
2135,85,-85.0
2136,163,-163.0
2137,110,-110.0
2138,106,-106.0
2139,142,-142.0
2140,88,-88.0
2141,88,-88.0
2142,146,-146.0
2143,148,-148.0
2144,147,-147.0
2145,91,-91.0
2146,153,-153.0
2147,152,-152.0
2148,110,-110.0
2149,149,-149.0
2150,156,-156.0
2151,115,-115.0
2152,139,-139.0
2153,98,-98.0
2154,95,-95.0
2155,143,-143.0
2156,148,-148.0
2157,85,-85.0
2158,102,-102.0
2159,87,-87.0
2160,99,-99.0
2161,152,-152.0
2162,88,-88.0
2163,109,-109.0
2164,120,-120.0
2165,108,-108.0
2166,100,-100.0
2167,103,-103.0
2168,159,-159.0
2169,117,-117.0
2170,147,-147.0
2171,109,-109.0
2172,145,-145.0
2173,119,-119.0
2174,119,-119.0
2175,136,-136.0
2176,113,-113.0
2177,153,-153.0
2178,126,-126.0
2179,113,-113.0
2180,117,-117.0
2181,155,-155.0
2182,166,-166.0
2183,173,-173.0
2184,118,-118.0
2185,121,-121.0
2186,163,-163.0
2187,112,-112.0
2188,114,-114.0
2189,178,-178.0
2190,138,-138.0
2191,112,-112.0
2192,110,-110.0
2193,111,-111.0
2194,160,-160.0
2195,104,-104.0
2196,114,-114.0
2197,85,-85.0
2198,92,-92.0
2199,200,-200.0
2200,163,-163.0
2201,110,-110.0
2202,117,-117.0
2203,200,-200.0
2204,168,-168.0
2205,109,-109.0
2206,109,-109.0
2207,95,-95.0
2208,114,-114.0
2209,96,-96.0
2210,162,-162.0
2211,85,-85.0
2212,112,-112.0
2213,135,-135.0
2214,89,-89.0
2215,157,-157.0
2216,113,-113.0
2217,109,-109.0
2218,112,-112.0
2219,108,-108.0
2220,108,-108.0
2221,139,-139.0
2222,132,-132.0
2223,164,-164.0
2224,103,-103.0
2225,156,-156.0
2226,153,-153.0
2227,166,-166.0
2228,156,-156.0
2229,157,-157.0
2230,147,-147.0
2231,155,-155.0
2232,148,-148.0
2233,117,-117.0
2234,157,-157.0
2235,150,-150.0
2236,163,-163.0
2237,155,-155.0
2238,200,-200.0
2239,152,-152.0
2240,176,-176.0
2241,185,-185.0
2242,154,-154.0
2243,158,-158.0
2244,147,-147.0
2245,95,-95.0
2246,101,-101.0
2247,156,-156.0
2248,164,-164.0
2249,108,-108.0
2250,162,-162.0
2251,152,-152.0
2252,185,-185.0
2253,124,-124.0
2254,200,-200.0
2255,164,-164.0
2256,169,-169.0
2257,154,-154.0
2258,105,-105.0
2259,86,-86.0
2260,91,-91.0
2261,177,-177.0
2262,163,-163.0
2263,88,-88.0
2264,154,-154.0
2265,152,-152.0
2266,84,-84.0
2267,151,-151.0
2268,165,-165.0
2269,200,-200.0
2270,108,-108.0
2271,85,-85.0
2272,156,-156.0
2273,86,-86.0
2274,147,-147.0
2275,88,-88.0
2276,200,-200.0
2277,99,-99.0
2278,98,-98.0
2279,159,-159.0
2280,152,-152.0
2281,147,-147.0
2282,161,-161.0
2283,169,-169.0
2284,112,-112.0
2285,158,-158.0
2286,168,-168.0
2287,157,-157.0
2288,139,-139.0
2289,175,-175.0
2290,119,-119.0
2291,88,-88.0
2292,200,-200.0
2293,159,-159.0
2294,162,-162.0
2295,169,-169.0
2296,155,-155.0
2297,137,-137.0
2298,124,-124.0
2299,146,-146.0
2300,109,-109.0
2301,168,-168.0
2302,156,-156.0
2303,149,-149.0
2304,155,-155.0
2305,158,-158.0
2306,167,-167.0
2307,89,-89.0
2308,186,-186.0
2309,165,-165.0
2310,156,-156.0
2311,155,-155.0
2312,200,-200.0
2313,87,-87.0
2314,200,-200.0
2315,101,-101.0
2316,100,-100.0
2317,118,-118.0
2318,134,-134.0
2319,200,-200.0
2320,200,-200.0
2321,161,-161.0
2322,161,-161.0
2323,161,-161.0
2324,113,-113.0
2325,200,-200.0
2326,112,-112.0
2327,160,-160.0
2328,153,-153.0
2329,146,-146.0
2330,115,-115.0
2331,158,-158.0
2332,88,-88.0
2333,86,-86.0
2334,91,-91.0
2335,158,-158.0
2336,85,-85.0
2337,172,-172.0
2338,161,-161.0
2339,107,-107.0
2340,109,-109.0
2341,117,-117.0
2342,128,-128.0
2343,114,-114.0
2344,131,-131.0
2345,175,-175.0
2346,109,-109.0
2347,103,-103.0
2348,167,-167.0
2349,93,-93.0
2350,158,-158.0
2351,152,-152.0
2352,155,-155.0
2353,196,-196.0
2354,157,-157.0
2355,158,-158.0
2356,124,-124.0
2357,162,-162.0
2358,98,-98.0
2359,169,-169.0
2360,122,-122.0
2361,164,-164.0
2362,143,-143.0
2363,85,-85.0
2364,104,-104.0
2365,92,-92.0
2366,160,-160.0
2367,162,-162.0
2368,85,-85.0
2369,84,-84.0
2370,97,-97.0
2371,89,-89.0
2372,175,-175.0
2373,86,-86.0
2374,157,-157.0
2375,200,-200.0
2376,156,-156.0
2377,105,-105.0
2378,159,-159.0
2379,152,-152.0
2380,161,-161.0
2381,164,-164.0
2382,158,-158.0
2383,159,-159.0
2384,157,-157.0
2385,89,-89.0
2386,181,-181.0
2387,112,-112.0
2388,153,-153.0
2389,104,-104.0
2390,157,-157.0
2391,196,-196.0
2392,180,-180.0
2393,154,-154.0
2394,155,-155.0
2395,88,-88.0
2396,103,-103.0
2397,147,-147.0
2398,155,-155.0
2399,83,-83.0
2400,200,-200.0
2401,89,-89.0
2402,90,-90.0
2403,151,-151.0
2404,154,-154.0
2405,148,-148.0
2406,155,-155.0
2407,181,-181.0
2408,85,-85.0
2409,141,-141.0
2410,158,-158.0
2411,147,-147.0
2412,107,-107.0
2413,163,-163.0
2414,147,-147.0
2415,153,-153.0
2416,94,-94.0
2417,155,-155.0
2418,172,-172.0
2419,154,-154.0
2420,145,-145.0
2421,109,-109.0
2422,94,-94.0
2423,154,-154.0
2424,161,-161.0
2425,152,-152.0
2426,101,-101.0
2427,168,-168.0
2428,170,-170.0
2429,124,-124.0
2430,102,-102.0
2431,170,-170.0
2432,156,-156.0
2433,157,-157.0
2434,106,-106.0
2435,155,-155.0
2436,169,-169.0
2437,169,-169.0
2438,94,-94.0
2439,165,-165.0
2440,200,-200.0
2441,163,-163.0
2442,126,-126.0
2443,146,-146.0
2444,182,-182.0
2445,181,-181.0
2446,173,-173.0
2447,95,-95.0
2448,86,-86.0
2449,110,-110.0
2450,95,-95.0
2451,179,-179.0
2452,125,-125.0
2453,161,-161.0
2454,171,-171.0
2455,98,-98.0
2456,156,-156.0
2457,160,-160.0
2458,99,-99.0
2459,161,-161.0
2460,172,-172.0
2461,150,-150.0
2462,93,-93.0
2463,109,-109.0
2464,92,-92.0
2465,145,-145.0
2466,114,-114.0
2467,171,-171.0
2468,142,-142.0
2469,172,-172.0
2470,108,-108.0
2471,193,-193.0
2472,116,-116.0
2473,151,-151.0
2474,93,-93.0
2475,149,-149.0
2476,154,-154.0
2477,148,-148.0
2478,155,-155.0
2479,162,-162.0
2480,160,-160.0
2481,163,-163.0
2482,152,-152.0
2483,148,-148.0
2484,166,-166.0
2485,163,-163.0
2486,92,-92.0
2487,99,-99.0
2488,100,-100.0
2489,154,-154.0
2490,151,-151.0
2491,147,-147.0
2492,157,-157.0
2493,94,-94.0
2494,93,-93.0
2495,109,-109.0
2496,156,-156.0
2497,121,-121.0
2498,166,-166.0
2499,87,-87.0
2500,151,-151.0
2501,115,-115.0
2502,161,-161.0
2503,153,-153.0
2504,140,-140.0
2505,148,-148.0
2506,104,-104.0
2507,151,-151.0
2508,152,-152.0
2509,101,-101.0
2510,101,-101.0
2511,164,-164.0
2512,161,-161.0
2513,164,-164.0
2514,160,-160.0
2515,162,-162.0
2516,166,-166.0
2517,90,-90.0
2518,99,-99.0
2519,160,-160.0
2520,162,-162.0
2521,152,-152.0
2522,157,-157.0
2523,94,-94.0
2524,151,-151.0
2525,157,-157.0
2526,156,-156.0
2527,143,-143.0
2528,152,-152.0
2529,147,-147.0
2530,149,-149.0
2531,152,-152.0
2532,161,-161.0
2533,161,-161.0
2534,157,-157.0
2535,84,-84.0
2536,157,-157.0
2537,157,-157.0
2538,100,-100.0
2539,169,-169.0
2540,91,-91.0
2541,160,-160.0
2542,165,-165.0
2543,150,-150.0
2544,112,-112.0
2545,162,-162.0
2546,157,-157.0
2547,84,-84.0
2548,108,-108.0
2549,146,-146.0
2550,166,-166.0
2551,114,-114.0
2552,154,-154.0
2553,153,-153.0
2554,164,-164.0
2555,107,-107.0
2556,200,-200.0
2557,149,-149.0
2558,200,-200.0
2559,154,-154.0
2560,178,-178.0
2561,175,-175.0
2562,158,-158.0
2563,182,-182.0
2564,154,-154.0
2565,200,-200.0
2566,182,-182.0
2567,140,-140.0
2568,181,-181.0
2569,91,-91.0
2570,160,-160.0
2571,95,-95.0
2572,159,-159.0
2573,87,-87.0
2574,99,-99.0
2575,200,-200.0
2576,178,-178.0
2577,96,-96.0
2578,107,-107.0
2579,160,-160.0
2580,163,-163.0
2581,160,-160.0
2582,157,-157.0
2583,193,-193.0
2584,169,-169.0
2585,92,-92.0
2586,144,-144.0
2587,98,-98.0
2588,163,-163.0
2589,134,-134.0
2590,166,-166.0
2591,174,-174.0
2592,161,-161.0
2593,93,-93.0
2594,150,-150.0
2595,144,-144.0
2596,161,-161.0
2597,157,-157.0
2598,168,-168.0
2599,158,-158.0
2600,91,-91.0
2601,171,-171.0
2602,160,-160.0
2603,100,-100.0
2604,157,-157.0
2605,151,-151.0
2606,162,-162.0
2607,164,-164.0
2608,145,-145.0
2609,162,-162.0
2610,164,-164.0
2611,198,-198.0
2612,150,-150.0
2613,90,-90.0
2614,117,-117.0
2615,152,-152.0
2616,172,-172.0
2617,158,-158.0
2618,114,-114.0
2619,160,-160.0
2620,90,-90.0
2621,159,-159.0
2622,170,-170.0
2623,161,-161.0
2624,87,-87.0
2625,199,-199.0
2626,162,-162.0
2627,159,-159.0
2628,95,-95.0
2629,139,-139.0
2630,95,-95.0
2631,152,-152.0
2632,165,-165.0
2633,157,-157.0
2634,161,-161.0
2635,96,-96.0
2636,147,-147.0
2637,150,-150.0
2638,88,-88.0
2639,164,-164.0
2640,189,-189.0
2641,168,-168.0
2642,200,-200.0
2643,88,-88.0
2644,148,-148.0
2645,151,-151.0
2646,113,-113.0
2647,174,-174.0
2648,92,-92.0
2649,185,-185.0
2650,158,-158.0
2651,95,-95.0
2652,88,-88.0
2653,158,-158.0
2654,169,-169.0
2655,158,-158.0
2656,181,-181.0
2657,200,-200.0
2658,200,-200.0
2659,176,-176.0
2660,161,-161.0
2661,161,-161.0
2662,113,-113.0
2663,161,-161.0
2664,92,-92.0
2665,177,-177.0
2666,158,-158.0
2667,92,-92.0
2668,200,-200.0
2669,153,-153.0
2670,188,-188.0
2671,166,-166.0
2672,99,-99.0
2673,197,-197.0
2674,88,-88.0
2675,143,-143.0
2676,152,-152.0
2677,96,-96.0
2678,151,-151.0
2679,148,-148.0
2680,154,-154.0
2681,149,-149.0
2682,144,-144.0
2683,106,-106.0
2684,144,-144.0
2685,152,-152.0
2686,161,-161.0
2687,163,-163.0
2688,94,-94.0
2689,158,-158.0
2690,102,-102.0
2691,105,-105.0
2692,200,-200.0
2693,149,-149.0
2694,180,-180.0
2695,156,-156.0
2696,169,-169.0
2697,96,-96.0
2698,86,-86.0
2699,97,-97.0
2700,108,-108.0
2701,101,-101.0
2702,160,-160.0
2703,150,-150.0
2704,140,-140.0
2705,171,-171.0
2706,178,-178.0
2707,99,-99.0
2708,95,-95.0
2709,162,-162.0
2710,200,-200.0
2711,186,-186.0
2712,144,-144.0
2713,154,-154.0
2714,151,-151.0
2715,200,-200.0
2716,158,-158.0
2717,200,-200.0
2718,191,-191.0
2719,93,-93.0
2720,157,-157.0
2721,200,-200.0
2722,156,-156.0
2723,176,-176.0
2724,162,-162.0
2725,151,-151.0
2726,160,-160.0
2727,182,-182.0
2728,92,-92.0
2729,145,-145.0
2730,139,-139.0
2731,200,-200.0
2732,172,-172.0
2733,161,-161.0
2734,156,-156.0
2735,156,-156.0
2736,188,-188.0
2737,159,-159.0
2738,128,-128.0
2739,166,-166.0
2740,104,-104.0
2741,98,-98.0
2742,91,-91.0
2743,110,-110.0
2744,171,-171.0
2745,148,-148.0
2746,157,-157.0
2747,136,-136.0
2748,123,-123.0
2749,124,-124.0
2750,128,-128.0
2751,112,-112.0
2752,170,-170.0
2753,146,-146.0
2754,87,-87.0
2755,91,-91.0
2756,112,-112.0
2757,153,-153.0
2758,147,-147.0
2759,132,-132.0
2760,86,-86.0
2761,124,-124.0
2762,151,-151.0
2763,157,-157.0
2764,158,-158.0
2765,161,-161.0
2766,150,-150.0
2767,117,-117.0
2768,161,-161.0
2769,158,-158.0
2770,155,-155.0
2771,118,-118.0
2772,186,-186.0
2773,150,-150.0
2774,179,-179.0
2775,116,-116.0
2776,86,-86.0
2777,177,-177.0
2778,159,-159.0
2779,160,-160.0
2780,164,-164.0
2781,87,-87.0
2782,115,-115.0
2783,117,-117.0
2784,200,-200.0
2785,85,-85.0
2786,106,-106.0
2787,89,-89.0
2788,166,-166.0
2789,153,-153.0
2790,185,-185.0
2791,144,-144.0
2792,117,-117.0
2793,158,-158.0
2794,162,-162.0
2795,200,-200.0
2796,150,-150.0
2797,112,-112.0
2798,108,-108.0
2799,162,-162.0
2800,125,-125.0
2801,157,-157.0
2802,159,-159.0
2803,104,-104.0
2804,184,-184.0
2805,113,-113.0
2806,166,-166.0
2807,113,-113.0
2808,117,-117.0
2809,162,-162.0
2810,114,-114.0
2811,111,-111.0
2812,97,-97.0
2813,121,-121.0
2814,154,-154.0
2815,159,-159.0
2816,151,-151.0
2817,122,-122.0
2818,111,-111.0
2819,104,-104.0
2820,159,-159.0
2821,95,-95.0
2822,157,-157.0
2823,98,-98.0
2824,157,-157.0
2825,200,-200.0
2826,200,-200.0
2827,118,-118.0
2828,156,-156.0
2829,84,-84.0
2830,163,-163.0
2831,110,-110.0
2832,158,-158.0
2833,161,-161.0
2834,156,-156.0
2835,172,-172.0
2836,112,-112.0
2837,127,-127.0
2838,200,-200.0
2839,157,-157.0
2840,159,-159.0
2841,165,-165.0
2842,151,-151.0
2843,94,-94.0
2844,100,-100.0
2845,159,-159.0
2846,200,-200.0
2847,157,-157.0
2848,165,-165.0
2849,160,-160.0
2850,162,-162.0
2851,160,-160.0
2852,160,-160.0
2853,108,-108.0
2854,165,-165.0
2855,124,-124.0
2856,167,-167.0
2857,98,-98.0
2858,164,-164.0
2859,200,-200.0
2860,150,-150.0
2861,200,-200.0
2862,114,-114.0
2863,162,-162.0
2864,107,-107.0
2865,109,-109.0
2866,108,-108.0
2867,158,-158.0
2868,158,-158.0
2869,91,-91.0
2870,90,-90.0
2871,115,-115.0
2872,158,-158.0
2873,108,-108.0
2874,152,-152.0
2875,113,-113.0
2876,114,-114.0
2877,153,-153.0
2878,161,-161.0
2879,162,-162.0
2880,95,-95.0
2881,111,-111.0
2882,155,-155.0
2883,152,-152.0
2884,91,-91.0
2885,146,-146.0
2886,113,-113.0
2887,107,-107.0
2888,112,-112.0
2889,102,-102.0
2890,89,-89.0
2891,165,-165.0
2892,108,-108.0
2893,89,-89.0
2894,95,-95.0
2895,109,-109.0
2896,113,-113.0
2897,84,-84.0
2898,156,-156.0
2899,116,-116.0
2900,122,-122.0
2901,93,-93.0
2902,88,-88.0
2903,164,-164.0
2904,133,-133.0
2905,128,-128.0
2906,105,-105.0
2907,114,-114.0
2908,87,-87.0
2909,164,-164.0
2910,154,-154.0
2911,92,-92.0
2912,155,-155.0
2913,158,-158.0
2914,113,-113.0
2915,151,-151.0
2916,157,-157.0
2917,159,-159.0
2918,109,-109.0
2919,149,-149.0
2920,160,-160.0
2921,111,-111.0
2922,156,-156.0
2923,156,-156.0
2924,92,-92.0
2925,92,-92.0
2926,121,-121.0
2927,155,-155.0
2928,92,-92.0
2929,139,-139.0
2930,146,-146.0
2931,87,-87.0
2932,145,-145.0
2933,96,-96.0
2934,179,-179.0
2935,85,-85.0
2936,123,-123.0
2937,95,-95.0
2938,158,-158.0
2939,94,-94.0
2940,150,-150.0
2941,107,-107.0
2942,86,-86.0
2943,168,-168.0
2944,163,-163.0
2945,183,-183.0
2946,86,-86.0
2947,147,-147.0
2948,108,-108.0
2949,171,-171.0
2950,170,-170.0
2951,169,-169.0
2952,148,-148.0
2953,177,-177.0
2954,155,-155.0
2955,86,-86.0
2956,162,-162.0
2957,157,-157.0
2958,86,-86.0
2959,169,-169.0
2960,154,-154.0
2961,146,-146.0
2962,114,-114.0
2963,91,-91.0
2964,152,-152.0
2965,196,-196.0
2966,158,-158.0
2967,150,-150.0
2968,158,-158.0
2969,161,-161.0
2970,97,-97.0
2971,147,-147.0
2972,158,-158.0
2973,180,-180.0
2974,148,-148.0
2975,146,-146.0
2976,164,-164.0
2977,156,-156.0
2978,145,-145.0
2979,167,-167.0
2980,179,-179.0
2981,92,-92.0
2982,104,-104.0
2983,90,-90.0
2984,109,-109.0
2985,109,-109.0
2986,98,-98.0
2987,116,-116.0
2988,159,-159.0
2989,165,-165.0
2990,145,-145.0
2991,184,-184.0
2992,145,-145.0
2993,116,-116.0
2994,112,-112.0
2995,148,-148.0
2996,106,-106.0
2997,153,-153.0
2998,85,-85.0
2999,154,-154.0
3000,151,-151.0
3001,145,-145.0
3002,148,-148.0
3003,154,-154.0
3004,106,-106.0
3005,123,-123.0
3006,108,-108.0
3007,121,-121.0
3008,145,-145.0
3009,100,-100.0
3010,159,-159.0
3011,98,-98.0
3012,86,-86.0
3013,88,-88.0
3014,145,-145.0
3015,92,-92.0
3016,110,-110.0
3017,109,-109.0
3018,164,-164.0
3019,121,-121.0
3020,106,-106.0
3021,145,-145.0
3022,155,-155.0
3023,83,-83.0
3024,153,-153.0
3025,151,-151.0
3026,116,-116.0
3027,148,-148.0
3028,146,-146.0
3029,148,-148.0
3030,89,-89.0
3031,148,-148.0
3032,90,-90.0
3033,151,-151.0
3034,155,-155.0
3035,150,-150.0
3036,159,-159.0
3037,143,-143.0
3038,150,-150.0
3039,143,-143.0
3040,145,-145.0
3041,158,-158.0
3042,147,-147.0
3043,108,-108.0
3044,106,-106.0
3045,87,-87.0
3046,149,-149.0
3047,160,-160.0
3048,145,-145.0
3049,165,-165.0
3050,95,-95.0
3051,106,-106.0
3052,154,-154.0
3053,103,-103.0
3054,104,-104.0
3055,94,-94.0
3056,109,-109.0
3057,160,-160.0
3058,150,-150.0
3059,108,-108.0
3060,109,-109.0
3061,85,-85.0
3062,107,-107.0
3063,107,-107.0
3064,103,-103.0
3065,95,-95.0
3066,163,-163.0
3067,107,-107.0
3068,153,-153.0
3069,89,-89.0
3070,133,-133.0
3071,167,-167.0
3072,140,-140.0
3073,83,-83.0
3074,108,-108.0
3075,153,-153.0
3076,86,-86.0
3077,153,-153.0
3078,166,-166.0
3079,106,-106.0
3080,157,-157.0
3081,155,-155.0
3082,162,-162.0
3083,103,-103.0
3084,109,-109.0
3085,165,-165.0
3086,93,-93.0
3087,154,-154.0
3088,114,-114.0
3089,108,-108.0
3090,160,-160.0
3091,113,-113.0
3092,157,-157.0
3093,104,-104.0
3094,91,-91.0
3095,158,-158.0
3096,155,-155.0
3097,89,-89.0
3098,87,-87.0
3099,167,-167.0
3100,162,-162.0
3101,153,-153.0
3102,91,-91.0
3103,85,-85.0
3104,122,-122.0
3105,85,-85.0
3106,95,-95.0
3107,200,-200.0
3108,167,-167.0
3109,174,-174.0
3110,161,-161.0
3111,117,-117.0
3112,200,-200.0
3113,153,-153.0
3114,149,-149.0
3115,157,-157.0
3116,90,-90.0
3117,161,-161.0
3118,157,-157.0
3119,151,-151.0
3120,185,-185.0
3121,151,-151.0
3122,143,-143.0
3123,148,-148.0
3124,150,-150.0
3125,144,-144.0
3126,151,-151.0
3127,145,-145.0
3128,120,-120.0
3129,150,-150.0
3130,156,-156.0
3131,142,-142.0
3132,164,-164.0
3133,154,-154.0
3134,165,-165.0
3135,149,-149.0
3136,115,-115.0
3137,138,-138.0
3138,153,-153.0
3139,138,-138.0
3140,94,-94.0
3141,137,-137.0
3142,153,-153.0
3143,143,-143.0
3144,159,-159.0
3145,145,-145.0
3146,142,-142.0
3147,111,-111.0
3148,114,-114.0
3149,153,-153.0
3150,138,-138.0
3151,184,-184.0
3152,170,-170.0
3153,186,-186.0
3154,123,-123.0
3155,115,-115.0
3156,162,-162.0
3157,146,-146.0
3158,150,-150.0
3159,113,-113.0
3160,145,-145.0
3161,146,-146.0
3162,148,-148.0
3163,149,-149.0
3164,125,-125.0
3165,113,-113.0
3166,140,-140.0
3167,139,-139.0
3168,149,-149.0
3169,200,-200.0
3170,118,-118.0
3171,127,-127.0
3172,124,-124.0
3173,111,-111.0
3174,163,-163.0
3175,154,-154.0
3176,200,-200.0
3177,141,-141.0
3178,153,-153.0
3179,139,-139.0
3180,148,-148.0
3181,145,-145.0
3182,130,-130.0
3183,141,-141.0
3184,121,-121.0
3185,122,-122.0
3186,117,-117.0
3187,145,-145.0
3188,118,-118.0
3189,142,-142.0
3190,141,-141.0
3191,145,-145.0
3192,132,-132.0
3193,145,-145.0
3194,117,-117.0
3195,200,-200.0
3196,195,-195.0
3197,127,-127.0
3198,149,-149.0
3199,123,-123.0
3200,116,-116.0
3201,145,-145.0
3202,149,-149.0
3203,112,-112.0
3204,200,-200.0
3205,126,-126.0
3206,117,-117.0
3207,122,-122.0
3208,200,-200.0
3209,200,-200.0
3210,167,-167.0
3211,127,-127.0
3212,121,-121.0
3213,147,-147.0
3214,159,-159.0
3215,169,-169.0
3216,159,-159.0
3217,147,-147.0
3218,167,-167.0
3219,196,-196.0
3220,160,-160.0
3221,155,-155.0
3222,154,-154.0
3223,102,-102.0
3224,95,-95.0
3225,200,-200.0
3226,162,-162.0
3227,159,-159.0
3228,177,-177.0
3229,162,-162.0
3230,162,-162.0
3231,145,-145.0
3232,153,-153.0
3233,127,-127.0
3234,139,-139.0
3235,144,-144.0
3236,153,-153.0
3237,165,-165.0
3238,173,-173.0
3239,157,-157.0
3240,156,-156.0
3241,153,-153.0
3242,162,-162.0
3243,200,-200.0
3244,166,-166.0
3245,144,-144.0
3246,155,-155.0
3247,155,-155.0
3248,152,-152.0
3249,131,-131.0
3250,137,-137.0
3251,200,-200.0
3252,154,-154.0
3253,198,-198.0
3254,128,-128.0
3255,164,-164.0
3256,115,-115.0
3257,155,-155.0
3258,144,-144.0
3259,114,-114.0
3260,102,-102.0
3261,111,-111.0
3262,109,-109.0
3263,116,-116.0
3264,116,-116.0
3265,118,-118.0
3266,109,-109.0
3267,168,-168.0
3268,158,-158.0
3269,119,-119.0
3270,117,-117.0
3271,200,-200.0
3272,115,-115.0
3273,125,-125.0
3274,161,-161.0
3275,134,-134.0
3276,126,-126.0
3277,200,-200.0
3278,110,-110.0
3279,126,-126.0
3280,124,-124.0
3281,169,-169.0
3282,165,-165.0
3283,163,-163.0
3284,169,-169.0
3285,128,-128.0
3286,157,-157.0
3287,167,-167.0
3288,164,-164.0
3289,116,-116.0
3290,161,-161.0
3291,200,-200.0
3292,173,-173.0
3293,159,-159.0
3294,155,-155.0
3295,161,-161.0
3296,122,-122.0
3297,123,-123.0
3298,126,-126.0
3299,167,-167.0
3300,87,-87.0
3301,121,-121.0
3302,95,-95.0
3303,157,-157.0
3304,170,-170.0
3305,124,-124.0
3306,156,-156.0
3307,118,-118.0
3308,118,-118.0
3309,119,-119.0
3310,196,-196.0
3311,117,-117.0
3312,114,-114.0
3313,116,-116.0
3314,156,-156.0
3315,167,-167.0
3316,93,-93.0
3317,121,-121.0
3318,125,-125.0
3319,150,-150.0
3320,155,-155.0
3321,167,-167.0
3322,167,-167.0
3323,199,-199.0
3324,92,-92.0
3325,163,-163.0
3326,186,-186.0
3327,110,-110.0
3328,147,-147.0
3329,97,-97.0
3330,160,-160.0
3331,159,-159.0
3332,116,-116.0
3333,119,-119.0
3334,92,-92.0
3335,157,-157.0
3336,151,-151.0
3337,112,-112.0
3338,168,-168.0
3339,120,-120.0
3340,97,-97.0
3341,121,-121.0
3342,160,-160.0
3343,120,-120.0
3344,120,-120.0
3345,116,-116.0
3346,140,-140.0
3347,147,-147.0
3348,165,-165.0
3349,92,-92.0
3350,154,-154.0
3351,156,-156.0
3352,186,-186.0
3353,152,-152.0
3354,146,-146.0
3355,93,-93.0
3356,124,-124.0
3357,113,-113.0
3358,100,-100.0
3359,149,-149.0
3360,179,-179.0
3361,150,-150.0
3362,138,-138.0
3363,152,-152.0
3364,140,-140.0
3365,149,-149.0
3366,161,-161.0
3367,155,-155.0
3368,119,-119.0
3369,102,-102.0
3370,123,-123.0
3371,162,-162.0
3372,149,-149.0
3373,109,-109.0
3374,152,-152.0
3375,144,-144.0
3376,154,-154.0
3377,138,-138.0
3378,176,-176.0
3379,86,-86.0
3380,152,-152.0
3381,88,-88.0
3382,153,-153.0
3383,152,-152.0
3384,167,-167.0
3385,99,-99.0
3386,142,-142.0
3387,113,-113.0
3388,105,-105.0
3389,178,-178.0
3390,137,-137.0
3391,111,-111.0
3392,192,-192.0
3393,189,-189.0
3394,139,-139.0
3395,143,-143.0
3396,100,-100.0
3397,131,-131.0
3398,159,-159.0
3399,142,-142.0
3400,127,-127.0
3401,163,-163.0
3402,170,-170.0
3403,151,-151.0
3404,156,-156.0
3405,147,-147.0
3406,150,-150.0
3407,150,-150.0
3408,146,-146.0
3409,147,-147.0
3410,145,-145.0
3411,145,-145.0
3412,150,-150.0
3413,200,-200.0
3414,157,-157.0
3415,144,-144.0
3416,148,-148.0
3417,143,-143.0
3418,147,-147.0
3419,147,-147.0
3420,145,-145.0
3421,177,-177.0
3422,153,-153.0
3423,150,-150.0
3424,94,-94.0
3425,144,-144.0
3426,149,-149.0
3427,146,-146.0
3428,150,-150.0
3429,151,-151.0
3430,149,-149.0
3431,200,-200.0
3432,161,-161.0
3433,192,-192.0
3434,173,-173.0
3435,188,-188.0
3436,159,-159.0
3437,183,-183.0
3438,183,-183.0
3439,143,-143.0
3440,121,-121.0
3441,152,-152.0
3442,156,-156.0
3443,153,-153.0
3444,146,-146.0
3445,144,-144.0
3446,200,-200.0
3447,144,-144.0
3448,200,-200.0
3449,144,-144.0
3450,143,-143.0
3451,142,-142.0
3452,151,-151.0
3453,200,-200.0
3454,121,-121.0
3455,122,-122.0
3456,150,-150.0
3457,124,-124.0
3458,112,-112.0
3459,154,-154.0
3460,154,-154.0
3461,147,-147.0
3462,107,-107.0
3463,121,-121.0
3464,126,-126.0
3465,170,-170.0
3466,88,-88.0
3467,200,-200.0
3468,200,-200.0
3469,145,-145.0
3470,98,-98.0
3471,97,-97.0
3472,143,-143.0
3473,154,-154.0
3474,144,-144.0
3475,91,-91.0
3476,158,-158.0
3477,156,-156.0
3478,146,-146.0
3479,200,-200.0
3480,113,-113.0
3481,142,-142.0
3482,154,-154.0
3483,144,-144.0
3484,144,-144.0
3485,200,-200.0
3486,86,-86.0
3487,168,-168.0
3488,122,-122.0
3489,152,-152.0
3490,200,-200.0
3491,161,-161.0
3492,88,-88.0
3493,95,-95.0
3494,97,-97.0
3495,157,-157.0
3496,155,-155.0
3497,165,-165.0
3498,125,-125.0
3499,97,-97.0
3500,176,-176.0
3501,200,-200.0
3502,159,-159.0
3503,177,-177.0
3504,200,-200.0
3505,197,-197.0
3506,185,-185.0
3507,146,-146.0
3508,157,-157.0
3509,167,-167.0
3510,88,-88.0
3511,170,-170.0
3512,156,-156.0
3513,166,-166.0
3514,89,-89.0
3515,150,-150.0
3516,155,-155.0
3517,152,-152.0
3518,157,-157.0
3519,122,-122.0
3520,125,-125.0
3521,200,-200.0
3522,152,-152.0
3523,87,-87.0
3524,177,-177.0
3525,159,-159.0
3526,114,-114.0
3527,151,-151.0
3528,95,-95.0
3529,149,-149.0
3530,200,-200.0
3531,99,-99.0
3532,158,-158.0
3533,200,-200.0
3534,90,-90.0
3535,89,-89.0
3536,150,-150.0
3537,200,-200.0
3538,89,-89.0
3539,152,-152.0
3540,105,-105.0
3541,190,-190.0
3542,100,-100.0
3543,169,-169.0
3544,151,-151.0
3545,98,-98.0
3546,167,-167.0
3547,138,-138.0
3548,92,-92.0
3549,181,-181.0
3550,109,-109.0
3551,103,-103.0
3552,192,-192.0
3553,145,-145.0
3554,138,-138.0
3555,101,-101.0
3556,152,-152.0
3557,200,-200.0
3558,159,-159.0
3559,106,-106.0
3560,148,-148.0
3561,100,-100.0
3562,200,-200.0
3563,158,-158.0
3564,172,-172.0
3565,148,-148.0
3566,150,-150.0
3567,142,-142.0
3568,141,-141.0
3569,140,-140.0
3570,143,-143.0
3571,141,-141.0
3572,128,-128.0
3573,200,-200.0
3574,153,-153.0
3575,100,-100.0
3576,96,-96.0
3577,154,-154.0
3578,153,-153.0
3579,144,-144.0
3580,154,-154.0
3581,148,-148.0
3582,200,-200.0
3583,147,-147.0
3584,156,-156.0
3585,160,-160.0
3586,146,-146.0
3587,200,-200.0
3588,153,-153.0
3589,146,-146.0
3590,156,-156.0
3591,200,-200.0
3592,200,-200.0
3593,200,-200.0
3594,146,-146.0
3595,145,-145.0
3596,200,-200.0
3597,149,-149.0
3598,146,-146.0
3599,200,-200.0
3600,200,-200.0
3601,151,-151.0
3602,149,-149.0
3603,149,-149.0
3604,178,-178.0
3605,148,-148.0
3606,155,-155.0
3607,143,-143.0
3608,116,-116.0
3609,95,-95.0
3610,146,-146.0
3611,103,-103.0
3612,144,-144.0
3613,149,-149.0
3614,154,-154.0
3615,150,-150.0
3616,100,-100.0
3617,137,-137.0
3618,94,-94.0
3619,200,-200.0
3620,144,-144.0
3621,93,-93.0
3622,152,-152.0
3623,96,-96.0
3624,145,-145.0
3625,93,-93.0
3626,106,-106.0
3627,106,-106.0
3628,200,-200.0
3629,144,-144.0
3630,105,-105.0
3631,159,-159.0
3632,148,-148.0
3633,149,-149.0
3634,112,-112.0
3635,158,-158.0
3636,92,-92.0
3637,151,-151.0
3638,200,-200.0
3639,148,-148.0
3640,91,-91.0
3641,200,-200.0
3642,140,-140.0
3643,155,-155.0
3644,143,-143.0
3645,149,-149.0
3646,200,-200.0
3647,160,-160.0
3648,159,-159.0
3649,96,-96.0
3650,148,-148.0
3651,146,-146.0
3652,152,-152.0
3653,145,-145.0
3654,163,-163.0
3655,200,-200.0
3656,89,-89.0
3657,196,-196.0
3658,140,-140.0
3659,138,-138.0
3660,141,-141.0
3661,188,-188.0
3662,178,-178.0
3663,156,-156.0
3664,150,-150.0
3665,150,-150.0
3666,149,-149.0
3667,115,-115.0
3668,165,-165.0
3669,157,-157.0
3670,145,-145.0
3671,88,-88.0
3672,172,-172.0
3673,189,-189.0
3674,198,-198.0
3675,160,-160.0
3676,159,-159.0
3677,145,-145.0
3678,141,-141.0
3679,95,-95.0
3680,141,-141.0
3681,97,-97.0
3682,114,-114.0
3683,183,-183.0
3684,149,-149.0
3685,200,-200.0
3686,154,-154.0
3687,200,-200.0
3688,91,-91.0
3689,88,-88.0
3690,151,-151.0
3691,182,-182.0
3692,158,-158.0
3693,88,-88.0
3694,149,-149.0
3695,101,-101.0
3696,140,-140.0
3697,92,-92.0
3698,91,-91.0
3699,151,-151.0
3700,90,-90.0
3701,184,-184.0
3702,96,-96.0
3703,155,-155.0
3704,200,-200.0
3705,94,-94.0
3706,97,-97.0
3707,200,-200.0
3708,166,-166.0
3709,90,-90.0
3710,88,-88.0
3711,162,-162.0
3712,154,-154.0
3713,150,-150.0
3714,114,-114.0
3715,198,-198.0
3716,89,-89.0
3717,91,-91.0
3718,98,-98.0
3719,95,-95.0
3720,154,-154.0
3721,145,-145.0
3722,200,-200.0
3723,147,-147.0
3724,100,-100.0
3725,158,-158.0
3726,91,-91.0
3727,121,-121.0
3728,149,-149.0
3729,159,-159.0
3730,152,-152.0
3731,90,-90.0
3732,104,-104.0
3733,93,-93.0
3734,152,-152.0
3735,148,-148.0
3736,171,-171.0
3737,151,-151.0
3738,92,-92.0
3739,92,-92.0
3740,181,-181.0
3741,180,-180.0
3742,151,-151.0
3743,155,-155.0
3744,148,-148.0
3745,200,-200.0
3746,101,-101.0
3747,146,-146.0
3748,153,-153.0
3749,142,-142.0
3750,153,-153.0
