episodes,steps,rewards
0,200,-200.0
1,200,-200.0
2,200,-200.0
3,200,-200.0
4,200,-200.0
5,200,-200.0
6,200,-200.0
7,200,-200.0
8,200,-200.0
9,200,-200.0
10,200,-200.0
11,200,-200.0
12,200,-200.0
13,200,-200.0
14,200,-200.0
15,200,-200.0
16,200,-200.0
17,200,-200.0
18,200,-200.0
19,200,-200.0
20,200,-200.0
21,200,-200.0
22,200,-200.0
23,200,-200.0
24,200,-200.0
25,200,-200.0
26,200,-200.0
27,200,-200.0
28,200,-200.0
29,200,-200.0
30,200,-200.0
31,200,-200.0
32,200,-200.0
33,200,-200.0
34,200,-200.0
35,200,-200.0
36,200,-200.0
37,200,-200.0
38,200,-200.0
39,200,-200.0
40,200,-200.0
41,200,-200.0
42,200,-200.0
43,200,-200.0
44,200,-200.0
45,153,-153.0
46,200,-200.0
47,200,-200.0
48,200,-200.0
49,200,-200.0
50,142,-142.0
51,167,-167.0
52,200,-200.0
53,200,-200.0
54,200,-200.0
55,173,-173.0
56,200,-200.0
57,132,-132.0
58,127,-127.0
59,141,-141.0
60,132,-132.0
61,145,-145.0
62,156,-156.0
63,153,-153.0
64,160,-160.0
65,157,-157.0
66,184,-184.0
67,139,-139.0
68,155,-155.0
69,182,-182.0
70,200,-200.0
71,181,-181.0
72,141,-141.0
73,148,-148.0
74,145,-145.0
75,172,-172.0
76,158,-158.0
77,148,-148.0
78,156,-156.0
79,200,-200.0
80,200,-200.0
81,160,-160.0
82,156,-156.0
83,200,-200.0
84,172,-172.0
85,200,-200.0
86,200,-200.0
87,172,-172.0
88,200,-200.0
89,195,-195.0
90,171,-171.0
91,166,-166.0
92,200,-200.0
93,145,-145.0
94,182,-182.0
95,145,-145.0
96,147,-147.0
97,183,-183.0
98,138,-138.0
99,195,-195.0
100,159,-159.0
101,173,-173.0
102,200,-200.0
103,180,-180.0
104,158,-158.0
105,142,-142.0
106,149,-149.0
107,150,-150.0
108,180,-180.0
109,200,-200.0
110,94,-94.0
111,142,-142.0
112,193,-193.0
113,141,-141.0
114,151,-151.0
115,154,-154.0
116,129,-129.0
117,160,-160.0
118,177,-177.0
119,145,-145.0
120,153,-153.0
121,146,-146.0
122,151,-151.0
123,200,-200.0
124,117,-117.0
125,171,-171.0
126,148,-148.0
127,197,-197.0
128,181,-181.0
129,122,-122.0
130,140,-140.0
131,200,-200.0
132,142,-142.0
133,111,-111.0
134,124,-124.0
135,120,-120.0
136,166,-166.0
137,200,-200.0
138,139,-139.0
139,200,-200.0
140,200,-200.0
141,200,-200.0
142,120,-120.0
143,181,-181.0
144,153,-153.0
145,126,-126.0
146,89,-89.0
147,143,-143.0
148,150,-150.0
149,154,-154.0
150,155,-155.0
151,94,-94.0
152,157,-157.0
153,138,-138.0
154,158,-158.0
155,152,-152.0
156,162,-162.0
157,176,-176.0
158,146,-146.0
159,150,-150.0
160,151,-151.0
161,134,-134.0
162,129,-129.0
163,143,-143.0
164,156,-156.0
165,200,-200.0
166,138,-138.0
167,200,-200.0
168,163,-163.0
169,179,-179.0
170,152,-152.0
171,131,-131.0
172,151,-151.0
173,200,-200.0
174,173,-173.0
175,149,-149.0
176,187,-187.0
177,143,-143.0
178,144,-144.0
179,140,-140.0
180,153,-153.0
181,158,-158.0
182,119,-119.0
183,150,-150.0
184,143,-143.0
185,170,-170.0
186,149,-149.0
187,96,-96.0
188,89,-89.0
189,200,-200.0
190,159,-159.0
191,154,-154.0
192,147,-147.0
193,161,-161.0
194,158,-158.0
195,148,-148.0
196,113,-113.0
197,85,-85.0
198,131,-131.0
199,154,-154.0
200,191,-191.0
201,141,-141.0
202,87,-87.0
203,146,-146.0
204,146,-146.0
205,135,-135.0
206,90,-90.0
207,144,-144.0
208,152,-152.0
209,165,-165.0
210,167,-167.0
211,151,-151.0
212,110,-110.0
213,145,-145.0
214,109,-109.0
215,144,-144.0
216,129,-129.0
217,91,-91.0
218,150,-150.0
219,89,-89.0
220,158,-158.0
221,126,-126.0
222,140,-140.0
223,152,-152.0
224,120,-120.0
225,191,-191.0
226,144,-144.0
227,144,-144.0
228,87,-87.0
229,162,-162.0
230,146,-146.0
231,117,-117.0
232,200,-200.0
233,120,-120.0
234,200,-200.0
235,157,-157.0
236,186,-186.0
237,116,-116.0
238,97,-97.0
239,121,-121.0
240,142,-142.0
241,146,-146.0
242,150,-150.0
243,129,-129.0
244,124,-124.0
245,116,-116.0
246,140,-140.0
247,143,-143.0
248,144,-144.0
249,146,-146.0
250,139,-139.0
251,146,-146.0
252,142,-142.0
253,101,-101.0
254,107,-107.0
255,143,-143.0
256,144,-144.0
257,138,-138.0
258,86,-86.0
259,85,-85.0
260,110,-110.0
261,122,-122.0
262,143,-143.0
263,106,-106.0
264,110,-110.0
265,96,-96.0
266,84,-84.0
267,152,-152.0
268,137,-137.0
269,142,-142.0
270,92,-92.0
271,166,-166.0
272,102,-102.0
273,151,-151.0
274,147,-147.0
275,117,-117.0
276,151,-151.0
277,115,-115.0
278,119,-119.0
279,113,-113.0
280,88,-88.0
281,92,-92.0
282,144,-144.0
283,105,-105.0
284,100,-100.0
285,138,-138.0
286,144,-144.0
287,200,-200.0
288,150,-150.0
289,172,-172.0
290,107,-107.0
291,88,-88.0
292,109,-109.0
293,113,-113.0
294,109,-109.0
295,121,-121.0
296,140,-140.0
297,90,-90.0
298,106,-106.0
299,107,-107.0
300,109,-109.0
301,153,-153.0
302,110,-110.0
303,111,-111.0
304,85,-85.0
305,180,-180.0
306,106,-106.0
307,200,-200.0
308,146,-146.0
309,144,-144.0
310,86,-86.0
311,107,-107.0
312,108,-108.0
313,90,-90.0
314,139,-139.0
315,88,-88.0
316,139,-139.0
317,107,-107.0
318,90,-90.0
319,140,-140.0
320,89,-89.0
321,119,-119.0
322,155,-155.0
323,86,-86.0
324,139,-139.0
325,100,-100.0
326,115,-115.0
327,165,-165.0
328,87,-87.0
329,139,-139.0
330,111,-111.0
331,128,-128.0
332,87,-87.0
333,94,-94.0
334,139,-139.0
335,95,-95.0
336,172,-172.0
337,138,-138.0
338,100,-100.0
339,143,-143.0
340,156,-156.0
341,185,-185.0
342,143,-143.0
343,116,-116.0
344,89,-89.0
345,142,-142.0
346,88,-88.0
347,144,-144.0
348,87,-87.0
349,110,-110.0
350,95,-95.0
351,138,-138.0
352,152,-152.0
353,87,-87.0
354,137,-137.0
355,166,-166.0
356,150,-150.0
357,158,-158.0
358,151,-151.0
359,179,-179.0
360,106,-106.0
361,113,-113.0
362,146,-146.0
363,143,-143.0
364,93,-93.0
365,102,-102.0
366,140,-140.0
367,91,-91.0
368,138,-138.0
369,139,-139.0
370,147,-147.0
371,91,-91.0
372,144,-144.0
373,167,-167.0
374,145,-145.0
375,143,-143.0
376,139,-139.0
377,138,-138.0
378,140,-140.0
379,148,-148.0
380,146,-146.0
381,109,-109.0
382,92,-92.0
383,140,-140.0
384,87,-87.0
385,145,-145.0
386,159,-159.0
387,148,-148.0
388,91,-91.0
389,109,-109.0
390,139,-139.0
391,140,-140.0
392,154,-154.0
393,146,-146.0
394,137,-137.0
395,137,-137.0
396,148,-148.0
397,84,-84.0
398,92,-92.0
399,97,-97.0
400,91,-91.0
401,104,-104.0
402,96,-96.0
403,143,-143.0
404,88,-88.0
405,93,-93.0
406,162,-162.0
407,141,-141.0
408,109,-109.0
409,143,-143.0
410,156,-156.0
411,167,-167.0
412,138,-138.0
413,104,-104.0
414,105,-105.0
415,95,-95.0
416,108,-108.0
417,144,-144.0
418,144,-144.0
419,149,-149.0
420,144,-144.0
421,110,-110.0
422,127,-127.0
423,99,-99.0
424,120,-120.0
425,187,-187.0
426,151,-151.0
427,108,-108.0
428,94,-94.0
429,99,-99.0
430,110,-110.0
431,105,-105.0
432,170,-170.0
433,111,-111.0
434,133,-133.0
435,142,-142.0
436,145,-145.0
437,142,-142.0
438,96,-96.0
439,129,-129.0
440,100,-100.0
441,88,-88.0
442,155,-155.0
443,144,-144.0
444,147,-147.0
445,142,-142.0
446,144,-144.0
447,143,-143.0
448,97,-97.0
449,149,-149.0
450,185,-185.0
451,146,-146.0
452,147,-147.0
453,151,-151.0
454,145,-145.0
455,110,-110.0
456,148,-148.0
457,151,-151.0
458,154,-154.0
459,141,-141.0
460,100,-100.0
461,145,-145.0
462,89,-89.0
463,146,-146.0
464,109,-109.0
465,152,-152.0
466,106,-106.0
467,146,-146.0
468,168,-168.0
469,144,-144.0
470,144,-144.0
471,163,-163.0
472,96,-96.0
473,96,-96.0
474,144,-144.0
475,157,-157.0
476,143,-143.0
477,94,-94.0
478,165,-165.0
479,84,-84.0
480,180,-180.0
481,200,-200.0
482,89,-89.0
483,88,-88.0
484,159,-159.0
485,86,-86.0
486,149,-149.0
487,142,-142.0
488,141,-141.0
489,154,-154.0
490,96,-96.0
491,108,-108.0
492,105,-105.0
493,93,-93.0
494,150,-150.0
495,146,-146.0
496,142,-142.0
497,144,-144.0
498,140,-140.0
499,151,-151.0
500,88,-88.0
501,129,-129.0
502,167,-167.0
503,144,-144.0
504,106,-106.0
505,155,-155.0
506,122,-122.0
507,89,-89.0
508,128,-128.0
509,88,-88.0
510,154,-154.0
511,175,-175.0
512,105,-105.0
513,84,-84.0
514,83,-83.0
515,157,-157.0
516,157,-157.0
517,114,-114.0
518,121,-121.0
519,152,-152.0
520,83,-83.0
521,109,-109.0
522,103,-103.0
523,118,-118.0
524,109,-109.0
525,107,-107.0
526,149,-149.0
527,86,-86.0
528,109,-109.0
529,188,-188.0
530,86,-86.0
531,116,-116.0
532,115,-115.0
533,109,-109.0
534,103,-103.0
535,88,-88.0
536,106,-106.0
537,109,-109.0
538,167,-167.0
539,87,-87.0
540,113,-113.0
541,110,-110.0
542,108,-108.0
543,156,-156.0
544,145,-145.0
545,113,-113.0
546,108,-108.0
547,118,-118.0
548,158,-158.0
549,84,-84.0
550,109,-109.0
