episodes,steps,rewards
0,200,-200.0
1,200,-200.0
2,200,-200.0
3,200,-200.0
4,200,-200.0
5,200,-200.0
6,200,-200.0
7,200,-200.0
8,200,-200.0
9,200,-200.0
10,200,-200.0
11,200,-200.0
12,200,-200.0
13,200,-200.0
14,200,-200.0
15,200,-200.0
16,200,-200.0
17,200,-200.0
18,200,-200.0
19,200,-200.0
20,200,-200.0
21,200,-200.0
22,200,-200.0
23,200,-200.0
24,200,-200.0
25,200,-200.0
26,200,-200.0
27,200,-200.0
28,200,-200.0
29,200,-200.0
30,200,-200.0
31,200,-200.0
32,200,-200.0
33,200,-200.0
34,200,-200.0
35,200,-200.0
36,200,-200.0
37,200,-200.0
38,164,-164.0
39,200,-200.0
40,200,-200.0
41,169,-169.0
42,200,-200.0
43,200,-200.0
44,200,-200.0
45,200,-200.0
46,200,-200.0
47,200,-200.0
48,192,-192.0
49,137,-137.0
50,200,-200.0
51,200,-200.0
52,200,-200.0
53,200,-200.0
54,200,-200.0
55,151,-151.0
56,200,-200.0
57,200,-200.0
58,200,-200.0
59,174,-174.0
60,200,-200.0
61,200,-200.0
62,176,-176.0
63,200,-200.0
64,200,-200.0
65,170,-170.0
66,200,-200.0
67,162,-162.0
68,200,-200.0
69,174,-174.0
70,200,-200.0
71,200,-200.0
72,200,-200.0
73,200,-200.0
74,200,-200.0
75,200,-200.0
76,200,-200.0
77,200,-200.0
78,200,-200.0
79,200,-200.0
80,200,-200.0
81,200,-200.0
82,200,-200.0
83,90,-90.0
84,200,-200.0
85,110,-110.0
86,200,-200.0
87,141,-141.0
88,200,-200.0
89,200,-200.0
90,200,-200.0
91,200,-200.0
92,200,-200.0
93,181,-181.0
94,200,-200.0
95,200,-200.0
96,200,-200.0
97,200,-200.0
98,200,-200.0
99,200,-200.0
100,200,-200.0
101,181,-181.0
102,200,-200.0
103,200,-200.0
104,190,-190.0
105,200,-200.0
106,200,-200.0
107,200,-200.0
108,200,-200.0
109,200,-200.0
110,173,-173.0
111,200,-200.0
112,200,-200.0
113,200,-200.0
114,200,-200.0
115,162,-162.0
116,200,-200.0
117,200,-200.0
118,120,-120.0
119,200,-200.0
120,188,-188.0
121,200,-200.0
122,200,-200.0
123,132,-132.0
124,146,-146.0
125,200,-200.0
126,183,-183.0
127,110,-110.0
128,187,-187.0
129,200,-200.0
130,159,-159.0
131,200,-200.0
132,164,-164.0
133,200,-200.0
134,183,-183.0
135,200,-200.0
136,200,-200.0
137,200,-200.0
138,200,-200.0
139,154,-154.0
140,200,-200.0
141,200,-200.0
142,192,-192.0
143,191,-191.0
144,177,-177.0
145,151,-151.0
146,200,-200.0
147,114,-114.0
148,200,-200.0
149,162,-162.0
150,199,-199.0
151,200,-200.0
152,143,-143.0
153,143,-143.0
154,144,-144.0
155,113,-113.0
156,123,-123.0
157,147,-147.0
158,134,-134.0
159,161,-161.0
160,155,-155.0
161,192,-192.0
162,158,-158.0
163,167,-167.0
164,200,-200.0
165,165,-165.0
166,151,-151.0
167,200,-200.0
168,86,-86.0
169,153,-153.0
170,110,-110.0
171,160,-160.0
172,95,-95.0
173,172,-172.0
174,186,-186.0
175,168,-168.0
176,175,-175.0
177,200,-200.0
178,156,-156.0
179,155,-155.0
180,148,-148.0
181,166,-166.0
182,152,-152.0
183,167,-167.0
184,144,-144.0
185,92,-92.0
186,175,-175.0
187,169,-169.0
188,187,-187.0
189,200,-200.0
190,155,-155.0
191,165,-165.0
192,93,-93.0
193,184,-184.0
194,166,-166.0
195,181,-181.0
196,176,-176.0
197,200,-200.0
198,177,-177.0
199,199,-199.0
200,91,-91.0
201,179,-179.0
202,200,-200.0
203,197,-197.0
204,200,-200.0
205,167,-167.0
206,151,-151.0
207,200,-200.0
208,147,-147.0
209,144,-144.0
210,200,-200.0
211,165,-165.0
212,167,-167.0
213,166,-166.0
214,181,-181.0
215,200,-200.0
216,163,-163.0
217,154,-154.0
218,200,-200.0
219,200,-200.0
220,200,-200.0
221,172,-172.0
222,138,-138.0
223,145,-145.0
224,200,-200.0
225,149,-149.0
226,168,-168.0
227,200,-200.0
228,170,-170.0
229,120,-120.0
230,149,-149.0
231,200,-200.0
232,200,-200.0
233,159,-159.0
234,138,-138.0
235,150,-150.0
236,147,-147.0
237,178,-178.0
238,160,-160.0
239,182,-182.0
240,158,-158.0
241,168,-168.0
242,159,-159.0
243,155,-155.0
244,140,-140.0
245,165,-165.0
246,88,-88.0
247,167,-167.0
248,200,-200.0
249,200,-200.0
250,200,-200.0
251,180,-180.0
252,200,-200.0
253,200,-200.0
254,137,-137.0
255,131,-131.0
256,154,-154.0
257,87,-87.0
258,111,-111.0
259,149,-149.0
260,144,-144.0
261,148,-148.0
262,154,-154.0
263,104,-104.0
264,141,-141.0
265,141,-141.0
266,155,-155.0
267,138,-138.0
268,135,-135.0
269,91,-91.0
270,158,-158.0
271,139,-139.0
272,108,-108.0
273,107,-107.0
274,147,-147.0
275,150,-150.0
276,150,-150.0
277,166,-166.0
278,134,-134.0
279,200,-200.0
280,141,-141.0
281,100,-100.0
282,145,-145.0
283,162,-162.0
284,174,-174.0
285,142,-142.0
286,146,-146.0
287,200,-200.0
288,146,-146.0
289,147,-147.0
290,98,-98.0
291,153,-153.0
292,140,-140.0
293,87,-87.0
294,89,-89.0
295,93,-93.0
296,162,-162.0
297,145,-145.0
298,144,-144.0
299,200,-200.0
300,155,-155.0
301,152,-152.0
302,145,-145.0
303,150,-150.0
304,200,-200.0
305,157,-157.0
306,145,-145.0
307,147,-147.0
308,151,-151.0
309,147,-147.0
310,98,-98.0
311,149,-149.0
312,172,-172.0
313,200,-200.0
314,142,-142.0
315,149,-149.0
316,150,-150.0
317,146,-146.0
318,142,-142.0
319,147,-147.0
320,148,-148.0
321,144,-144.0
322,147,-147.0
323,200,-200.0
324,200,-200.0
325,153,-153.0
326,143,-143.0
327,111,-111.0
328,142,-142.0
329,144,-144.0
330,143,-143.0
331,200,-200.0
332,85,-85.0
333,146,-146.0
334,98,-98.0
335,200,-200.0
336,96,-96.0
337,149,-149.0
338,87,-87.0
339,200,-200.0
340,85,-85.0
341,200,-200.0
342,146,-146.0
343,123,-123.0
344,174,-174.0
345,102,-102.0
346,200,-200.0
347,197,-197.0
348,143,-143.0
349,158,-158.0
350,86,-86.0
351,154,-154.0
352,88,-88.0
353,200,-200.0
354,110,-110.0
355,87,-87.0
356,144,-144.0
357,200,-200.0
358,200,-200.0
359,86,-86.0
360,200,-200.0
361,147,-147.0
362,145,-145.0
363,176,-176.0
364,103,-103.0
365,147,-147.0
366,85,-85.0
367,93,-93.0
368,142,-142.0
369,178,-178.0
370,194,-194.0
371,190,-190.0
372,148,-148.0
373,90,-90.0
374,200,-200.0
375,149,-149.0
376,149,-149.0
377,149,-149.0
378,143,-143.0
379,146,-146.0
380,144,-144.0
381,123,-123.0
382,200,-200.0
383,200,-200.0
384,146,-146.0
385,200,-200.0
386,155,-155.0
387,88,-88.0
388,146,-146.0
389,155,-155.0
390,155,-155.0
391,200,-200.0
392,89,-89.0
393,161,-161.0
394,172,-172.0
395,92,-92.0
396,154,-154.0
397,95,-95.0
398,87,-87.0
399,144,-144.0
400,143,-143.0
401,148,-148.0
402,200,-200.0
403,155,-155.0
404,148,-148.0
405,164,-164.0
406,147,-147.0
407,149,-149.0
408,150,-150.0
409,153,-153.0
410,154,-154.0
411,114,-114.0
412,149,-149.0
413,200,-200.0
414,94,-94.0
415,158,-158.0
416,154,-154.0
417,152,-152.0
418,157,-157.0
419,149,-149.0
420,88,-88.0
421,152,-152.0
422,143,-143.0
423,200,-200.0
424,157,-157.0
425,86,-86.0
426,143,-143.0
427,105,-105.0
428,104,-104.0
429,86,-86.0
430,154,-154.0
431,173,-173.0
432,90,-90.0
433,200,-200.0
434,146,-146.0
435,94,-94.0
436,151,-151.0
437,144,-144.0
438,155,-155.0
439,150,-150.0
440,148,-148.0
441,88,-88.0
442,84,-84.0
443,151,-151.0
444,95,-95.0
445,154,-154.0
446,149,-149.0
447,90,-90.0
448,156,-156.0
449,144,-144.0
450,154,-154.0
451,149,-149.0
452,147,-147.0
453,147,-147.0
454,148,-148.0
455,150,-150.0
456,96,-96.0
457,200,-200.0
458,148,-148.0
459,148,-148.0
460,95,-95.0
461,95,-95.0
462,149,-149.0
463,144,-144.0
464,148,-148.0
465,145,-145.0
466,145,-145.0
467,96,-96.0
468,150,-150.0
469,95,-95.0
470,147,-147.0
471,91,-91.0
472,149,-149.0
473,146,-146.0
474,185,-185.0
475,85,-85.0
476,145,-145.0
477,151,-151.0
478,200,-200.0
479,105,-105.0
480,145,-145.0
481,162,-162.0
482,187,-187.0
483,144,-144.0
484,142,-142.0
485,86,-86.0
486,96,-96.0
487,160,-160.0
488,89,-89.0
489,148,-148.0
490,190,-190.0
491,148,-148.0
492,141,-141.0
493,149,-149.0
494,189,-189.0
495,95,-95.0
496,168,-168.0
497,148,-148.0
498,91,-91.0
499,172,-172.0
500,146,-146.0
501,154,-154.0
502,93,-93.0
503,87,-87.0
504,156,-156.0
505,153,-153.0
506,89,-89.0
507,100,-100.0
508,153,-153.0
509,150,-150.0
510,85,-85.0
511,108,-108.0
512,147,-147.0
513,163,-163.0
514,153,-153.0
515,156,-156.0
516,153,-153.0
517,164,-164.0
518,180,-180.0
519,108,-108.0
520,155,-155.0
521,159,-159.0
522,108,-108.0
523,200,-200.0
524,157,-157.0
525,92,-92.0
526,150,-150.0
527,86,-86.0
528,88,-88.0
529,160,-160.0
530,147,-147.0
531,155,-155.0
532,169,-169.0
533,161,-161.0
534,200,-200.0
535,150,-150.0
536,86,-86.0
537,146,-146.0
538,152,-152.0
539,149,-149.0
540,87,-87.0
541,200,-200.0
542,144,-144.0
543,159,-159.0
544,149,-149.0
545,98,-98.0
546,141,-141.0
547,88,-88.0
548,158,-158.0
549,144,-144.0
550,154,-154.0
