episodes,steps,rewards
0,106,-399.4970920571533
1,69,-82.05296528077842
2,86,-97.60210084789558
3,126,-409.789671054213
4,126,-403.51140562473114
5,103,-265.3533102261523
6,110,33.14023280236262
7,82,-101.61656770680578
8,77,-75.43689381922547
9,82,-93.1400176712869
10,116,-355.88810758216783
11,101,-235.74375279930481
12,157,-129.2346263775453
13,180,-3.992379874268721
14,1000,-59.71707099465266
15,554,-293.08512760930876
16,233,-223.77613383034256
17,99,-326.68768522605217
18,216,-122.79815266412206
19,344,-243.79971643302144
20,277,-193.14847586433154
21,458,-179.63889175751933
22,424,-337.3143559948061
23,365,-161.14440407324264
24,749,-221.04824710504977
25,151,-135.29749789850263
26,188,-153.58422512003165
27,717,-300.3909811270432
28,347,-196.89887301364826
29,995,-319.03552400957517
30,1000,-129.88074160964578
31,356,-37.94403120862289
32,269,28.246782063514672
33,1000,-108.53298316280217
34,1000,-75.14749134947087
35,1000,-151.65477925178004
36,1000,-107.80115150538333
37,254,-310.272325503145
38,1000,-167.73112269371876
39,114,-192.8801219823824
40,855,-270.68545643552784
41,1000,-191.70891766433397
42,1000,-145.59152408146895
43,1000,-138.83785116858323
44,80,-295.0795380836828
45,115,-179.05938126001467
46,1000,-160.53133042912293
47,1000,-225.38998921832814
48,184,-86.87007368131471
49,226,-119.61718233519026
50,239,-427.14124819343994
51,166,-62.2502237077207
52,308,-225.47569521982155
53,332,-301.6222328312092
54,1000,-133.44894259747215
55,1000,-164.42981777856698
56,1000,-188.08255661193868
57,1000,-99.17496565546777
58,1000,-133.87371235178512
59,1000,-95.45579127542051
60,101,-125.14782097476353
61,334,-186.67627598299003
62,79,-73.93994282343272
63,1000,-151.22606795607234
64,1000,-95.19723704109818
65,143,-235.2609165260982
66,143,-149.8644625361398
67,373,-242.1665615435899
68,114,-236.62141100014796
69,106,-419.4655369896403
70,273,-178.62083204861887
71,368,-200.22325544933267
72,66,-216.82358327861166
73,230,-41.18184223370318
74,1000,-147.81262866488328
75,1000,-96.22455570575798
76,1000,-83.5578949712082
77,1000,-135.99737159784286
78,1000,-71.22402712648727
79,306,-110.33078706951561
80,1000,-102.68176043916016
81,1000,-123.96744677780214
82,1000,-109.15536322955992
83,1000,-56.22102785514889
84,1000,-78.2295013404093
85,1000,-65.27666728453902
86,1000,-130.26868419928255
87,1000,-106.31036294650805
88,1000,-126.92645043964781
89,143,-178.5396390551647
90,1000,-97.85613454975281
91,254,-78.00367925079398
92,1000,-99.45960450948428
93,1000,-57.57623303898083
94,1000,-98.8045319760596
95,1000,-88.32311243844508
96,93,-526.9090513910586
97,114,-797.406746044144
98,256,-1437.9727070810377
99,1000,-155.0410302044441
100,1000,-121.3281936650751
101,1000,-89.42361551149693
102,1000,-112.88237446096012
103,1000,-120.65218928975764
104,392,-138.6271189495663
105,284,-407.5841672733226
106,1000,-123.22882447722765
107,1000,-81.39606220851972
108,1000,-76.66981378018735
109,1000,-39.08407593542847
110,1000,-59.37745644192229
111,1000,-75.11913118366733
112,1000,-96.2541563510787
113,1000,-108.90870772243566
114,1000,-94.52291082116287
115,1000,-64.52714457605154
116,1000,-45.490902966687145
117,1000,-43.73586767934056
118,1000,-75.95867926725522
119,1000,-95.49437513723544
120,936,-296.9168532434189
121,1000,-87.87546255069506
122,1000,-66.61317630605457
123,1000,-38.37123615623829
124,780,-196.6341749694617
125,957,-159.84203844217143
126,1000,-22.57528069611794
127,1000,-53.057923529402345
128,1000,-9.864540742575688
129,286,-191.78254100075014
130,778,-72.21536660191114
131,88,-67.36916137424888
132,407,-203.9675026119284
133,1000,-55.83138892281127
134,624,-128.39651994990604
135,1000,-16.392503905707006
136,1000,-70.38913335527879
137,1000,-115.9926294464013
138,1000,-5.767169961626901
139,1000,-62.08525014254307
140,1000,-7.965099255854684
141,262,-513.7979478535226
142,672,-410.94299027937967
143,1000,-18.473454827614784
144,642,-289.3286388662965
145,138,-189.67434949979398
146,1000,-77.29976496133669
147,102,-545.907950215144
148,164,-74.37710273247069
149,548,-181.79747765334554
150,152,-1010.4797452137338
151,340,-764.1249528057274
152,1000,-71.50171725037903
153,1000,-105.75806695771269
154,1000,-85.19965222056453
155,1000,-114.82379577660755
156,1000,-112.12853757578488
157,768,158.45964493840964
158,234,-141.77010744259962
159,362,-319.17646336701625
160,87,-225.5977023150076
161,256,-508.2049661080377
162,82,-280.13711359694133
163,84,-326.6854964700144
164,143,-390.6192881007479
165,156,-372.8202468957229
166,162,-686.5899653644425
167,227,-679.1424489972421
168,119,-219.448409544183
169,95,-264.57515488060903
170,105,-198.651806901763
171,1000,-37.11025722926672
172,314,-148.21594626642982
173,1000,-68.79855400644963
174,1000,-135.94721374633258
175,1000,-45.29720986513881
176,1000,-87.26849363975764
177,96,-886.3741016524216
178,424,-1255.0919451191485
179,917,-502.132430851093
180,481,0.18499953563058114
181,176,-59.253676133451116
182,169,-94.3970968637434
183,108,-228.65788017265757
184,117,-199.45604030491535
185,101,-173.10724033237972
186,88,-173.82979213887023
187,100,-210.69908626403196
188,128,-263.90107692648064
189,158,-227.692914865981
190,309,-237.67211612359839
191,487,-307.5785383766371
192,1000,-234.9217280020022
193,410,-307.3131287514958
194,399,-384.3293471098604
195,137,-222.0376721749173
196,144,-380.1614787496669
197,383,-221.20880329958908
198,1000,-59.08039162160421
199,1000,-25.264690756998004
200,1000,-82.32595664940968
201,1000,-24.56195549221577
202,1000,-65.48308010479296
203,1000,-90.0576488924015
204,1000,-48.40011170706911
205,170,-257.461698210714
206,1000,-49.861361573268994
207,1000,-36.23413477968156
208,1000,-65.07256743169621
209,229,-195.5836916493401
210,1000,-75.28865625241683
211,1000,0.14524878170729516
212,419,-40.591671539589356
213,408,-151.43763237850646
214,402,-1904.399766000743
215,427,-169.24427275225156
216,329,-155.7362853617857
217,214,-148.48763564760566
218,1000,-119.12253722732595
219,1000,-145.32173193144604
220,792,-203.28498205578836
221,855,-347.044987002643
222,1000,-101.87712380596709
223,1000,-122.48279629211089
224,1000,-24.706373642826865
225,1000,-83.27842350573808
226,257,-254.64795818448914
227,581,-263.05223850334687
228,1000,-2.889000373215077
229,1000,-162.24001778013775
230,1000,-22.536343635194285
231,1000,-50.67344208069363
232,311,-234.2762265274646
233,1000,-93.46288392237786
234,1000,-22.335554832755022
235,1000,-61.12572086938284
236,1000,-51.125473185740134
237,1000,-77.42002283860435
238,1000,-25.015305965190976
239,980,-242.5876418753004
240,1000,-11.710934257947414
241,1000,-59.90239672618251
242,157,-245.98009045802888
243,1000,-34.21377199645389
244,1000,-88.69587066371838
245,1000,-37.745106493102725
246,1000,-56.34217679642684
247,1000,-145.4172937798467
248,1000,-127.70669913857651
249,1000,-44.52904022722407
250,1000,-103.97661471414267
251,450,-147.29793650998477
252,86,-188.37120988304025
253,1000,-61.215768747104065
254,1000,-5.178785145617267
255,164,-152.319994297068
256,1000,-74.42388450227759
257,1000,-30.785332181163742
258,1000,-115.79109532470179
259,1000,-43.29485294116941
260,1000,-13.82637133986933
261,644,-59.156370959383565
262,300,-12.172731794801408
263,1000,-41.80041166865476
264,677,-654.4878949970606
265,444,-119.1410324073573
266,1000,-29.628155876213672
267,1000,-56.212226554038445
268,1000,1.8923273328428862
269,1000,-56.19910182297859
270,686,-110.90069961334332
271,1000,-51.9100895357111
272,1000,-56.28820723599562
273,89,-550.0792832937905
274,1000,-51.15025876957342
275,1000,-70.01346765826825
276,1000,-72.66060210425057
277,1000,-27.240120487989504
278,1000,9.859344769220236
279,1000,-27.15087402443639
280,1000,-5.537161536178551
281,1000,1.5411358163449576
282,1000,-44.179466167633024
283,129,16.925321844927637
284,1000,-2.7059370920346413
285,1000,-29.744753246635767
286,1000,-6.803444654247673
287,1000,-15.590584848843285
288,1000,8.400474721905704
289,147,-217.55055898839794
290,1000,-1.6359735436682954
291,1000,-5.290943734182871
292,1000,14.176672105086695
293,1000,-33.69138940852961
294,1000,-29.206930633107724
295,1000,-31.313317527938928
296,1000,-51.43942570567804
297,1000,25.95868891514007
298,1000,-7.140119386670433
299,461,-2.980676768073792
300,1000,33.95139836593578
