episodes,steps,rewards
0,123,-92.21864600807282
1,116,-206.92031130086724
2,73,-150.25020611549303
3,120,-215.8931944137367
4,84,-128.41320847958394
5,78,-96.18524573066568
6,100,-107.03295710081441
7,102,-286.09683825305115
8,90,-214.7928810409772
9,108,-208.31135688184702
10,74,-65.56390007803587
11,103,-171.2493253805738
12,272,-503.49514022938945
13,84,-369.26548094638036
14,114,-429.7209283447734
15,151,-104.6994875900664
16,365,-156.47657681709518
17,668,-173.5276380698223
18,206,-115.45208332933349
19,92,-118.0553249103773
20,96,-170.05932998086854
21,142,-156.56276177092752
22,103,-188.06197612138817
23,259,-83.7232099813314
24,373,-121.40850499136681
25,138,-210.83867328136523
26,258,-184.6383280696627
27,133,-191.38256361998504
28,139,-195.4868513278384
29,135,-108.09127723633073
30,142,-110.09613028959666
31,119,-277.0503393747059
32,141,-249.93757559612214
33,179,-219.43962876843983
34,157,-342.7176699907238
35,363,-258.25269704045127
36,1000,-137.25545036899626
37,1000,-95.84242347026672
38,1000,-137.48938602976938
39,850,-314.3352286920124
40,337,-221.10400498963844
41,354,-194.80792730331677
42,333,-251.47418600098177
43,260,-178.7826681718845
44,895,-272.9367790122151
45,420,-211.55617711554618
46,1000,-228.670556601776
47,1000,-254.50984876429706
48,1000,-160.58119510297547
49,1000,-179.26598207709483
50,322,-257.5749587172688
51,1000,-169.46059716080563
52,463,-213.35053907084085
53,1000,-187.3866393860793
54,1000,-193.33403958613283
55,1000,-193.1139521595387
56,1000,-147.82238234105736
57,1000,-148.44033901475453
58,1000,-194.0910470206291
59,1000,-143.7098236318674
60,1000,-171.26520515066503
61,1000,-141.52669287604846
62,311,-664.0596842188252
63,1000,-193.19941335238508
64,1000,-194.68151896803806
65,1000,-166.01401851603526
66,1000,-193.26238816679495
67,1000,-254.11096819880916
68,1000,-208.43026460937125
69,1000,-186.3776893885978
70,1000,-198.7838221833953
71,1000,-214.7257072459428
72,1000,-223.25408544343364
73,950,-416.33275074828464
74,743,-310.41852074903335
75,1000,-253.83721270848866
76,865,-345.1634539781588
77,1000,-266.0305937482872
78,157,-197.8349789690222
79,1000,-161.94840107437736
80,979,-318.4476425892378
81,1000,-179.43603896041725
82,1000,-178.49355952898827
83,1000,-217.52035709109882
84,426,-232.93701023100886
85,429,-267.35945978221093
86,182,-146.10591528298363
87,1000,-324.1885183065491
88,1000,-151.44642471881693
89,99,-287.12832851590144
90,1000,-189.422833913736
91,1000,-209.72888868244118
92,523,-221.01937588982344
93,1000,-185.50039221791477
94,795,-257.119292325178
95,1000,-201.38793206025335
96,1000,-226.34629551929152
97,982,-345.8253825682836
98,1000,-192.6609034997603
99,856,-269.75091533320165
100,1000,-167.29605285146857
101,1000,-137.98125312034065
102,1000,-152.18505091746275
103,1000,-167.4279426126026
104,1000,-266.21001423211555
105,1000,-205.4011115321367
106,1000,-181.5748776577328
107,1000,-190.57386819097385
108,1000,-274.7591586725827
109,1000,-143.2921285798515
110,1000,-168.69483939506338
111,1000,-110.42271519245931
112,1000,-220.15176223250702
113,1000,-136.03160297814816
114,175,-316.50530101584235
115,1000,-132.80887019706043
116,484,-108.90671602032191
117,1000,-148.20000111675338
118,1000,-128.98356097988125
119,1000,-93.3970233377804
120,543,-240.7051323574284
121,247,-225.11331030556227
122,1000,-53.27533578772473
123,1000,-113.60438452643501
124,515,-177.0359540179009
125,970,72.63144385356934
126,100,-133.59122960636645
127,327,-107.37891842434546
128,1000,-65.23029300790579
129,1000,-17.41003579289576
130,1000,-87.7608393256488
131,1000,-72.73147540410834
132,1000,-49.41521628188254
133,1000,-126.54762118919695
134,1000,-84.14568415184925
135,1000,-91.78225040634248
136,1000,-147.62310093139098
137,1000,-151.44406739247043
138,1000,-109.90317412457304
139,1000,-158.2336630098855
140,1000,-192.91571881141414
141,1000,-161.8637489887551
142,723,-195.7964261184116
143,1000,-99.45330658911028
144,496,-188.42683089059085
145,474,-191.82779573987824
146,319,-116.63397317002676
147,1000,-725.6105371648257
148,62,-160.4414426240483
149,1000,-625.9688508966428
150,1000,-422.0285831093937
151,77,-129.1370538200855
152,1000,-218.04899481051214
153,1000,-297.0840282857141
154,1000,-226.7721202957864
155,1000,-183.76068332726263
156,1000,-208.46586780277062
157,1000,-86.09739475175239
158,1000,-146.1716715627784
159,1000,-209.1189538045955
160,1000,-195.79054689452906
161,1000,-213.50187177949306
162,1000,-201.03902724281042
163,1000,-229.60928553203956
164,1000,-237.85931132375026
165,1000,-160.76683543460027
166,109,-163.80389860441318
167,348,-365.18464522933834
168,184,-371.2498308364742
169,1000,-252.394544414387
170,1000,-118.58884367503015
171,433,-59.001660535868005
172,253,-185.6326468458537
173,154,-123.21013629356419
174,1000,-165.0258043170371
175,1000,-139.08422069810595
176,1000,-144.34240025057792
177,1000,-121.06911402243533
178,1000,-112.69850419108849
179,389,-130.2112433989755
180,1000,-92.10342439715708
181,1000,-224.93293392988627
182,583,-353.7629581548913
183,1000,-187.7847770244197
184,1000,-133.8525899213234
185,1000,-60.34987341695769
186,1000,-83.91501948855297
187,99,-316.24819102465176
188,267,-22.270701556048067
189,188,-100.63962335425029
190,206,-142.44885965509997
191,114,-588.5745577369075
192,94,-322.1634315455809
193,866,-565.1154064180957
194,1000,-303.75878101910774
195,1000,-291.286617451717
196,1000,-274.8743767897432
197,1000,-188.88503567321362
198,1000,-187.86329155765964
199,1000,-216.73726329615877
200,265,-229.26666855353653
201,1000,-184.8705097985752
202,705,-275.0120220004397
203,661,-266.4431231703462
204,331,-240.49714428353863
205,789,-416.60120463248643
206,187,-358.2010242462576
207,93,-334.8346654042383
208,286,-366.9990542239921
209,388,-347.71935476535475
210,302,-273.7138176489534
211,149,-236.8323945648306
212,439,-210.2940833402564
213,286,-181.3567607521972
214,542,-258.70787720435453
215,346,-250.20009505261126
216,454,-223.16938989672826
217,657,-245.15439385054736
218,368,-192.14122493232873
219,79,-559.2059236462042
220,372,-262.71444586958836
221,549,-472.800776511384
222,1000,-130.0439786268474
223,93,-212.25214879824895
224,160,-188.96312101191037
225,270,-94.20981904104951
226,1000,-171.53203517873723
227,883,-304.8663986852165
228,1000,-178.99053193955075
229,1000,-219.23266949535866
230,1000,-296.66037484381286
231,332,-217.1676608700501
232,1000,-187.7156385827601
233,1000,-66.95068669892129
234,1000,-98.10153400805271
235,1000,-78.75883456314983
236,1000,-42.04680735388891
237,1000,-87.51698844277047
238,1000,-84.39018280451137
239,198,-159.09088193900547
240,488,-268.9358796603378
241,362,-370.04291616055076
242,325,-228.07952430733346
243,1000,-61.556393617370475
244,149,-166.9042044389427
245,612,-307.0357844822684
246,236,-472.87396404547303
247,190,-264.9339375997971
248,169,-250.37055853200246
249,1000,-141.57993659155255
250,1000,-138.15676667358377
251,160,-228.42044422222875
252,1000,-187.25047079271894
253,243,-351.82880248292406
254,289,-225.8797927335064
255,178,-237.25953107199254
256,211,-139.17890264397425
257,197,-269.1344826872519
258,1000,-137.1658767292334
259,242,-222.45123249269142
260,232,-276.2219695105122
261,1000,-196.7914028857936
262,125,-159.53019097392868
263,226,-236.474768339692
264,433,-270.2868685540296
265,489,-238.24475477859417
266,513,-262.13441078334114
267,157,-145.8388720466118
268,245,-182.00512442785657
269,560,-253.033640756676
270,264,-267.2385716569622
271,254,-309.07083804959245
272,242,-314.7873987049288
273,510,-313.83670332035695
274,441,-276.8881610774668
275,671,-363.6606463025013
276,251,-226.62723814781754
277,963,-419.7426400333381
278,1000,-134.10519448079478
279,1000,-125.61882629978483
280,1000,-110.51324757812456
281,1000,-127.19307555072966
282,824,-267.1507228189049
283,1000,-150.63794984614555
284,1000,-214.81435051180623
285,1000,-224.73682318572548
286,1000,-97.8662733586229
287,1000,-66.96316374564891
288,1000,-137.1212686670994
289,1000,-123.33488195965047
290,1000,-108.49849018200553
291,1000,-71.72974830124416
292,168,-170.1895164025924
293,1000,-142.3980044959029
294,1000,-183.62067780456513
295,491,-175.42205569637935
296,159,-252.6124332971939
297,102,-283.1206832062382
298,1000,-199.37067256076347
299,1000,-149.32430668302268
300,807,-286.63902856017046
301,207,-71.50959072346377
302,186,-282.40386963300386
303,1000,-92.00484712516163
304,343,-89.25924458997497
305,498,-153.65042928459664
306,287,-142.72753319019236
307,181,-208.03396508250762
308,364,-368.5580616478251
309,143,-213.3198920606809
310,214,-319.56150055769245
311,187,-242.97761219155413
312,596,-307.2384121972141
313,295,-283.62617986899306
314,1000,-274.23186932657507
315,203,-184.53283210847826
316,243,-257.3792149989847
317,891,-293.98835538200416
318,1000,-186.97715214805532
319,431,-339.8080458154873
320,130,-158.98080586260474
321,106,-247.0971240609154
322,116,-269.9678452960977
323,222,-216.6153375747753
324,224,-190.0581970940189
325,410,-393.90340166138304
326,283,-204.37640907407865
327,304,-307.30288250862316
328,217,-99.77356628080622
329,201,-158.4657166780397
330,248,-430.24236637599927
331,751,-244.1803396719304
332,564,-80.36130769627536
333,362,-268.4315404724014
334,363,-142.08455242672312
335,103,-210.0952761260255
336,898,-323.51094429968344
337,384,-127.15840279481192
338,1000,-169.64359216072702
339,1000,-218.87895439104983
340,987,-219.67192104519157
341,608,-197.51757829819422
342,593,-216.06741581753465
343,256,-112.549706474645
344,581,-275.44148234846244
345,604,-208.79453525476927
346,459,-197.86005015180524
347,433,-266.65928412192943
348,1000,-112.30652818023614
349,1000,-153.90603658182897
350,1000,-102.53217056605578
351,459,-193.1342306322885
352,944,-243.23226318320087
353,1000,-104.3478372814906
354,1000,-138.32341250905998
355,1000,-130.7207972021867
356,1000,-92.49877356270602
357,1000,-116.58106970922519
358,1000,-101.86867497919862
359,1000,-96.19443984991796
360,1000,-151.12124396154334
361,244,-144.40756373397704
362,1000,-141.81606006038535
363,1000,-185.399083669358
364,1000,-143.7065227127659
365,1000,-181.23669889780973
366,1000,-186.695361304708
367,1000,-215.3810314912978
368,1000,-154.06489984889737
369,1000,-172.5271043438072
370,1000,-125.44247574780718
371,1000,-193.47210067265135
372,275,-435.1490512822032
373,1000,-129.78098401967972
374,1000,-70.80797877503817
375,1000,-110.62151114496918
376,1000,-124.6032780144171
377,1000,-146.13134027632933
378,1000,-77.20162251640339
379,1000,-134.14726378350016
380,1000,-115.38055367914794
381,305,-288.20137827806866
382,249,-505.9648091775422
383,1000,-54.620479023225215
384,587,-359.1004230481578
385,840,-452.996895986001
386,840,-475.15810524715715
387,1000,-96.72466214858265
388,1000,-153.54932207103974
389,325,-438.56296835858575
390,255,-333.9001980424189
391,518,-319.11162330116565
392,1000,-89.59048971743526
393,1000,-134.09948167255962
394,1000,-136.2021970016615
395,1000,-124.4881251932562
396,975,-231.71435593179527
397,1000,-98.50841584062965
398,198,-154.66215929056213
399,542,-234.07502219832926
400,339,-232.74162264051287
401,320,-380.90507626806834
402,294,-435.9162062122317
403,373,-158.65532458139654
404,856,-347.05491251236566
405,644,-717.4575048084831
406,659,-522.8501396785954
407,273,-365.4665995778494
408,533,-572.0502737839358
409,1000,-253.26933320347268
410,417,-285.9564310148759
411,422,-221.28192751901264
412,141,-315.46054488712906
413,194,-395.7148827656839
414,751,-244.4866623695051
415,272,-183.8191854507338
416,275,-216.5093284522866
417,287,-300.2600426949042
418,185,-251.23402033664806
419,209,-210.89015478734387
420,368,-316.2736833056013
421,114,-307.038087831324
422,427,-309.5325030623647
423,547,-462.322647793573
424,182,-227.3968859893718
425,898,-499.19661883103
426,636,-637.1739613859012
427,399,-311.4594743247055
428,1000,-365.13634375610224
429,1000,-262.93715141865704
430,1000,-304.6210006912689
431,1000,-279.99890892875186
432,1000,-201.02994944186943
433,1000,-264.52154691250854
434,1000,-231.68787240068826
435,1000,-140.16839371748532
436,1000,-114.49108163563646
437,349,-543.6147703609768
438,734,-523.9975714063648
439,1000,-132.3247889470414
440,380,-250.7131561310525
441,548,-288.2285507674434
442,687,-281.15505154745927
443,482,-222.07473046483793
444,1000,-211.62894928772053
445,364,-347.4410049966263
446,397,-179.99812124720253
447,562,-245.1515498045435
448,1000,-191.1934863714768
449,1000,-107.1817531602959
450,1000,-90.30336831915919
451,1000,-113.20513333395095
452,1000,-68.52024587316245
453,1000,-178.92842370736244
454,1000,-185.9389251944644
455,229,-203.20894449849317
456,1000,-203.497372224137
457,1000,-188.8414980517716
458,1000,-230.95081703229803
459,1000,-206.4257347003671
460,1000,-187.79310351226167
461,1000,-198.44531400517803
462,1000,-156.2341531038022
463,198,-285.8856893441274
464,1000,-158.2379543966305
465,1000,-191.19671634376087
466,1000,-139.4680936271415
467,1000,-134.5082944831944
468,1000,-158.674910488792
469,212,-725.5581050960867
470,1000,-159.92781460338148
471,1000,-156.49621327329345
472,1000,-176.4142016548123
473,1000,-159.74095032234737
474,1000,-204.18845096397456
475,99,-203.41879537904327
476,209,-241.60616740483007
477,1000,-125.03412752747377
478,1000,-159.35842075669896
479,1000,-173.73093735278061
480,1000,-177.06022661872237
481,1000,-146.34767543974527
482,1000,-142.91098245655834
483,1000,-111.71817966094959
484,1000,-140.01522963266729
485,1000,-178.63054354518843
486,1000,-159.90959431364044
487,1000,-168.1037525145102
488,1000,-183.71024564322562
489,257,-723.1708109281175
490,368,-244.0035928234129
491,230,-277.3303517128144
492,131,-473.31043720493
493,321,-272.12070685121904
494,648,-360.52714024803214
495,761,-287.51814716627734
496,1000,-223.92085606892272
497,816,-300.8728541151896
498,254,-129.29851849386404
499,1000,-255.37098609989155
500,1000,-192.64654311157992
501,1000,-177.63341529706838
502,1000,-190.3662971032581
503,1000,-154.8249640400279
504,1000,-157.3573319382465
505,1000,-188.1638621436899
506,343,-484.56840485685706
507,388,-79.47967340671613
508,1000,-124.76028245501556
509,1000,-90.09363375717578
510,1000,-136.99244442364096
511,487,-126.87000358225467
512,349,-250.1793713371639
513,822,-618.0795092837179
514,164,-339.3834460460049
515,1000,-135.32073495685296
516,736,-337.87741561101745
517,916,-259.0834432449989
518,193,-389.0122544072488
519,202,-449.8934081511338
520,454,-170.90447412585135
521,391,-206.6746002429245
522,430,-194.34302108597873
523,900,-268.65792051779056
524,960,-503.2387792797198
525,1000,-214.73811847288673
526,1000,-154.11188082953095
527,702,-303.23443811422084
528,104,-476.2263433648353
529,324,-296.0891099958041
530,348,-378.2641695854244
531,819,-336.69246466407867
532,1000,-220.29891683393504
533,118,-175.6181057859108
534,761,-350.31230336394924
535,809,-483.1130084155569
536,182,-487.9541589761921
537,175,-248.49251027947005
538,616,-389.4749261286932
539,280,-317.0720808272643
540,1000,-190.19996340280997
541,573,-281.4425173044549
542,1000,-166.80193711755555
543,1000,-140.0252937669013
544,1000,-151.87725460179442
545,1000,-109.40460102902941
546,1000,-124.4542437630602
547,1000,-115.51669170253206
548,1000,-86.6170443033929
549,536,-183.3260316350927
550,992,-379.80020123333895
