<?xml version="1.0" encoding="UTF-8" standalone="no"?>
<!-- Created with Inkscape (http://www.inkscape.org/) -->

<svg
   xmlns:dc="http://purl.org/dc/elements/1.1/"
   xmlns:cc="http://creativecommons.org/ns#"
   xmlns:rdf="http://www.w3.org/1999/02/22-rdf-syntax-ns#"
   xmlns:svg="http://www.w3.org/2000/svg"
   xmlns="http://www.w3.org/2000/svg"
   xmlns:sodipodi="http://sodipodi.sourceforge.net/DTD/sodipodi-0.dtd"
   xmlns:inkscape="http://www.inkscape.org/namespaces/inkscape"
   width="49.905823mm"
   height="61.49445mm"
   viewBox="0 0 49.905822 61.49445"
   version="1.1"
   id="svg1140"
   inkscape:version="0.92.3 (2405546, 2018-03-11)"
   sodipodi:docname="content_timeline_s2.svg">
  <defs
     id="defs1134" />
  <sodipodi:namedview
     id="base"
     pagecolor="#ffffff"
     bordercolor="#666666"
     borderopacity="1.0"
     inkscape:pageopacity="0.0"
     inkscape:pageshadow="2"
     inkscape:zoom="5.6000001"
     inkscape:cx="94.412316"
     inkscape:cy="75.97933"
     inkscape:document-units="mm"
     inkscape:current-layer="layer1"
     showgrid="false"
     inkscape:snap-global="false"
     inkscape:window-width="1853"
     inkscape:window-height="1025"
     inkscape:window-x="1987"
     inkscape:window-y="27"
     inkscape:window-maximized="1"
     fit-margin-top="0"
     fit-margin-left="0"
     fit-margin-right="0"
     fit-margin-bottom="0" />
  <metadata
     id="metadata1137">
    <rdf:RDF>
      <cc:Work
         rdf:about="">
        <dc:format>image/svg+xml</dc:format>
        <dc:type
           rdf:resource="http://purl.org/dc/dcmitype/StillImage" />
        <dc:title />
      </cc:Work>
    </rdf:RDF>
  </metadata>
  <g
     inkscape:label="Layer 1"
     inkscape:groupmode="layer"
     id="layer1"
     transform="translate(-182.18963,-135.50554)">
    <rect
       style="opacity:1;fill:#ffffff;fill-opacity:1;stroke:#ff4500;stroke-width:0.62965512;stroke-linecap:round;stroke-linejoin:round;stroke-miterlimit:4;stroke-dasharray:none;stroke-dashoffset:0;stroke-opacity:1"
       id="rect1685-5-6"
       width="29.990017"
       height="27.073654"
       x="194.76555"
       y="169.61151"
       ry="2.5950513" />
    <path
       style="fill:none;stroke:#ff4500;stroke-width:0.69999999;stroke-linecap:round;stroke-linejoin:round;stroke-miterlimit:4;stroke-dasharray:none;stroke-opacity:1"
       d="m 182.54461,183.49997 h 9.8469 v -16.05346 h 16.88119 v -25.19559"
       id="path2006-4-5"
       inkscape:connector-curvature="0"
       sodipodi:nodetypes="ccccc" />
    <text
       xml:space="preserve"
       style="font-style:italic;font-variant:normal;font-weight:bold;font-stretch:normal;font-size:4.58611107px;line-height:1.25;font-family:serif;-inkscape-font-specification:'serif Bold Italic';letter-spacing:0px;word-spacing:0px;fill:#ff4500;fill-opacity:1;stroke:none;stroke-width:0.26458332"
       x="187.36519"
       y="138.98991"
       id="text2113"><tspan
         sodipodi:role="line"
         id="tspan2111"
         x="187.36519"
         y="138.98991"
         style="font-style:italic;font-variant:normal;font-weight:bold;font-stretch:normal;font-family:serif;-inkscape-font-specification:'serif Bold Italic';fill:#ff4500;fill-opacity:1;stroke-width:0.26458332">Simulation Study</tspan></text>
    <g
       inkscape:label="Layer 1"
       id="layer1-9"
       transform="matrix(0.17843238,0,0,0.17843238,182.81546,149.24036)"
       style="fill:#ff4500;fill-opacity:1">
      <path
         style="fill:#ff4500;fill-opacity:1;stroke-width:0.26458332"
         d="m 132.22469,251.15148 c -0.50095,-0.50095 -0.52917,-0.88195 -0.52917,-7.14375 v -6.61459 h -14.02291 c -13.67014,0 -14.03623,-0.0133 -14.55208,-0.52916 -0.49911,-0.49911 -0.52891,-0.87862 -0.52457,-6.68073 0.005,-7.17112 0.2557,-8.79283 1.85977,-12.04709 1.94948,-3.95502 5.22886,-6.84613 9.50103,-8.37612 2.2495,-0.80561 2.28802,-0.8096 7.81689,-0.8096 5.11491,0 5.70336,0.049 7.40833,0.61725 1.01865,0.33949 2.50693,0.98461 3.30729,1.43361 1.95433,1.09635 5.49766,4.70914 6.48647,6.61361 0.77888,1.50014 1.10343,1.75936 1.59655,1.2752 0.13825,-0.13574 1.20386,-0.57415 2.36802,-0.97425 1.93348,-0.6645 2.53374,-0.73723 6.93578,-0.84037 6.14158,-0.14389 7.77359,0.1253 11.884,1.96018 0.16543,0.0738 0.74503,-0.66422 1.29773,-1.65253 1.94255,-3.47361 5.83427,-6.59557 9.78041,-7.84588 1.66241,-0.52673 2.40753,-0.58682 7.27604,-0.58682 5.00691,0 5.58516,0.0498 7.5205,0.64751 4.18556,1.29272 7.95888,4.5397 9.93527,8.54942 1.59819,3.24244 1.84887,4.86956 1.85422,12.03588 0.004,5.80211 -0.0254,6.18162 -0.52458,6.68073 -0.51585,0.51585 -0.88194,0.52916 -14.55208,0.52916 h -14.02291 v 6.61459 c 0,6.2618 -0.0282,6.6428 -0.52917,7.14375 -0.51894,0.51894 -0.88194,0.52916 -18.78542,0.52916 -17.90347,0 -18.26647,-0.0102 -18.78541,-0.52916 z m 34.925,-10.67951 c 0,-4.41853 -0.11892,-8.67501 -0.26427,-9.45886 -0.92795,-5.00448 -5.38775,-9.46305 -10.53053,-10.52764 -2.11935,-0.43872 -9.4201,-0.37136 -11.24415,0.10375 -4.89547,1.27511 -8.57112,4.95075 -9.84623,9.84623 -0.30831,1.18367 -0.39399,3.31304 -0.39399,9.79141 v 8.27878 h 16.13958 16.13959 z m -35.44958,-7.3783 c 0.0136,-3.32056 1.90888,-8.07737 4.21295,-10.57354 l 1.29121,-1.39886 -0.96844,-1.85179 c -1.73431,-3.31627 -5.01911,-5.92487 -8.65234,-6.87121 -1.86799,-0.48654 -8.88562,-0.55832 -11.02234,-0.11274 -5.00172,1.04305 -9.45936,5.50069 -10.5024,10.50241 -0.16082,0.77115 -0.29239,3.65841 -0.29239,6.41614 v 5.01406 h 12.96458 12.96458 l 0.005,-1.12447 z m 64.55374,-3.97931 c 0,-7.39237 -0.71201,-9.66837 -4.08077,-13.04459 -2.02881,-2.0333 -4.20822,-3.26169 -6.71402,-3.78424 -2.11973,-0.44204 -9.15406,-0.37388 -10.99866,0.10658 -3.71513,0.96766 -7.13017,3.64568 -8.85914,6.94719 l -0.86808,1.65761 1.35719,1.51739 c 2.38719,2.66895 4.21609,7.24339 4.22972,10.57937 l 0.005,1.12447 h 12.96458 12.96458 z m -48.08417,-15.67701 c -2.16276,-0.58246 -4.00134,-1.63687 -5.5438,-3.17934 -1.42485,-1.42484 -2.84167,-3.94313 -3.15461,-5.60705 l -0.16172,-0.8599 h -5.26977 -5.26976 l -1.57106,0.79307 c -3.31144,1.67161 -7.3311,1.66829 -10.68729,-0.009 l -1.56941,-0.78426 h -9.21816 c -8.865378,0 -9.238408,-0.0203 -9.747318,-0.52916 -0.52407,-0.52408 -0.52917,-0.88195 -0.52917,-37.17396 0,-36.29201 0.005,-36.64988 0.52917,-37.17396 0.52574,-0.52574 0.88194,-0.52916 55.033318,-0.52916 54.15139,0 54.50759,0.003 55.03333,0.52916 0.52408,0.52408 0.52917,0.88195 0.52917,37.17396 0,36.29201 -0.005,36.64988 -0.52917,37.17396 -0.50898,0.50899 -0.88194,0.52916 -9.78166,0.52916 h -9.25251 l -1.54748,0.78638 c -3.29791,1.67587 -7.37039,1.67713 -10.80394,0.003 l -1.61997,-0.78971 h -5.15582 -5.15583 l -0.56619,1.72473 c -0.3114,0.9486 -0.87505,2.214 -1.25256,2.81201 -2.66105,4.21537 -8.04249,6.37405 -12.73779,5.10955 z m 6.31602,-3.53707 c 2.70283,-1.28442 4.49974,-3.61612 4.92275,-6.38785 0.60708,-3.97776 -1.26042,-7.49862 -4.93877,-9.31125 -1.60673,-0.79177 -4.83065,-0.83309 -6.7661,-0.0867 -1.73721,0.66993 -3.88504,2.72511 -4.66506,4.46382 -0.83379,1.85858 -0.85659,5.04482 -0.0489,6.83265 1.02092,2.25978 3.09834,4.12181 5.46042,4.89426 1.57713,0.51575 4.51269,0.31881 6.03566,-0.40493 z m -29.57421,-7.70554 c 2.77323,-1.0376 4.87068,-3.5972 5.41306,-6.60576 0.98228,-5.44876 -3.54681,-10.43272 -9.07715,-9.9888 -3.84824,0.3089 -6.73022,2.77705 -7.71045,6.60328 -1.67555,6.54029 4.97787,12.38458 11.37454,9.99128 z m 58.99513,-0.35488 c 2.8441,-1.39149 4.43803,-3.87115 4.61336,-7.17692 0.14632,-2.75908 -0.51669,-4.63323 -2.2743,-6.42883 -1.87637,-1.91692 -3.39851,-2.55257 -6.13141,-2.56049 -1.92974,-0.006 -2.46083,0.0975 -3.74161,0.72651 -1.74917,0.85899 -3.48497,2.63759 -4.27445,4.37987 -0.78108,1.72372 -0.78411,4.97727 -0.006,6.69345 1.02531,2.26207 3.10127,4.12217 5.46224,4.89426 1.72866,0.56531 4.60691,0.32614 6.35241,-0.52785 z m -72.05484,-1.43546 c 0,-0.11642 -0.11982,-0.33148 -0.26626,-0.47792 -0.14643,-0.14644 -0.49415,-0.9144 -0.7727,-1.70657 l -0.50645,-1.44031 -3.61505,-0.13229 c -3.1843,-0.11652 -3.65971,-0.19348 -3.9898,-0.64588 -0.31795,-0.43575 -0.37474,-4.97698 -0.37474,-29.96406 0,-29.09769 0.006,-29.45681 0.52916,-29.97964 0.52525,-0.52524 0.88195,-0.52916 48.15416,-0.52916 47.27222,0 47.62892,0.004 48.15417,0.52916 0.52284,0.52284 0.52916,0.88195 0.52916,30.03021 0,29.14826 -0.006,29.50737 -0.52916,30.03021 -0.47629,0.47628 -0.88195,0.52916 -4.05916,0.52916 h -3.53 l -0.32906,1.12448 c -0.18098,0.61847 -0.553,1.51143 -0.8267,1.98438 l -0.49765,0.85989 h 6.73795 6.73795 V 166.08794 131.55982 H 151.0101 98.622612 v 34.52812 34.52812 h 6.614578 c 3.63802,0 6.61459,-0.0952 6.61459,-0.21166 z m 27.5253,-0.38365 c 0.005,-0.32742 0.22457,-1.22039 0.4885,-1.98437 l 0.47988,-1.38907 h -3.48934 -3.48934 l -0.32906,1.12448 c -0.18098,0.61847 -0.553,1.51143 -0.8267,1.98438 l -0.49765,0.85989 h 3.82753 c 3.79035,0 3.82762,-0.006 3.83618,-0.59531 z m 30.24847,-0.26458 c -0.24647,-0.47295 -0.58992,-1.33615 -0.76322,-1.91823 l -0.31509,-1.05834 -3.50824,-0.074 c -3.27839,-0.0692 -3.49491,-0.0432 -3.30479,0.39688 0.1119,0.259 0.39134,1.15552 0.62098,1.99227 l 0.41752,1.52135 h 3.65049 3.65049 z m -59.48658,-7.01146 c 0.92708,-4.51618 3.04644,-7.43435 6.6106,-9.10223 3.49938,-1.63755 6.82116,-1.6339 10.33701,0.0114 3.1898,1.49268 5.98717,5.19518 6.3705,8.43174 l 0.16423,1.38673 h 4.43448 4.43447 l 1.34577,-0.90563 c 2.44217,-1.64347 4.04429,-2.11319 7.17407,-2.10334 3.181,0.01 4.98716,0.55146 7.02285,2.10534 l 1.18382,0.90363 h 4.4612 4.4612 l 0.30726,-1.56175 c 0.64416,-3.27424 3.20631,-6.74567 6.04917,-8.19599 7.00876,-3.5756 15.62891,0.53614 17.07483,8.14454 l 0.30658,1.6132 h 2.32071 2.32072 V 166.08794 138.70357 H 151.0101 105.50178 v 27.38437 27.38437 h 2.24391 c 2.23532,0 2.24449,-0.003 2.39328,-0.7276 z"
         id="path913"
         inkscape:connector-curvature="0"
         sodipodi:nodetypes="cscsccsssccscsccccsccccscscscscsccscccscccccccsccccccsscccccccccccccccsccscscscscsccccccccccccscccccscscscccccccsccscccccscscscsccccccccccccssccccccccsccccccccccccccccccccsccccsccccccccccsc" />
      <g
         id="g1065-3"
         transform="matrix(0.08744656,0,0,0.08744656,131.19859,142.50882)"
         style="fill:#ff4500;fill-opacity:1">
        <g
           id="g936-6"
           style="fill:#ff4500;fill-opacity:1">
          <g
             id="g934-7"
             style="fill:#ff4500;fill-opacity:1">
            <path
               id="path932-5"
               d="m 181.956,102.43 c -17.275,0 -31.28,14.005 -31.28,31.28 0.044,17.257 14.023,31.236 31.28,31.28 17.275,0 31.28,-14.005 31.28,-31.28 0,-17.275 -14.005,-31.28 -31.28,-31.28 z m 0,46.48 c -8.439,0 -15.28,-6.841 -15.28,-15.28 0,-8.439 6.841,-15.28 15.28,-15.28 8.439,0 15.28,6.841 15.28,15.28 0,8.439 -6.841,15.28 -15.28,15.28 z"
               inkscape:connector-curvature="0"
               style="fill:#ff4500;fill-opacity:1" />
          </g>
        </g>
        <g
           id="g942-3"
           style="fill:#ff4500;fill-opacity:1">
          <g
             id="g940-5"
             style="fill:#ff4500;fill-opacity:1">
            <path
               id="path938-6"
               d="m 271.076,102.43 c -17.275,0 -31.28,14.005 -31.28,31.28 0.044,17.257 14.023,31.236 31.28,31.28 17.276,0 31.28,-14.005 31.28,-31.28 0,-17.275 -14.005,-31.28 -31.28,-31.28 z m 0,46.48 c -8.439,0 -15.28,-6.841 -15.28,-15.28 0,-8.439 6.841,-15.28 15.28,-15.28 8.439,0 15.28,6.841 15.28,15.28 0,8.439 -6.841,15.28 -15.28,15.28 z"
               inkscape:connector-curvature="0"
               style="fill:#ff4500;fill-opacity:1" />
          </g>
        </g>
        <g
           id="g948-2"
           style="fill:#ff4500;fill-opacity:1">
          <g
             id="g946-9"
             style="fill:#ff4500;fill-opacity:1">
            <path
               id="path944-1"
               d="m 366.525,138.427 c -3.332,-18.73 -18.424,-33.137 -37.289,-35.597 -5.2,-19.04 -20.08,-35.2 -49.84,-35.2 h -44.88 V 50.91 C 248.225,46.492 255.757,31.796 251.339,18.087 246.92,4.378 232.225,-3.154 218.516,1.264 c -13.709,4.418 -21.241,19.113 -16.823,32.823 2.574,7.988 8.835,14.248 16.823,16.823 v 16 h -44.96 c -21.04,0 -43.28,9.68 -50,35.2 -23.871,3.164 -40.657,25.08 -37.493,48.951 2.499,18.851 16.926,33.908 35.653,37.209 v 0.72 c 2.48,34.24 27.92,46.64 51.84,46.64 h 105.84 c 35.68,0 50,-23.2 51.84,-46.64 23.707,-4.218 39.507,-26.856 35.289,-50.563 z M 121.476,172.43 c -14.558,-4.366 -22.82,-19.708 -18.454,-34.266 2.658,-8.863 9.592,-15.796 18.454,-18.454 z m 94.88,-145.52 c -0.221,-5.563 4.11,-10.251 9.672,-10.472 5.562,-0.221 10.251,4.11 10.472,9.672 0.221,5.563 -4.11,10.251 -9.672,10.472 -0.104,0.004 -0.208,0.007 -0.312,0.008 -5.429,0.006 -9.904,-4.257 -10.16,-9.68 z m 99.12,156.8 c 0,13.52 -4.72,36.08 -36.08,36.08 h -105.84 c -13.52,0 -36.08,-4.72 -36.08,-36.08 v -64 c 0,-31.44 22.64,-36.08 36.08,-36.08 h 105.84 c 31.44,0 36.08,22.64 36.08,36.08 z m 34.534,-29.735 c -2.658,8.863 -9.592,15.796 -18.454,18.454 v -52.72 c 14.558,4.367 22.82,19.708 18.454,34.266 z"
               inkscape:connector-curvature="0"
               style="fill:#ff4500;fill-opacity:1" />
          </g>
        </g>
        <g
           id="g954-2"
           style="fill:#ff4500;fill-opacity:1">
          <g
             id="g952-7"
             style="fill:#ff4500;fill-opacity:1">
            <path
               id="path950-0"
               d="m 271.076,185.79 h -89.12 c -4.418,0 -8,3.582 -8,8 0,4.418 3.582,8 8,8 h 89.12 c 4.418,0 8,-3.582 8,-8 0,-4.418 -3.582,-8 -8,-8 z"
               inkscape:connector-curvature="0"
               style="fill:#ff4500;fill-opacity:1" />
          </g>
        </g>
        <g
           id="g966-9"
           style="fill:#ff4500;fill-opacity:1">
          <g
             id="g964-3"
             style="fill:#ff4500;fill-opacity:1">
            <path
               id="path962-6"
               d="m 138.516,390.19 v 0 c -11.797,0 -21.36,9.563 -21.36,21.36 0,11.797 9.563,21.36 21.36,21.36 11.797,0 21.36,-9.563 21.36,-21.36 0,-11.797 -9.563,-21.36 -21.36,-21.36 z m 0,26.72 c -2.96,0 -5.36,-2.4 -5.36,-5.36 0,-2.96 2.4,-5.36 5.36,-5.36 2.96,0 5.36,2.4 5.36,5.36 0,2.96 -2.4,5.36 -5.36,5.36 z"
               inkscape:connector-curvature="0"
               style="fill:#ff4500;fill-opacity:1" />
          </g>
        </g>
        <g
           id="g972-0"
           style="fill:#ff4500;fill-opacity:1">
          <g
             id="g970-6"
             style="fill:#ff4500;fill-opacity:1">
            <path
               id="path968-2"
               d="m 226.516,390.19 v 0 c -11.797,0 -21.36,9.563 -21.36,21.36 0,11.797 9.563,21.36 21.36,21.36 11.797,0 21.36,-9.563 21.36,-21.36 0,-11.797 -9.563,-21.36 -21.36,-21.36 z m 5.36,21.36 c 0,2.96 -2.4,5.36 -5.36,5.36 -2.96,0 -5.36,-2.4 -5.36,-5.36 0,-2.96 2.4,-5.36 5.36,-5.36 2.96,0 5.36,2.399 5.36,5.36 z"
               inkscape:connector-curvature="0"
               style="fill:#ff4500;fill-opacity:1" />
          </g>
        </g>
        <g
           id="g978-6"
           style="fill:#ff4500;fill-opacity:1">
          <g
             id="g976-1"
             style="fill:#ff4500;fill-opacity:1">
            <path
               id="path974-8"
               d="m 314.516,390.19 c -11.797,-0.044 -21.396,9.483 -21.44,21.28 0,0.027 0,0.053 0,0.08 0,11.797 9.563,21.36 21.36,21.36 11.797,0 21.36,-9.563 21.36,-21.36 0,-11.766 -9.515,-21.316 -21.28,-21.36 z m -0.08,26.72 c -2.96,0 -5.36,-2.4 -5.36,-5.36 0,-2.96 2.4,-5.36 5.36,-5.36 v 0 c 2.96,0 5.36,2.4 5.36,5.36 0,2.96 -2.4,5.36 -5.36,5.36 z"
               inkscape:connector-curvature="0"
               style="fill:#ff4500;fill-opacity:1" />
          </g>
        </g>
        <g
           id="g984-7"
           style="fill:#ff4500;fill-opacity:1">
          <g
             id="g982-9"
             style="fill:#ff4500;fill-opacity:1">
            <path
               id="path980-2"
               d="m 403.796,297.87 v 0 l -6.48,-11.68 c -26.08,-45.84 -78.4,-43.28 -82.8,-43.28 h -176 c -4.72,0 -56.96,-2.88 -83.2,43.04 l -6.4,11.6 c -14.597,2.581 -25.188,15.337 -25.04,30.16 0,4.418 3.582,8 8,8 4.418,0 8,-3.582 8,-8 0,-7.931 6.429,-14.36 14.36,-14.36 7.931,0 14.36,6.429 14.36,14.36 0,4.418 3.582,8 8,8 4.418,0 8,-3.582 8,-8 -0.013,-12.013 -7.098,-22.892 -18.08,-27.76 l 3.2,-5.76 c 11.081,-18.788 30.269,-31.354 51.92,-34 v 109.12 h -0.4 c -23.13,1.011 -41.06,20.581 -40.049,43.711 0.949,21.713 18.336,39.1 40.049,40.049 h 210.72 c 23.13,1.011 42.7,-16.92 43.711,-40.049 1.011,-23.13 -16.92,-42.7 -40.049,-43.711 -1.22,-0.053 -2.441,-0.053 -3.661,0 h -0.4 V 260.19 c 21.608,2.646 40.776,15.139 51.92,33.84 l 3.28,5.92 c -11.045,4.82 -18.2,15.709 -18.24,27.76 0,4.418 3.582,8 8,8 4.418,0 8,-3.582 8,-8 0,-7.931 6.429,-14.36 14.36,-14.36 7.931,0 14.36,6.429 14.36,14.36 0,4.418 3.582,8 8,8 4.418,0 8,-3.582 8,-8 -0.042,-14.83 -10.805,-27.453 -25.441,-29.84 z m -265.92,-38.96 h 177.68 v 110.4 h -177.68 z m 194.08,126.72 c 14.293,-0.795 26.524,10.148 27.319,24.441 0.795,14.293 -10.148,26.524 -24.441,27.319 -0.959,0.053 -1.92,0.053 -2.879,0 h -210.88 c -14.293,-0.795 -25.236,-13.026 -24.441,-27.319 0.733,-13.183 11.258,-23.708 24.441,-24.441 z"
               inkscape:connector-curvature="0"
               style="fill:#ff4500;fill-opacity:1;stroke:none;stroke-width:0.99782026;stroke-miterlimit:4;stroke-dasharray:none;stroke-opacity:1" />
          </g>
        </g>
        <g
           id="g986-0"
           style="fill:#ff4500;fill-opacity:1" />
        <g
           id="g988-2"
           style="fill:#ff4500;fill-opacity:1" />
        <g
           id="g990-3"
           style="fill:#ff4500;fill-opacity:1" />
        <g
           id="g992-7"
           style="fill:#ff4500;fill-opacity:1" />
        <g
           id="g994-5"
           style="fill:#ff4500;fill-opacity:1" />
        <g
           id="g996-9"
           style="fill:#ff4500;fill-opacity:1" />
        <g
           id="g998-2"
           style="fill:#ff4500;fill-opacity:1" />
        <g
           id="g1000-2"
           style="fill:#ff4500;fill-opacity:1" />
        <g
           id="g1002-8"
           style="fill:#ff4500;fill-opacity:1" />
        <g
           id="g1004-9"
           style="fill:#ff4500;fill-opacity:1" />
        <g
           id="g1006-7"
           style="fill:#ff4500;fill-opacity:1" />
        <g
           id="g1008-3"
           style="fill:#ff4500;fill-opacity:1" />
        <g
           id="g1010-6"
           style="fill:#ff4500;fill-opacity:1" />
        <g
           id="g1012-1"
           style="fill:#ff4500;fill-opacity:1" />
        <g
           id="g1014-2"
           style="fill:#ff4500;fill-opacity:1" />
      </g>
    </g>
  </g>
</svg>
