<?xml version="1.0" encoding="UTF-8" standalone="no"?>
<!-- Created with Inkscape (http://www.inkscape.org/) -->

<svg
   xmlns:dc="http://purl.org/dc/elements/1.1/"
   xmlns:cc="http://creativecommons.org/ns#"
   xmlns:rdf="http://www.w3.org/1999/02/22-rdf-syntax-ns#"
   xmlns:svg="http://www.w3.org/2000/svg"
   xmlns="http://www.w3.org/2000/svg"
   xmlns:sodipodi="http://sodipodi.sourceforge.net/DTD/sodipodi-0.dtd"
   xmlns:inkscape="http://www.inkscape.org/namespaces/inkscape"
   width="297mm"
   height="210mm"
   viewBox="0 0 297 210"
   version="1.1"
   id="svg8"
   inkscape:version="0.92.3 (2405546, 2018-03-11)"
   sodipodi:docname="Conclusion.svg">
  <defs
     id="defs2" />
  <sodipodi:namedview
     id="base"
     pagecolor="#ffffff"
     bordercolor="#666666"
     borderopacity="1.0"
     inkscape:pageopacity="0.0"
     inkscape:pageshadow="2"
     inkscape:zoom="0.7"
     inkscape:cx="352.60325"
     inkscape:cy="486.14891"
     inkscape:document-units="mm"
     inkscape:current-layer="layer1"
     showgrid="false"
     inkscape:window-width="1853"
     inkscape:window-height="1025"
     inkscape:window-x="1987"
     inkscape:window-y="27"
     inkscape:window-maximized="1" />
  <metadata
     id="metadata5">
    <rdf:RDF>
      <cc:Work
         rdf:about="">
        <dc:format>image/svg+xml</dc:format>
        <dc:type
           rdf:resource="http://purl.org/dc/dcmitype/StillImage" />
        <dc:title></dc:title>
      </cc:Work>
    </rdf:RDF>
  </metadata>
  <g
     inkscape:label="Layer 1"
     inkscape:groupmode="layer"
     id="layer1"
     transform="translate(0,-87)">
    <path
       style="fill:#000000;stroke-width:0.33866665"
       d="m 126.77255,276.33529 c -1.41237,-0.68388 -1.47797,-1.38921 -1.47797,-15.89011 0,-15.05893 -0.15737,-16.78316 -1.9376,-21.23009 -0.992,-2.47799 -3.48317,-6.36438 -5.39538,-8.41717 -0.71666,-0.76935 -2.82702,-2.70561 -4.68969,-4.30282 -9.80937,-8.41139 -16.260735,-19.91065 -18.461265,-32.90637 -0.97385,-5.75125 -0.83582,-15.00022 0.30272,-20.28428 4.87885,-22.64332 21.661175,-39.24427 44.405215,-43.92532 5.53293,-1.13876 15.30464,-1.15351 20.91449,-0.0316 11.11305,2.22254 20.94584,7.39535 28.73685,15.11781 7.35514,7.29042 11.96361,15.05448 14.83219,24.98838 1.49276,5.16939 1.99544,9.83721 1.79677,16.68433 -0.26815,9.24151 -1.75366,15.19363 -5.83213,23.36799 -2.77319,5.55824 -6.53718,10.65081 -11.06296,14.96786 -8.01637,7.64665 -9.17886,8.94785 -10.83864,12.13199 -3.08461,5.91753 -3.10559,6.06512 -3.22578,22.68415 -0.0579,8.00947 -0.18204,14.90135 -0.27582,15.31529 -0.0938,0.41395 -0.5022,1.06165 -0.9076,1.43933 -0.72578,0.67617 -1.08577,0.68636 -23.44857,0.66379 -14.9032,-0.015 -22.96016,-0.14334 -23.43483,-0.37318 z m 42.21002,-13.65856 v -8.29734 h -18.96533 -18.96533 v 8.29734 8.29733 h 18.96533 18.96533 z m 0.466,-16.41054 c 0.69045,-8.27908 5.20875,-16.74072 11.99114,-22.45641 9.88912,-8.3338 15.99328,-18.56291 18.23632,-30.55971 0.85756,-4.58657 0.85844,-13.62307 0.002,-17.93705 -4.09445,-20.61855 -19.26046,-35.98936 -39.83915,-40.37716 -2.24667,-0.47903 -4.40292,-0.61379 -9.82134,-0.61379 -6.03428,0 -7.40793,0.10349 -10.49866,0.79096 -10.08206,2.24254 -18.58777,7.06108 -25.94159,14.69608 -6.86963,7.13228 -11.26727,15.71785 -13.23063,25.83029 -0.887585,4.57159 -0.805965,13.7741 0.16241,18.30989 1.50396,7.04446 4.12775,13.29628 7.91028,18.84821 2.15271,3.1597 6.83806,8.13212 11.33916,12.03393 5.95943,5.16595 10.24449,13.58545 10.83694,21.29291 l 0.21802,2.83639 h 19.20534 19.20535 z M 143.32145,228.0754 c -0.83212,-0.33481 -1.35597,-2.00504 -1.59695,-5.09165 l -0.24335,-3.11698 -1.74329,-0.57052 c -0.9588,-0.31378 -2.4729,-0.9359 -3.36465,-1.38249 -1.82038,-0.91164 -1.73905,-0.93584 -4.33828,1.29102 -2.50577,2.1468 -3.42146,2.48427 -4.87245,1.79573 -0.61782,-0.29317 -2.89104,-2.33885 -5.05161,-4.54595 -4.89227,-4.99766 -4.92761,-5.16374 -1.88614,-8.8656 1.14822,-1.39754 1.97328,-2.70793 1.88482,-2.99356 -0.7095,-2.29102 -2.65586,-6.30357 -3.15168,-6.49739 -0.33328,-0.13028 -1.78249,-0.33444 -3.22048,-0.45369 -1.85252,-0.15362 -2.86423,-0.41324 -3.47133,-0.89078 l -0.85681,-0.67397 v -6.38239 c 0,-3.51031 0.0947,-6.62908 0.21037,-6.93061 0.35707,-0.93051 1.86532,-1.44536 4.97732,-1.69904 2.33174,-0.19007 3.02828,-0.36627 3.17756,-0.80378 0.16964,-0.49717 1.16745,-2.97497 2.21816,-5.50824 0.336,-0.81012 0.1923,-1.09096 -1.72174,-3.36484 -3.16142,-3.75576 -3.14799,-3.80792 2.41285,-9.36875 5.51706,-5.51706 5.42725,-5.49442 9.32223,-2.34984 l 2.66472,2.15135 1.32326,-0.69036 c 0.7278,-0.37969 2.23766,-1.02579 3.35526,-1.43576 l 2.032,-0.7454 0.38323,-3.49093 c 0.53809,-4.90156 0.20169,-4.71358 8.43504,-4.71358 h 6.5419 l 0.66777,0.84893 c 0.45467,0.57802 0.73837,1.63176 0.88901,3.302 0.37205,4.12543 0.39039,4.16844 1.97992,4.6441 0.78272,0.23423 2.26495,0.85056 3.29383,1.36961 l 1.8707,0.94374 2.64378,-2.16752 c 3.85372,-3.15951 3.76569,-3.18149 9.27361,2.3151 5.55269,5.54126 5.57347,5.62143 2.42585,9.3608 -1.31914,1.56713 -2.00445,2.66112 -1.8957,3.02617 0.0937,0.31445 0.63269,1.63854 1.19779,2.9424 0.5651,1.30387 1.10127,2.61834 1.1915,2.92104 0.12752,0.42782 0.82991,0.60561 3.15424,0.79841 3.10851,0.25784 4.62214,0.7788 4.98116,1.71439 0.1157,0.30153 0.21037,3.4203 0.21037,6.93061 v 6.38239 l -0.85987,0.67637 c -0.56858,0.44725 -1.6298,0.74937 -3.13266,0.89186 -3.57788,0.33922 -4.08495,0.49167 -4.31893,1.29847 -0.11778,0.40615 -0.75316,1.90856 -1.41195,3.33869 l -1.1978,2.60023 1.93307,2.2786 c 2.1315,2.51249 2.6775,3.5941 2.35894,4.673 -0.26543,0.89894 -7.7684,8.54605 -9.05106,9.22494 -1.29315,0.68445 -2.02026,0.39216 -4.89454,-1.96752 l -2.45615,-2.0164 -2.11585,0.99247 c -1.16373,0.54586 -2.68743,1.17816 -3.38602,1.40511 -1.42771,0.46382 -1.46582,0.56061 -1.79436,4.55754 -0.17924,2.18058 -0.36687,2.82064 -1.01757,3.47134 -0.78348,0.78348 -0.912,0.79731 -7.16319,0.77105 -3.50096,-0.0147 -6.5591,-0.10467 -6.79585,-0.19992 z m 9.52694,-6.12334 c 0.0966,-0.51223 0.27133,-1.94227 0.38831,-3.17787 0.26844,-2.83565 0.76782,-3.38541 3.95275,-4.35148 1.36389,-0.4137 3.80033,-1.42865 5.41431,-2.25543 2.03835,-1.04417 3.17603,-1.442 3.72534,-1.30269 0.43494,0.1103 1.78141,1.02379 2.99214,2.02996 l 2.20133,1.8294 1.93967,-1.91342 c 1.66171,-1.63923 1.8764,-1.98882 1.4982,-2.43961 -2.1881,-2.6081 -3.22934,-4.03119 -3.42541,-4.68164 -0.16731,-0.55504 0.18935,-1.59079 1.2828,-3.72534 0.833,-1.6261 1.85615,-4.08276 2.27368,-5.45925 0.99079,-3.26638 1.41022,-3.6509 4.27487,-3.91909 4.11973,-0.3857 3.84019,-0.15009 3.84019,-3.23665 0,-2.34273 -0.079,-2.70487 -0.59266,-2.71776 -0.32597,-0.008 -1.70508,-0.14375 -3.06469,-0.30128 -2.86596,-0.33205 -3.63838,-0.86633 -4.14969,-2.87029 -0.57956,-2.27147 -1.70772,-4.98924 -2.91315,-7.01785 -0.62323,-1.04884 -1.13314,-2.29253 -1.13314,-2.76378 0,-0.54485 0.73788,-1.75987 2.02664,-3.33714 l 2.02663,-2.48035 -1.76106,-1.78322 c -0.96859,-0.98077 -1.88464,-1.78321 -2.03567,-1.78321 -0.15103,0 -1.29079,0.8382 -2.5328,1.86266 -1.50023,1.23747 -2.56426,1.86267 -3.17007,1.86267 -0.50153,0 -2.18638,-0.67259 -3.7441,-1.49464 -1.55773,-0.82206 -3.93802,-1.81938 -5.28954,-2.21627 -2.93666,-0.86238 -3.39212,-1.41508 -3.65921,-4.44046 -0.34947,-3.95868 -0.12921,-3.70196 -3.17631,-3.70196 h -2.67593 l -0.2169,2.286 c -0.4302,4.53409 -0.82504,5.13645 -3.82546,5.83595 -0.98291,0.22915 -3.26891,1.16128 -5.08,2.0714 -1.81108,0.91011 -3.59768,1.65493 -3.97022,1.65514 -0.75837,3.4e-4 -1.70497,-0.58601 -3.95548,-2.45049 -0.84312,-0.6985 -1.67485,-1.27 -1.8483,-1.27 -0.17344,0 -1.09916,0.8001 -2.05714,1.778 l -1.74178,1.778 2.00735,2.47283 c 1.17179,1.44352 2.00735,2.80207 2.00735,3.26377 0,0.43501 -0.67258,2.06544 -1.49464,3.62316 -0.82205,1.55773 -1.81186,3.9128 -2.19957,5.23348 -0.3877,1.32069 -1.0057,2.67345 -1.37332,3.00614 -0.45637,0.41301 -1.63871,0.71323 -3.7271,0.94639 l -3.0587,0.3415 v 2.62746 c 0,2.94136 0.0746,3.03289 2.48303,3.04668 1.88306,0.0108 3.93635,0.50883 4.52516,1.09763 0.26301,0.26301 0.70594,1.37913 0.98427,2.48025 0.27834,1.10112 1.28128,3.54875 2.22877,5.43917 1.28612,2.56606 1.66773,3.65617 1.50577,4.30143 -0.1193,0.47536 -1.0439,1.8391 -2.05467,3.03053 l -1.83774,2.16623 1.94893,1.92859 1.94892,1.92859 2.29083,-1.87776 c 1.25995,-1.03276 2.63888,-1.96511 3.06427,-2.07187 0.53202,-0.13353 1.65933,0.28069 3.61161,1.32708 1.561,0.83666 3.86867,1.83438 5.12815,2.21716 1.25948,0.38278 2.58761,0.85526 2.95139,1.04995 0.78087,0.41791 1.26129,2.02274 1.54736,5.16894 l 0.20786,2.286 h 2.65547 c 2.62852,0 2.65725,-0.009 2.8311,-0.93134 z m -7.23381,-12.80282 c -7.61041,-1.63285 -13.84232,-8.10677 -15.42818,-16.0273 -1.73735,-8.67722 2.82837,-17.89005 10.73012,-21.65151 3.51727,-1.67431 5.73939,-2.19786 9.24729,-2.17871 9.0262,0.0493 16.71109,5.9283 19.36486,14.81435 0.93855,3.14268 0.80006,8.07581 -0.32325,11.51466 -3.23801,9.91274 -13.36793,15.72189 -23.59084,13.52851 z m 8.70974,-5.74216 c 2.57725,-0.76536 5.71398,-3.02371 7.42154,-5.34327 6.43718,-8.74428 1.32091,-21.17336 -9.4771,-23.02298 -10.39618,-1.78079 -19.27933,8.4478 -16.18474,18.63606 1.34107,4.4152 4.74543,7.94809 9.20372,9.55121 2.28495,0.82163 6.58571,0.90681 9.03658,0.17898 z M 69.473615,193.3129 c -1.00971,-1.07478 -0.96815,-2.74052 0.0949,-3.80356 0.82667,-0.82668 0.86842,-0.83127 7.54464,-0.83127 7.25122,0 7.90381,0.14355 8.56559,1.88417 0.38068,1.00126 -0.18466,2.74653 -1.03753,3.20297 -0.34597,0.18516 -3.66834,0.33152 -7.52535,0.33152 -6.78076,0 -6.91923,-0.0142 -7.64226,-0.78383 z m 144.967835,0.55717 c -0.72916,-0.29338 -1.46246,-2.0749 -1.23201,-2.99311 0.11802,-0.47021 0.59901,-1.15733 1.06886,-1.52692 0.78704,-0.61908 1.38501,-0.67197 7.59734,-0.67197 6.70773,0 6.74741,0.004 7.57432,0.83127 1.09992,1.09992 1.12139,2.84211 0.0474,3.85103 -0.75411,0.70844 -1.04623,0.73535 -7.70467,0.70962 -3.80646,-0.0147 -7.11454,-0.10467 -7.35129,-0.19992 z M 91.846855,137.11183 c -4.39719,-4.40505 -4.82161,-4.93646 -4.82161,-6.03696 0,-1.56428 1.13132,-2.67947 2.71824,-2.67947 1.02888,0 1.66246,0.51187 5.98951,4.83892 4.402285,4.40228 4.838915,4.94702 4.838915,6.03696 0,1.56302 -1.134625,2.67079 -2.735545,2.67079 -1.05144,0 -1.64864,-0.48161 -5.98951,-4.83024 z m 108.013415,4.04641 c -0.45774,-0.48724 -0.73636,-1.21918 -0.73636,-1.93442 0,-1.02888 0.51186,-1.66245 4.83891,-5.9895 4.40228,-4.40228 4.94702,-4.83892 6.03697,-4.83892 1.56302,0 2.67078,1.13463 2.67078,2.73554 0,1.05144 -0.48161,1.64864 -4.83024,5.98951 -4.40505,4.3972 -4.93645,4.82162 -6.03696,4.82162 -0.82349,0 -1.44058,-0.24893 -1.9431,-0.78383 z M 147.80052,119.7748 c -0.82876,-0.82876 -0.83128,-0.85237 -0.83128,-7.80473 0,-6.95235 0.002,-6.97596 0.83128,-7.80472 1.09976,-1.09977 2.65635,-1.09977 3.75611,0 0.82876,0.82876 0.83128,0.85237 0.83128,7.80472 0,6.95236 -0.002,6.97597 -0.83128,7.80473 -0.52399,0.524 -1.21821,0.83127 -1.87805,0.83127 -0.65985,0 -1.35407,-0.30727 -1.87806,-0.83127 z"
       id="path1007"
       inkscape:connector-curvature="0" />
  </g>
</svg>
