<?xml version="1.0" encoding="UTF-8" standalone="no"?>
<!-- Created with Inkscape (http://www.inkscape.org/) -->

<svg
   xmlns:dc="http://purl.org/dc/elements/1.1/"
   xmlns:cc="http://creativecommons.org/ns#"
   xmlns:rdf="http://www.w3.org/1999/02/22-rdf-syntax-ns#"
   xmlns:svg="http://www.w3.org/2000/svg"
   xmlns="http://www.w3.org/2000/svg"
   xmlns:sodipodi="http://sodipodi.sourceforge.net/DTD/sodipodi-0.dtd"
   xmlns:inkscape="http://www.inkscape.org/namespaces/inkscape"
   width="57.694542mm"
   height="75.281815mm"
   viewBox="0 0 57.694543 75.281815"
   version="1.1"
   id="svg8"
   inkscape:version="0.92.3 (2405546, 2018-03-11)"
   sodipodi:docname="architecture_level_2.svg">
  <defs
     id="defs2">
    <inkscape:path-effect
       only_selected="false"
       apply_with_weight="true"
       apply_no_weight="true"
       helper_size="0"
       steps="2"
       weight="33.333333"
       is_visible="true"
       id="path-effect843"
       effect="bspline" />
    <inkscape:path-effect
       only_selected="false"
       apply_with_weight="true"
       apply_no_weight="true"
       helper_size="0"
       steps="2"
       weight="33.333333"
       is_visible="true"
       id="path-effect843-3"
       effect="bspline" />
    <inkscape:path-effect
       only_selected="false"
       apply_with_weight="true"
       apply_no_weight="true"
       helper_size="0"
       steps="2"
       weight="33.333333"
       is_visible="true"
       id="path-effect843-7"
       effect="bspline" />
    <inkscape:path-effect
       only_selected="false"
       apply_with_weight="true"
       apply_no_weight="true"
       helper_size="0"
       steps="2"
       weight="33.333333"
       is_visible="true"
       id="path-effect843-35"
       effect="bspline" />
  </defs>
  <sodipodi:namedview
     id="base"
     pagecolor="#ffffff"
     bordercolor="#666666"
     borderopacity="1.0"
     inkscape:pageopacity="0.0"
     inkscape:pageshadow="2"
     inkscape:zoom="3.959798"
     inkscape:cx="92.380987"
     inkscape:cy="103.86296"
     inkscape:document-units="mm"
     inkscape:current-layer="layer1-3"
     showgrid="false"
     inkscape:window-width="1853"
     inkscape:window-height="1025"
     inkscape:window-x="1987"
     inkscape:window-y="27"
     inkscape:window-maximized="1"
     fit-margin-top="0"
     fit-margin-left="0"
     fit-margin-right="0"
     fit-margin-bottom="0" />
  <metadata
     id="metadata5">
    <rdf:RDF>
      <cc:Work
         rdf:about="">
        <dc:format>image/svg+xml</dc:format>
        <dc:type
           rdf:resource="http://purl.org/dc/dcmitype/StillImage" />
        <dc:title />
      </cc:Work>
    </rdf:RDF>
  </metadata>
  <g
     inkscape:label="Layer 1"
     inkscape:groupmode="layer"
     id="layer1"
     transform="translate(-29.645063,-20.773566)">
    <g
       id="layer1-3"
       inkscape:label="Layer 1"
       transform="translate(-26.634478,13.429087)">
      <path
         sodipodi:nodetypes="cccssscccsscccsscccssscscccccccscscsscccsc"
         inkscape:connector-curvature="0"
         id="path839"
         d="m 88.296519,39.532253 c 0.197085,-0.109292 1.319197,-1.75267 2.591008,-3.794627 l 2.243364,-3.601851 4.787357,-0.07378 c 4.492732,-0.06925 4.829342,-0.0932 5.469472,-0.389183 0.92822,-0.429194 1.76314,-1.214974 2.20031,-2.070797 l 0.36406,-0.712716 0.0402,-9.054875 0.0402,-9.054875 -0.35027,-0.765082 c -0.48987,-1.0701073 -1.16008,-1.7779473 -2.13817,-2.2582633 l -0.83842,-0.411725 H 87.727551 72.749474 l -0.83842,0.411725 c -0.97809,0.480316 -1.6483,1.188156 -2.13821,2.2582633 l -0.35027,0.765082 0.0402,9.054875 0.0402,9.054875 0.36405,0.712716 c 0.43717,0.855823 1.27209,1.641603 2.20031,2.070797 0.64013,0.295989 0.97674,0.319941 5.46947,0.389183 l 4.78736,0.07378 2.251302,3.615398 c 1.695056,2.722109 2.353469,3.659328 2.664789,3.793202 0.523663,0.22518 0.630535,0.223954 1.056254,-0.01211 z m -2.537706,-6.63536 c -1.256923,-2.017901 -1.992719,-3.057846 -2.244779,-3.172696 -0.25991,-0.118422 -1.87846,-0.171018 -5.27464,-0.171401 -4.59927,-5.81e-4 -4.92864,-0.01821 -5.3721,-0.288608 -0.95707,-0.58356 -0.92946,-0.298083 -0.92946,-9.609991 0,-8.202573 0.008,-8.451572 0.29746,-8.919437 0.6232,-1.0083532 -0.23505,-0.9554232 15.492236,-0.9554232 15.72729,0 14.86904,-0.05293 15.49224,0.9554232 0.28915,0.467865 0.29746,0.716864 0.29746,8.919437 0,9.311908 0.0276,9.026431 -0.92946,9.609991 -0.44346,0.270397 -0.77283,0.28809 -5.372102,0.288608 -3.396181,4.43e-4 -5.014727,0.05298 -5.274638,0.171401 -0.252067,0.114849 -0.987858,1.154795 -2.244781,3.172696 -1.02839,1.651016 -1.914317,3.001848 -1.968719,3.001848 -0.0544,0 -0.940329,-1.350832 -1.968717,-3.001848 z"
         style="fill:#000000;stroke-width:0.14756726" />
      <path
         inkscape:original-d="m 74.272322,15.596709 c 1.512167,-1.260185 3.024073,-2.520106 4.535712,-3.779762 1.070996,1.44837 2.14213,2.897553 3.212798,4.346726 1.953202,-1.260224 3.90602,-2.520106 5.858632,-3.779762 1.385959,1.196472 2.77209,2.393585 4.157736,3.590774 2.205094,-1.008186 4.409988,-2.016138 6.614584,-3.02381 0.882081,1.1335 1.764156,2.267593 2.645836,3.401786"
         inkscape:path-effect="#path-effect843"
         inkscape:connector-curvature="0"
         id="path841"
         d="m 74.272322,15.596709 c 1.512189,-1.260158 3.024095,-2.52008 4.315252,-2.425626 1.291158,0.09445 2.362292,1.543637 3.874398,1.638035 1.512105,0.0944 3.464923,-1.165485 5.134065,-1.196969 1.669142,-0.03148 3.055273,1.16563 4.850792,1.260049 1.795519,0.09442 4.000413,-0.913532 5.543578,-0.850564 1.543166,0.06297 2.425243,1.197062 3.307213,2.331027"
         style="fill:none;stroke:#000000;stroke-width:0.565;stroke-linecap:butt;stroke-linejoin:miter;stroke-miterlimit:4;stroke-dasharray:none;stroke-opacity:1" />
      <path
         sodipodi:nodetypes="ccccccc"
         inkscape:original-d="m 74.593182,20.096822 c 1.51217,-1.260185 3.02408,-2.520106 4.53571,-3.779762 1.133981,2.172691 2.268123,4.346461 3.401788,6.520089 1.811401,-2.598852 3.622537,-5.197439 5.433407,-7.79576 1.464922,2.692815 2.929581,5.385896 4.393975,8.079242 0.976702,-2.283871 1.953141,-4.567482 2.929312,-6.850819 1.543666,1.747872 3.087075,3.496017 4.630213,5.24442"
         inkscape:path-effect="#path-effect843-3"
         inkscape:connector-curvature="0"
         id="path841-6"
         d="m 74.593182,20.096822 c 1.512191,-1.26016 3.024098,-2.520084 4.346736,-2.063495 1.322639,0.456589 2.456781,2.630359 3.929445,2.417646 1.472664,-0.212714 3.2838,-2.811301 4.921565,-2.763949 1.637766,0.04735 3.102425,2.740433 4.323066,2.945057 1.220642,0.204624 2.197081,-2.078987 3.456924,-2.346568 1.259842,-0.267582 2.803251,1.480563 4.346669,3.228719"
         style="fill:none;stroke:#000000;stroke-width:0.565;stroke-linecap:butt;stroke-linejoin:miter;stroke-miterlimit:4;stroke-dasharray:none;stroke-opacity:1" />
      <path
         sodipodi:nodetypes="ccccccc"
         inkscape:original-d="m 74.16796,25.578322 c 0.708969,-1.32318 1.417674,-2.646098 2.126114,-3.96875 1.464922,2.188847 2.929535,4.377892 4.393973,6.567336 1.41772,-2.661929 2.835087,-5.32343 4.252234,-7.984747 2.441359,2.677066 4.882457,5.3544 7.323286,8.031994 2.315369,-1.984638 4.630474,-3.969014 6.945316,-5.953125 0.661724,1.35415 1.323187,2.708565 1.984377,4.063244"
         inkscape:path-effect="#path-effect843-7"
         inkscape:connector-curvature="0"
         id="path841-5"
         d="m 74.16796,25.578322 c 0.708873,-1.323231 1.417579,-2.646149 2.504155,-2.212924 1.086576,0.433225 2.551189,2.62227 3.992372,2.3859 1.441183,-0.23637 2.858551,-2.897871 4.787714,-2.889845 1.929163,0.008 4.370261,2.68536 6.748507,3.031723 2.378246,0.346362 4.693352,-1.638013 6.181466,-1.952927 1.488115,-0.314914 2.149576,1.039503 2.811086,2.394025"
         style="fill:none;stroke:#000000;stroke-width:0.565;stroke-linecap:butt;stroke-linejoin:miter;stroke-miterlimit:4;stroke-dasharray:none;stroke-opacity:1" />
      <g
         id="g1108"
         transform="matrix(0.94487847,0,0,0.94487847,11.219321,-47.814695)">
        <g
           transform="matrix(0.1254469,0,0,0.1254469,38.836643,66.87023)"
           id="g930">
          <g
             id="g831">
            <g
               id="g829" />
          </g>
          <g
             transform="translate(-93.944188,112.12693)"
             id="g1076">
            <g
               id="g843">
              <g
                 id="g841">
                <path
                   id="path839-2"
                   d="m 341.119,179.914 c -1.531,-2.834 -3.333,-5.548 -5.36,-8.068 -4.115,-5.114 -9.074,-9.379 -14.737,-12.674 -8.083,-4.705 -17.323,-7.191 -26.721,-7.191 h -76.604 c -29.327,0 -53.187,23.859 -53.187,53.186 v 99.445 c 0,7.193 5.853,13.045 13.046,13.045 h 22.626 v 7.596 c 0,4.404 3.57,7.975 7.975,7.975 4.405,0 7.975,-3.571 7.975,-7.975 v -15.571 c 0,-0.482 -0.05,-0.952 -0.132,-1.41 v -90.254 c 0,-4.404 -3.57,-7.975 -7.975,-7.975 -4.405,0 -7.975,3.571 -7.975,7.975 v 83.689 h -19.59 v -96.54 c 0,-20.532 16.704,-37.236 37.237,-37.236 h 76.604 c 6.583,0 13.048,1.738 18.698,5.026 3.97,2.31 7.447,5.301 10.332,8.888 1.421,1.765 2.683,3.666 3.756,5.651 2.912,5.388 4.451,11.499 4.451,17.671 0,4.404 3.57,7.975 7.975,7.975 4.405,0 7.975,-3.571 7.975,-7.975 0,-8.811 -2.202,-17.544 -6.369,-25.253 z"
                   inkscape:connector-curvature="0" />
              </g>
            </g>
            <g
               id="g849">
              <g
                 id="g847">
                <path
                   id="path845"
                   d="m 339.514,226.769 c -4.405,0 -7.975,3.571 -7.975,7.975 v 66.964 h -19.852 v -83.689 c 0,-4.404 -3.57,-7.975 -7.975,-7.975 -4.405,0 -7.975,3.571 -7.975,7.975 v 91.664 c 0,0.477 0.049,0.942 0.13,1.396 v 128.258 h -79.734 v -82.802 c 0,-4.405 -3.57,-7.975 -7.975,-7.975 -4.405,0 -7.975,3.571 -7.975,7.975 v 90.777 c 0,4.404 3.57,7.975 7.975,7.975 h 95.684 c 4.405,0 7.975,-3.571 7.975,-7.975 V 317.658 h 22.626 c 7.193,0 13.046,-5.852 13.046,-13.045 v -69.869 c -10e-4,-4.404 -3.571,-7.975 -7.975,-7.975 z"
                   inkscape:connector-curvature="0" />
              </g>
            </g>
            <g
               id="g855">
              <g
                 id="g853">
                <path
                   id="path851"
                   d="m 257.709,56.712 c -25.268,0 -45.824,20.557 -45.824,45.825 0,25.268 20.556,45.825 45.824,45.825 25.268,0 45.825,-20.557 45.825,-45.825 0,-25.268 -20.557,-45.825 -45.825,-45.825 z m 0,75.7 c -16.472,0 -29.874,-13.402 -29.874,-29.875 0,-16.473 13.402,-29.874 29.874,-29.874 16.473,0 29.874,13.401 29.874,29.874 -0.001,16.473 -13.402,29.875 -29.874,29.875 z"
                   inkscape:connector-curvature="0" />
              </g>
            </g>
          </g>
          <g
             id="g857" />
          <g
             id="g859" />
          <g
             id="g861" />
          <g
             id="g863" />
          <g
             id="g865" />
          <g
             id="g867" />
          <g
             id="g869" />
          <g
             id="g871" />
          <g
             id="g873" />
          <g
             id="g875" />
          <g
             id="g877" />
          <g
             id="g879" />
          <g
             id="g881" />
          <g
             id="g883" />
          <g
             id="g885" />
        </g>
      </g>
      <g
         id="g1065"
         transform="matrix(0.08017476,0,0,0.08017476,79.560108,46.298252)">
        <g
           id="g936">
          <g
             id="g934">
            <path
               id="path932"
               d="m 181.956,102.43 c -17.275,0 -31.28,14.005 -31.28,31.28 0.044,17.257 14.023,31.236 31.28,31.28 17.275,0 31.28,-14.005 31.28,-31.28 0,-17.275 -14.005,-31.28 -31.28,-31.28 z m 0,46.48 c -8.439,0 -15.28,-6.841 -15.28,-15.28 0,-8.439 6.841,-15.28 15.28,-15.28 8.439,0 15.28,6.841 15.28,15.28 0,8.439 -6.841,15.28 -15.28,15.28 z"
               inkscape:connector-curvature="0" />
          </g>
        </g>
        <g
           id="g942">
          <g
             id="g940">
            <path
               id="path938"
               d="m 271.076,102.43 c -17.275,0 -31.28,14.005 -31.28,31.28 0.044,17.257 14.023,31.236 31.28,31.28 17.276,0 31.28,-14.005 31.28,-31.28 0,-17.275 -14.005,-31.28 -31.28,-31.28 z m 0,46.48 c -8.439,0 -15.28,-6.841 -15.28,-15.28 0,-8.439 6.841,-15.28 15.28,-15.28 8.439,0 15.28,6.841 15.28,15.28 0,8.439 -6.841,15.28 -15.28,15.28 z"
               inkscape:connector-curvature="0" />
          </g>
        </g>
        <g
           id="g948">
          <g
             id="g946">
            <path
               id="path944"
               d="m 366.525,138.427 c -3.332,-18.73 -18.424,-33.137 -37.289,-35.597 -5.2,-19.04 -20.08,-35.2 -49.84,-35.2 h -44.88 V 50.91 C 248.225,46.492 255.757,31.796 251.339,18.087 246.92,4.378 232.225,-3.154 218.516,1.264 c -13.709,4.418 -21.241,19.113 -16.823,32.823 2.574,7.988 8.835,14.248 16.823,16.823 v 16 h -44.96 c -21.04,0 -43.28,9.68 -50,35.2 -23.871,3.164 -40.657,25.08 -37.493,48.951 2.499,18.851 16.926,33.908 35.653,37.209 v 0.72 c 2.48,34.24 27.92,46.64 51.84,46.64 h 105.84 c 35.68,0 50,-23.2 51.84,-46.64 23.707,-4.218 39.507,-26.856 35.289,-50.563 z M 121.476,172.43 c -14.558,-4.366 -22.82,-19.708 -18.454,-34.266 2.658,-8.863 9.592,-15.796 18.454,-18.454 z m 94.88,-145.52 c -0.221,-5.563 4.11,-10.251 9.672,-10.472 5.562,-0.221 10.251,4.11 10.472,9.672 0.221,5.563 -4.11,10.251 -9.672,10.472 -0.104,0.004 -0.208,0.007 -0.312,0.008 -5.429,0.006 -9.904,-4.257 -10.16,-9.68 z m 99.12,156.8 c 0,13.52 -4.72,36.08 -36.08,36.08 h -105.84 c -13.52,0 -36.08,-4.72 -36.08,-36.08 v -64 c 0,-31.44 22.64,-36.08 36.08,-36.08 h 105.84 c 31.44,0 36.08,22.64 36.08,36.08 z m 34.534,-29.735 c -2.658,8.863 -9.592,15.796 -18.454,18.454 v -52.72 c 14.558,4.367 22.82,19.708 18.454,34.266 z"
               inkscape:connector-curvature="0" />
          </g>
        </g>
        <g
           id="g954">
          <g
             id="g952">
            <path
               id="path950"
               d="m 271.076,185.79 h -89.12 c -4.418,0 -8,3.582 -8,8 0,4.418 3.582,8 8,8 h 89.12 c 4.418,0 8,-3.582 8,-8 0,-4.418 -3.582,-8 -8,-8 z"
               inkscape:connector-curvature="0" />
          </g>
        </g>
        <g
           id="g966">
          <g
             id="g964">
            <path
               id="path962"
               d="m 138.516,390.19 v 0 c -11.797,0 -21.36,9.563 -21.36,21.36 0,11.797 9.563,21.36 21.36,21.36 11.797,0 21.36,-9.563 21.36,-21.36 0,-11.797 -9.563,-21.36 -21.36,-21.36 z m 0,26.72 c -2.96,0 -5.36,-2.4 -5.36,-5.36 0,-2.96 2.4,-5.36 5.36,-5.36 2.96,0 5.36,2.4 5.36,5.36 0,2.96 -2.4,5.36 -5.36,5.36 z"
               inkscape:connector-curvature="0" />
          </g>
        </g>
        <g
           id="g972">
          <g
             id="g970">
            <path
               id="path968"
               d="m 226.516,390.19 v 0 c -11.797,0 -21.36,9.563 -21.36,21.36 0,11.797 9.563,21.36 21.36,21.36 11.797,0 21.36,-9.563 21.36,-21.36 0,-11.797 -9.563,-21.36 -21.36,-21.36 z m 5.36,21.36 c 0,2.96 -2.4,5.36 -5.36,5.36 -2.96,0 -5.36,-2.4 -5.36,-5.36 0,-2.96 2.4,-5.36 5.36,-5.36 2.96,0 5.36,2.399 5.36,5.36 z"
               inkscape:connector-curvature="0" />
          </g>
        </g>
        <g
           id="g978">
          <g
             id="g976">
            <path
               id="path974"
               d="m 314.516,390.19 c -11.797,-0.044 -21.396,9.483 -21.44,21.28 0,0.027 0,0.053 0,0.08 0,11.797 9.563,21.36 21.36,21.36 11.797,0 21.36,-9.563 21.36,-21.36 0,-11.766 -9.515,-21.316 -21.28,-21.36 z m -0.08,26.72 c -2.96,0 -5.36,-2.4 -5.36,-5.36 0,-2.96 2.4,-5.36 5.36,-5.36 v 0 c 2.96,0 5.36,2.4 5.36,5.36 0,2.96 -2.4,5.36 -5.36,5.36 z"
               inkscape:connector-curvature="0" />
          </g>
        </g>
        <g
           id="g984">
          <g
             id="g982">
            <path
               id="path980"
               d="m 403.796,297.87 v 0 l -6.48,-11.68 c -26.08,-45.84 -78.4,-43.28 -82.8,-43.28 h -176 c -4.72,0 -56.96,-2.88 -83.2,43.04 l -6.4,11.6 c -14.597,2.581 -25.188,15.337 -25.04,30.16 0,4.418 3.582,8 8,8 4.418,0 8,-3.582 8,-8 0,-7.931 6.429,-14.36 14.36,-14.36 7.931,0 14.36,6.429 14.36,14.36 0,4.418 3.582,8 8,8 4.418,0 8,-3.582 8,-8 -0.013,-12.013 -7.098,-22.892 -18.08,-27.76 l 3.2,-5.76 c 11.081,-18.788 30.269,-31.354 51.92,-34 v 109.12 h -0.4 c -23.13,1.011 -41.06,20.581 -40.049,43.711 0.949,21.713 18.336,39.1 40.049,40.049 h 210.72 c 23.13,1.011 42.7,-16.92 43.711,-40.049 1.011,-23.13 -16.92,-42.7 -40.049,-43.711 -1.22,-0.053 -2.441,-0.053 -3.661,0 h -0.4 V 260.19 c 21.608,2.646 40.776,15.139 51.92,33.84 l 3.28,5.92 c -11.045,4.82 -18.2,15.709 -18.24,27.76 0,4.418 3.582,8 8,8 4.418,0 8,-3.582 8,-8 0,-7.931 6.429,-14.36 14.36,-14.36 7.931,0 14.36,6.429 14.36,14.36 0,4.418 3.582,8 8,8 4.418,0 8,-3.582 8,-8 -0.042,-14.83 -10.805,-27.453 -25.441,-29.84 z m -265.92,-38.96 h 177.68 v 110.4 h -177.68 z m 194.08,126.72 c 14.293,-0.795 26.524,10.148 27.319,24.441 0.795,14.293 -10.148,26.524 -24.441,27.319 -0.959,0.053 -1.92,0.053 -2.879,0 h -210.88 c -14.293,-0.795 -25.236,-13.026 -24.441,-27.319 0.733,-13.183 11.258,-23.708 24.441,-24.441 z"
               inkscape:connector-curvature="0" />
          </g>
        </g>
        <g
           id="g986" />
        <g
           id="g988" />
        <g
           id="g990" />
        <g
           id="g992" />
        <g
           id="g994" />
        <g
           id="g996" />
        <g
           id="g998" />
        <g
           id="g1000" />
        <g
           id="g1002" />
        <g
           id="g1004" />
        <g
           id="g1006" />
        <g
           id="g1008" />
        <g
           id="g1010" />
        <g
           id="g1012" />
        <g
           id="g1014" />
      </g>
      <g
         transform="matrix(0.41019037,0,0,0.41019037,54.024547,46.478238)"
         id="g1445-1"
         style="fill:#ff4500;fill-opacity:1">
        <g
           id="g1221-5"
           transform="matrix(0.01653694,0,0,0.01653694,100.48713,51.106114)"
           style="fill:#ff4500;fill-opacity:1">
          <g
             id="g1155-9"
             style="fill:#ff4500;fill-opacity:1">
            <g
               id="g1153-4"
               style="fill:#ff4500;fill-opacity:1">
              <path
                 id="path1151-9"
                 d="M 496.497,204.819 460.837,198.8 C 456.3,182.411 449.704,166.375 441.126,150.904 l 21.001,-29.871 c 5.201,-7.395 4.327,-17.455 -2.064,-23.846 L 414.2,51.318 c -6.44,-6.446 -16.612,-7.265 -24.001,-1.953 l -29.741,21.373 c -14.957,-8.362 -31.179,-15 -47.871,-19.587 L 306.568,15.497 C 305.062,6.552 297.307,0 288.232,0 h -64.465 c -9.075,0 -16.823,6.552 -18.335,15.496 l -6.019,35.666 c -16.389,4.531 -32.418,11.133 -47.896,19.711 L 121.652,49.872 c -7.389,-5.188 -17.461,-4.327 -23.846,2.064 L 51.938,97.807 c -6.391,6.391 -7.265,16.451 -2.064,23.846 l 20.932,29.772 C 62.407,166.413 55.75,182.678 51.15,199.414 l -35.654,6.019 C 6.552,206.945 0,214.693 0,223.768 v 64.465 c 0,9.075 6.552,16.829 15.496,18.335 l 35.666,6.025 c 4.531,16.383 11.133,32.418 19.711,47.896 l -21.001,29.865 c -5.201,7.401 -4.327,17.461 2.064,23.846 l 45.869,45.863 c 6.391,6.391 16.451,7.258 23.846,2.064 l 29.772,-20.932 c 14.988,8.393 31.247,15.056 47.989,19.656 l 6.019,35.654 c 1.512,8.944 9.261,15.496 18.335,15.496 h 64.465 c 9.075,0 16.829,-6.552 18.335,-15.509 l 6.025,-35.66 c 16.389,-4.537 32.418,-11.133 47.896,-19.711 l 29.865,21.001 c 7.401,5.194 17.461,4.333 23.846,-2.064 l 45.863,-45.863 c 6.403,-6.409 7.265,-16.501 2.033,-23.889 l -21.503,-30.385 c 8.38,-14.976 15.031,-31.216 19.625,-47.921 l 36.243,-6.044 c 8.963,-1.494 15.54,-9.248 15.54,-18.341 V 223.15 c 10e-4,-9.077 -6.551,-16.825 -15.502,-18.331 z m -21.694,67.049 -32.809,5.467 c -7.55,1.258 -13.562,7.017 -15.137,14.511 -4.395,20.877 -12.726,41.22 -24.088,58.837 -4.11,6.378 -3.936,14.622 0.446,20.815 l 19.457,27.497 -23.722,23.716 -26.883,-18.899 c -6.118,-4.302 -14.213,-4.531 -20.548,-0.558 -18.881,11.796 -38.753,19.953 -59.06,24.23 -7.482,1.574 -13.234,7.568 -14.505,15.106 l -5.442,32.22 h -33.026 l -5.448,-32.226 c -1.271,-7.531 -7.023,-13.525 -14.498,-15.1 -20.889,-4.401 -41.233,-12.732 -58.837,-24.088 -6.36,-4.11 -14.579,-3.942 -20.778,0.409 l -26.877,18.899 -23.758,-23.753 18.899,-26.883 c 4.302,-6.112 4.519,-14.213 0.558,-20.548 C 96.945,332.639 88.8,312.767 84.523,292.46 c -1.574,-7.475 -7.562,-13.234 -15.1,-14.505 l -32.232,-5.442 v -33.026 l 32.239,-5.448 c 7.537,-1.271 13.525,-7.023 15.1,-14.505 4.395,-20.877 12.719,-41.227 24.081,-58.83 4.103,-6.366 3.942,-14.579 -0.415,-20.778 l -18.899,-26.877 23.759,-23.759 26.877,18.899 c 6.112,4.302 14.213,4.519 20.548,0.558 18.881,-11.802 38.753,-19.947 59.06,-24.224 7.482,-1.574 13.234,-7.562 14.505,-15.1 l 5.442,-32.232 h 33.026 l 5.442,32.239 c 1.271,7.537 7.029,13.525 14.505,15.1 20.889,4.395 41.233,12.719 58.83,24.081 6.422,4.147 14.728,3.924 20.939,-0.527 l 26.84,-19.29 23.641,23.641 -18.906,26.883 c -4.302,6.118 -4.525,14.213 -0.558,20.554 11.796,18.875 19.953,38.741 24.23,59.06 1.574,7.475 7.568,13.228 15.106,14.498 l 32.22,5.442 z"
                 inkscape:connector-curvature="0"
                 style="fill:#ff4500;fill-opacity:1" />
            </g>
          </g>
          <g
             id="g1161-0"
             style="fill:#ff4500;fill-opacity:1">
            <g
               id="g1159-9"
               style="fill:#ff4500;fill-opacity:1">
              <path
                 id="path1157-1"
                 d="m 256,153.104 c -56.394,0 -102.276,45.882 -102.276,102.276 0,56.394 45.882,102.276 102.276,102.276 56.388,0 102.276,-45.882 102.276,-102.276 0,-56.394 -45.882,-102.276 -102.276,-102.276 z m 0,167.361 c -35.89,0 -65.085,-29.195 -65.085,-65.085 0,-35.89 29.195,-65.085 65.085,-65.085 35.89,0 65.085,29.201 65.085,65.085 0,35.89 -29.195,65.085 -65.085,65.085 z"
                 inkscape:connector-curvature="0"
                 style="fill:#ff4500;fill-opacity:1" />
            </g>
          </g>
          <g
             id="g1163-7"
             style="fill:#ff4500;fill-opacity:1" />
          <g
             id="g1165-7"
             style="fill:#ff4500;fill-opacity:1" />
          <g
             id="g1167-1"
             style="fill:#ff4500;fill-opacity:1" />
          <g
             id="g1169-1"
             style="fill:#ff4500;fill-opacity:1" />
          <g
             id="g1171-5"
             style="fill:#ff4500;fill-opacity:1" />
          <g
             id="g1173-9"
             style="fill:#ff4500;fill-opacity:1" />
          <g
             id="g1175-7"
             style="fill:#ff4500;fill-opacity:1" />
          <g
             id="g1177-7"
             style="fill:#ff4500;fill-opacity:1" />
          <g
             id="g1179-6"
             style="fill:#ff4500;fill-opacity:1" />
          <g
             id="g1181-73"
             style="fill:#ff4500;fill-opacity:1" />
          <g
             id="g1183-6"
             style="fill:#ff4500;fill-opacity:1" />
          <g
             id="g1185-5"
             style="fill:#ff4500;fill-opacity:1" />
          <g
             id="g1187-6"
             style="fill:#ff4500;fill-opacity:1" />
          <g
             id="g1189-3"
             style="fill:#ff4500;fill-opacity:1" />
          <g
             id="g1191-9"
             style="fill:#ff4500;fill-opacity:1" />
        </g>
        <g
           id="g1221-6-4"
           transform="matrix(0.01464535,-0.00768011,0.00768011,0.01464535,104.72227,59.604371)"
           style="fill:#ff4500;fill-opacity:1">
          <g
             id="g1155-2-8"
             transform="rotate(23.267388,247.51887,50.009277)"
             style="fill:#ff4500;fill-opacity:1">
            <g
               id="g1153-9-1"
               style="fill:#ff4500;fill-opacity:1">
              <path
                 id="path1151-1-29"
                 d="M 496.497,204.819 460.837,198.8 C 456.3,182.411 449.704,166.375 441.126,150.904 l 21.001,-29.871 c 5.201,-7.395 4.327,-17.455 -2.064,-23.846 L 414.2,51.318 c -6.44,-6.446 -16.612,-7.265 -24.001,-1.953 l -29.741,21.373 c -14.957,-8.362 -31.179,-15 -47.871,-19.587 L 306.568,15.497 C 305.062,6.552 297.307,0 288.232,0 h -64.465 c -9.075,0 -16.823,6.552 -18.335,15.496 l -6.019,35.666 c -16.389,4.531 -32.418,11.133 -47.896,19.711 L 121.652,49.872 c -7.389,-5.188 -17.461,-4.327 -23.846,2.064 L 51.938,97.807 c -6.391,6.391 -7.265,16.451 -2.064,23.846 l 20.932,29.772 C 62.407,166.413 55.75,182.678 51.15,199.414 l -35.654,6.019 C 6.552,206.945 0,214.693 0,223.768 v 64.465 c 0,9.075 6.552,16.829 15.496,18.335 l 35.666,6.025 c 4.531,16.383 11.133,32.418 19.711,47.896 l -21.001,29.865 c -5.201,7.401 -4.327,17.461 2.064,23.846 l 45.869,45.863 c 6.391,6.391 16.451,7.258 23.846,2.064 l 29.772,-20.932 c 14.988,8.393 31.247,15.056 47.989,19.656 l 6.019,35.654 c 1.512,8.944 9.261,15.496 18.335,15.496 h 64.465 c 9.075,0 16.829,-6.552 18.335,-15.509 l 6.025,-35.66 c 16.389,-4.537 32.418,-11.133 47.896,-19.711 l 29.865,21.001 c 7.401,5.194 17.461,4.333 23.846,-2.064 l 45.863,-45.863 c 6.403,-6.409 7.265,-16.501 2.033,-23.889 l -21.503,-30.385 c 8.38,-14.976 15.031,-31.216 19.625,-47.921 l 36.243,-6.044 c 8.963,-1.494 15.54,-9.248 15.54,-18.341 V 223.15 c 10e-4,-9.077 -6.551,-16.825 -15.502,-18.331 z m -21.694,67.049 -32.809,5.467 c -7.55,1.258 -13.562,7.017 -15.137,14.511 -4.395,20.877 -12.726,41.22 -24.088,58.837 -4.11,6.378 -3.936,14.622 0.446,20.815 l 19.457,27.497 -23.722,23.716 -26.883,-18.899 c -6.118,-4.302 -14.213,-4.531 -20.548,-0.558 -18.881,11.796 -38.753,19.953 -59.06,24.23 -7.482,1.574 -13.234,7.568 -14.505,15.106 l -5.442,32.22 h -33.026 l -5.448,-32.226 c -1.271,-7.531 -7.023,-13.525 -14.498,-15.1 -20.889,-4.401 -41.233,-12.732 -58.837,-24.088 -6.36,-4.11 -14.579,-3.942 -20.778,0.409 l -26.877,18.899 -23.758,-23.753 18.899,-26.883 c 4.302,-6.112 4.519,-14.213 0.558,-20.548 C 96.945,332.639 88.8,312.767 84.523,292.46 c -1.574,-7.475 -7.562,-13.234 -15.1,-14.505 l -32.232,-5.442 v -33.026 l 32.239,-5.448 c 7.537,-1.271 13.525,-7.023 15.1,-14.505 4.395,-20.877 12.719,-41.227 24.081,-58.83 4.103,-6.366 3.942,-14.579 -0.415,-20.778 l -18.899,-26.877 23.759,-23.759 26.877,18.899 c 6.112,4.302 14.213,4.519 20.548,0.558 18.881,-11.802 38.753,-19.947 59.06,-24.224 7.482,-1.574 13.234,-7.562 14.505,-15.1 l 5.442,-32.232 h 33.026 l 5.442,32.239 c 1.271,7.537 7.029,13.525 14.505,15.1 20.889,4.395 41.233,12.719 58.83,24.081 6.422,4.147 14.728,3.924 20.939,-0.527 l 26.84,-19.29 23.641,23.641 -18.906,26.883 c -4.302,6.118 -4.525,14.213 -0.558,20.554 11.796,18.875 19.953,38.741 24.23,59.06 1.574,7.475 7.568,13.228 15.106,14.498 l 32.22,5.442 z"
                 inkscape:connector-curvature="0"
                 style="fill:#ff4500;fill-opacity:1" />
            </g>
          </g>
          <g
             id="g1161-2-3"
             transform="translate(-81.974397,-13.332519)"
             style="fill:#ff4500;fill-opacity:1">
            <g
               id="g1159-7-9"
               style="fill:#ff4500;fill-opacity:1">
              <path
                 id="path1157-0-0"
                 d="m 256,153.104 c -56.394,0 -102.276,45.882 -102.276,102.276 0,56.394 45.882,102.276 102.276,102.276 56.388,0 102.276,-45.882 102.276,-102.276 0,-56.394 -45.882,-102.276 -102.276,-102.276 z m 0,167.361 c -35.89,0 -65.085,-29.195 -65.085,-65.085 0,-35.89 29.195,-65.085 65.085,-65.085 35.89,0 65.085,29.201 65.085,65.085 0,35.89 -29.195,65.085 -65.085,65.085 z"
                 inkscape:connector-curvature="0"
                 style="fill:#ff4500;fill-opacity:1" />
            </g>
          </g>
          <g
             id="g1163-9-8"
             style="fill:#ff4500;fill-opacity:1" />
          <g
             id="g1165-3-8"
             style="fill:#ff4500;fill-opacity:1" />
          <g
             id="g1167-6-5"
             style="fill:#ff4500;fill-opacity:1" />
          <g
             id="g1169-0-0"
             style="fill:#ff4500;fill-opacity:1" />
          <g
             id="g1171-6-9"
             style="fill:#ff4500;fill-opacity:1" />
          <g
             id="g1173-2-6"
             style="fill:#ff4500;fill-opacity:1" />
          <g
             id="g1175-6-38"
             style="fill:#ff4500;fill-opacity:1" />
          <g
             id="g1177-1-5"
             style="fill:#ff4500;fill-opacity:1" />
          <g
             id="g1179-8-6"
             style="fill:#ff4500;fill-opacity:1" />
          <g
             id="g1181-7-1"
             style="fill:#ff4500;fill-opacity:1" />
          <g
             id="g1183-9-1"
             style="fill:#ff4500;fill-opacity:1" />
          <g
             id="g1185-2-5"
             style="fill:#ff4500;fill-opacity:1" />
          <g
             id="g1187-0-9"
             style="fill:#ff4500;fill-opacity:1" />
          <g
             id="g1189-2-8"
             style="fill:#ff4500;fill-opacity:1" />
          <g
             id="g1191-3-4"
             style="fill:#ff4500;fill-opacity:1" />
        </g>
        <g
           id="g1221-6-7-8"
           transform="matrix(0.0163132,-0.00271107,0.00271107,0.0163132,98.146339,63.243268)"
           style="fill:#ff4500;fill-opacity:1">
          <g
             id="g1155-2-5-1"
             style="fill:#ff4500;fill-opacity:1">
            <g
               id="g1153-9-9-0"
               style="fill:#ff4500;fill-opacity:1">
              <path
                 id="path1151-1-2-3"
                 d="M 496.497,204.819 460.837,198.8 C 456.3,182.411 449.704,166.375 441.126,150.904 l 21.001,-29.871 c 5.201,-7.395 4.327,-17.455 -2.064,-23.846 L 414.2,51.318 c -6.44,-6.446 -16.612,-7.265 -24.001,-1.953 l -29.741,21.373 c -14.957,-8.362 -31.179,-15 -47.871,-19.587 L 306.568,15.497 C 305.062,6.552 297.307,0 288.232,0 h -64.465 c -9.075,0 -16.823,6.552 -18.335,15.496 l -6.019,35.666 c -16.389,4.531 -32.418,11.133 -47.896,19.711 L 121.652,49.872 c -7.389,-5.188 -17.461,-4.327 -23.846,2.064 L 51.938,97.807 c -6.391,6.391 -7.265,16.451 -2.064,23.846 l 20.932,29.772 C 62.407,166.413 55.75,182.678 51.15,199.414 l -35.654,6.019 C 6.552,206.945 0,214.693 0,223.768 v 64.465 c 0,9.075 6.552,16.829 15.496,18.335 l 35.666,6.025 c 4.531,16.383 11.133,32.418 19.711,47.896 l -21.001,29.865 c -5.201,7.401 -4.327,17.461 2.064,23.846 l 45.869,45.863 c 6.391,6.391 16.451,7.258 23.846,2.064 l 29.772,-20.932 c 14.988,8.393 31.247,15.056 47.989,19.656 l 6.019,35.654 c 1.512,8.944 9.261,15.496 18.335,15.496 h 64.465 c 9.075,0 16.829,-6.552 18.335,-15.509 l 6.025,-35.66 c 16.389,-4.537 32.418,-11.133 47.896,-19.711 l 29.865,21.001 c 7.401,5.194 17.461,4.333 23.846,-2.064 l 45.863,-45.863 c 6.403,-6.409 7.265,-16.501 2.033,-23.889 l -21.503,-30.385 c 8.38,-14.976 15.031,-31.216 19.625,-47.921 l 36.243,-6.044 c 8.963,-1.494 15.54,-9.248 15.54,-18.341 V 223.15 c 10e-4,-9.077 -6.551,-16.825 -15.502,-18.331 z m -21.694,67.049 -32.809,5.467 c -7.55,1.258 -13.562,7.017 -15.137,14.511 -4.395,20.877 -12.726,41.22 -24.088,58.837 -4.11,6.378 -3.936,14.622 0.446,20.815 l 19.457,27.497 -23.722,23.716 -26.883,-18.899 c -6.118,-4.302 -14.213,-4.531 -20.548,-0.558 -18.881,11.796 -38.753,19.953 -59.06,24.23 -7.482,1.574 -13.234,7.568 -14.505,15.106 l -5.442,32.22 h -33.026 l -5.448,-32.226 c -1.271,-7.531 -7.023,-13.525 -14.498,-15.1 -20.889,-4.401 -41.233,-12.732 -58.837,-24.088 -6.36,-4.11 -14.579,-3.942 -20.778,0.409 l -26.877,18.899 -23.758,-23.753 18.899,-26.883 c 4.302,-6.112 4.519,-14.213 0.558,-20.548 C 96.945,332.639 88.8,312.767 84.523,292.46 c -1.574,-7.475 -7.562,-13.234 -15.1,-14.505 l -32.232,-5.442 v -33.026 l 32.239,-5.448 c 7.537,-1.271 13.525,-7.023 15.1,-14.505 4.395,-20.877 12.719,-41.227 24.081,-58.83 4.103,-6.366 3.942,-14.579 -0.415,-20.778 l -18.899,-26.877 23.759,-23.759 26.877,18.899 c 6.112,4.302 14.213,4.519 20.548,0.558 18.881,-11.802 38.753,-19.947 59.06,-24.224 7.482,-1.574 13.234,-7.562 14.505,-15.1 l 5.442,-32.232 h 33.026 l 5.442,32.239 c 1.271,7.537 7.029,13.525 14.505,15.1 20.889,4.395 41.233,12.719 58.83,24.081 6.422,4.147 14.728,3.924 20.939,-0.527 l 26.84,-19.29 23.641,23.641 -18.906,26.883 c -4.302,6.118 -4.525,14.213 -0.558,20.554 11.796,18.875 19.953,38.741 24.23,59.06 1.574,7.475 7.568,13.228 15.106,14.498 l 32.22,5.442 z"
                 inkscape:connector-curvature="0"
                 style="fill:#ff4500;fill-opacity:1" />
            </g>
          </g>
          <g
             id="g1161-2-2-0"
             style="fill:#ff4500;fill-opacity:1">
            <g
               id="g1159-7-8-4"
               style="fill:#ff4500;fill-opacity:1">
              <path
                 id="path1157-0-9-4"
                 d="m 256,153.104 c -56.394,0 -102.276,45.882 -102.276,102.276 0,56.394 45.882,102.276 102.276,102.276 56.388,0 102.276,-45.882 102.276,-102.276 0,-56.394 -45.882,-102.276 -102.276,-102.276 z m 0,167.361 c -35.89,0 -65.085,-29.195 -65.085,-65.085 0,-35.89 29.195,-65.085 65.085,-65.085 35.89,0 65.085,29.201 65.085,65.085 0,35.89 -29.195,65.085 -65.085,65.085 z"
                 inkscape:connector-curvature="0"
                 style="fill:#ff4500;fill-opacity:1" />
            </g>
          </g>
          <g
             id="g1163-9-7-4"
             style="fill:#ff4500;fill-opacity:1" />
          <g
             id="g1165-3-3-4"
             style="fill:#ff4500;fill-opacity:1" />
          <g
             id="g1167-6-6-7"
             style="fill:#ff4500;fill-opacity:1" />
          <g
             id="g1169-0-1-6"
             style="fill:#ff4500;fill-opacity:1" />
          <g
             id="g1171-6-2-3"
             style="fill:#ff4500;fill-opacity:1" />
          <g
             id="g1173-2-9-1"
             style="fill:#ff4500;fill-opacity:1" />
          <g
             id="g1175-6-3-7"
             style="fill:#ff4500;fill-opacity:1" />
          <g
             id="g1177-1-1-5"
             style="fill:#ff4500;fill-opacity:1" />
          <g
             id="g1179-8-9-9"
             style="fill:#ff4500;fill-opacity:1" />
          <g
             id="g1181-7-4-6"
             style="fill:#ff4500;fill-opacity:1" />
          <g
             id="g1183-9-7-2"
             style="fill:#ff4500;fill-opacity:1" />
          <g
             id="g1185-2-8-1"
             style="fill:#ff4500;fill-opacity:1" />
          <g
             id="g1187-0-4-7"
             style="fill:#ff4500;fill-opacity:1" />
          <g
             id="g1189-2-5-8"
             style="fill:#ff4500;fill-opacity:1" />
          <g
             id="g1191-3-0-5"
             style="fill:#ff4500;fill-opacity:1" />
        </g>
      </g>
    </g>
  </g>
</svg>
