<?xml version="1.0" encoding="UTF-8" standalone="no"?>
<!-- Created with Inkscape (http://www.inkscape.org/) -->

<svg
   xmlns:dc="http://purl.org/dc/elements/1.1/"
   xmlns:cc="http://creativecommons.org/ns#"
   xmlns:rdf="http://www.w3.org/1999/02/22-rdf-syntax-ns#"
   xmlns:svg="http://www.w3.org/2000/svg"
   xmlns="http://www.w3.org/2000/svg"
   xmlns:sodipodi="http://sodipodi.sourceforge.net/DTD/sodipodi-0.dtd"
   xmlns:inkscape="http://www.inkscape.org/namespaces/inkscape"
   width="210mm"
   height="297mm"
   viewBox="0 0 210 297"
   version="1.1"
   id="svg8"
   inkscape:version="0.92.3 (2405546, 2018-03-11)"
   sodipodi:docname="server_structure.svg">
  <defs
     id="defs2">
    <marker
       inkscape:stockid="Arrow1Lend"
       orient="auto"
       refY="0.0"
       refX="0.0"
       id="marker1922"
       style="overflow:visible;"
       inkscape:isstock="true">
      <path
         id="path1920"
         d="M 0.0,0.0 L 5.0,-5.0 L -12.5,0.0 L 5.0,5.0 L 0.0,0.0 z "
         style="fill-rule:evenodd;stroke:#000000;stroke-width:1pt;stroke-opacity:1;fill:#000000;fill-opacity:1"
         transform="scale(0.8) rotate(180) translate(12.5,0)" />
    </marker>
    <marker
       inkscape:stockid="Arrow1Lstart"
       orient="auto"
       refY="0.0"
       refX="0.0"
       id="marker1840"
       style="overflow:visible"
       inkscape:isstock="true">
      <path
         id="path1838"
         d="M 0.0,0.0 L 5.0,-5.0 L -12.5,0.0 L 5.0,5.0 L 0.0,0.0 z "
         style="fill-rule:evenodd;stroke:#000000;stroke-width:1pt;stroke-opacity:1;fill:#000000;fill-opacity:1"
         transform="scale(0.8) translate(12.5,0)" />
    </marker>
    <marker
       inkscape:isstock="true"
       style="overflow:visible;"
       id="marker1764"
       refX="0.0"
       refY="0.0"
       orient="auto"
       inkscape:stockid="Arrow1Lend"
       inkscape:collect="always">
      <path
         transform="scale(0.8) rotate(180) translate(12.5,0)"
         style="fill-rule:evenodd;stroke:#000000;stroke-width:1pt;stroke-opacity:1;fill:#000000;fill-opacity:1"
         d="M 0.0,0.0 L 5.0,-5.0 L -12.5,0.0 L 5.0,5.0 L 0.0,0.0 z "
         id="path1762" />
    </marker>
    <marker
       inkscape:isstock="true"
       style="overflow:visible"
       id="marker1694"
       refX="0.0"
       refY="0.0"
       orient="auto"
       inkscape:stockid="Arrow1Lstart"
       inkscape:collect="always">
      <path
         transform="scale(0.8) translate(12.5,0)"
         style="fill-rule:evenodd;stroke:#000000;stroke-width:1pt;stroke-opacity:1;fill:#000000;fill-opacity:1"
         d="M 0.0,0.0 L 5.0,-5.0 L -12.5,0.0 L 5.0,5.0 L 0.0,0.0 z "
         id="path1692" />
    </marker>
    <marker
       inkscape:stockid="Arrow1Lstart"
       orient="auto"
       refY="0.0"
       refX="0.0"
       id="marker1618"
       style="overflow:visible"
       inkscape:isstock="true"
       inkscape:collect="always">
      <path
         id="path1616"
         d="M 0.0,0.0 L 5.0,-5.0 L -12.5,0.0 L 5.0,5.0 L 0.0,0.0 z "
         style="fill-rule:evenodd;stroke:#000000;stroke-width:1pt;stroke-opacity:1;fill:#000000;fill-opacity:1"
         transform="scale(0.8) translate(12.5,0)" />
    </marker>
    <marker
       inkscape:stockid="Arrow1Lend"
       orient="auto"
       refY="0.0"
       refX="0.0"
       id="marker1566"
       style="overflow:visible;"
       inkscape:isstock="true"
       inkscape:collect="always">
      <path
         id="path1564"
         d="M 0.0,0.0 L 5.0,-5.0 L -12.5,0.0 L 5.0,5.0 L 0.0,0.0 z "
         style="fill-rule:evenodd;stroke:#000000;stroke-width:1pt;stroke-opacity:1;fill:#000000;fill-opacity:1"
         transform="scale(0.8) rotate(180) translate(12.5,0)" />
    </marker>
    <marker
       inkscape:isstock="true"
       style="overflow:visible;"
       id="marker1514"
       refX="0.0"
       refY="0.0"
       orient="auto"
       inkscape:stockid="Arrow1Lend"
       inkscape:collect="always">
      <path
         transform="scale(0.8) rotate(180) translate(12.5,0)"
         style="fill-rule:evenodd;stroke:#000000;stroke-width:1pt;stroke-opacity:1;fill:#000000;fill-opacity:1"
         d="M 0.0,0.0 L 5.0,-5.0 L -12.5,0.0 L 5.0,5.0 L 0.0,0.0 z "
         id="path1512" />
    </marker>
    <marker
       inkscape:isstock="true"
       style="overflow:visible"
       id="marker1468"
       refX="0.0"
       refY="0.0"
       orient="auto"
       inkscape:stockid="Arrow1Lstart"
       inkscape:collect="always">
      <path
         transform="scale(0.8) translate(12.5,0)"
         style="fill-rule:evenodd;stroke:#000000;stroke-width:1pt;stroke-opacity:1;fill:#000000;fill-opacity:1"
         d="M 0.0,0.0 L 5.0,-5.0 L -12.5,0.0 L 5.0,5.0 L 0.0,0.0 z "
         id="path1466" />
    </marker>
    <marker
       inkscape:stockid="Arrow1Lend"
       orient="auto"
       refY="0.0"
       refX="0.0"
       id="Arrow1Lend"
       style="overflow:visible;"
       inkscape:isstock="true"
       inkscape:collect="always">
      <path
         id="path1149"
         d="M 0.0,0.0 L 5.0,-5.0 L -12.5,0.0 L 5.0,5.0 L 0.0,0.0 z "
         style="fill-rule:evenodd;stroke:#000000;stroke-width:1pt;stroke-opacity:1;fill:#000000;fill-opacity:1"
         transform="scale(0.8) rotate(180) translate(12.5,0)" />
    </marker>
    <marker
       inkscape:stockid="Arrow1Lstart"
       orient="auto"
       refY="0.0"
       refX="0.0"
       id="Arrow1Lstart"
       style="overflow:visible"
       inkscape:isstock="true"
       inkscape:collect="always">
      <path
         id="path1146"
         d="M 0.0,0.0 L 5.0,-5.0 L -12.5,0.0 L 5.0,5.0 L 0.0,0.0 z "
         style="fill-rule:evenodd;stroke:#000000;stroke-width:1pt;stroke-opacity:1;fill:#000000;fill-opacity:1"
         transform="scale(0.8) translate(12.5,0)" />
    </marker>
    <inkscape:path-effect
       effect="bspline"
       id="path-effect925"
       is_visible="true"
       weight="33.333333"
       steps="2"
       helper_size="0"
       apply_no_weight="true"
       apply_with_weight="true"
       only_selected="false" />
  </defs>
  <sodipodi:namedview
     id="base"
     pagecolor="#ffffff"
     bordercolor="#666666"
     borderopacity="1.0"
     inkscape:pageopacity="0.0"
     inkscape:pageshadow="2"
     inkscape:zoom="1.4"
     inkscape:cx="462.52093"
     inkscape:cy="897.96922"
     inkscape:document-units="mm"
     inkscape:current-layer="layer1"
     showgrid="false"
     inkscape:snap-global="false"
     inkscape:window-width="1853"
     inkscape:window-height="1025"
     inkscape:window-x="1987"
     inkscape:window-y="27"
     inkscape:window-maximized="1" />
  <metadata
     id="metadata5">
    <rdf:RDF>
      <cc:Work
         rdf:about="">
        <dc:format>image/svg+xml</dc:format>
        <dc:type
           rdf:resource="http://purl.org/dc/dcmitype/StillImage" />
        <dc:title />
      </cc:Work>
    </rdf:RDF>
  </metadata>
  <g
     inkscape:label="Layer 1"
     inkscape:groupmode="layer"
     id="layer1">
    <g
       id="g2659"
       transform="translate(0,4.1617528)">
      <g
         transform="translate(0,-1.488924e-5)"
         id="g868">
        <g
           id="g854">
          <rect
             ry="0.67771959"
             y="10.305059"
             x="13.229167"
             height="33.072918"
             width="18.520834"
             id="rect815"
             style="opacity:1;fill:none;fill-opacity:1;stroke:#000000;stroke-width:0.60000002;stroke-linecap:round;stroke-linejoin:round;stroke-miterlimit:4;stroke-dasharray:none;stroke-dashoffset:0;stroke-opacity:1" />
          <g
             transform="translate(1.4305115e-6)"
             id="g847">
            <rect
               style="opacity:1;fill:none;fill-opacity:1;stroke:#000000;stroke-width:0.60000002;stroke-linecap:round;stroke-linejoin:round;stroke-miterlimit:4;stroke-dasharray:none;stroke-dashoffset:0;stroke-opacity:1"
               id="rect817"
               width="12.473214"
               height="2.0788691"
               x="16.252975"
               y="13.895824"
               ry="0.67771959" />
            <rect
               style="opacity:1;fill:none;fill-opacity:1;stroke:#000000;stroke-width:0.60000002;stroke-linecap:round;stroke-linejoin:round;stroke-miterlimit:4;stroke-dasharray:none;stroke-dashoffset:0;stroke-opacity:1"
               id="rect817-3"
               width="12.473214"
               height="2.0788691"
               x="16.252975"
               y="18.620535"
               ry="0.67771965" />
            <rect
               style="opacity:1;fill:none;fill-opacity:1;stroke:#000000;stroke-width:0.60000002;stroke-linecap:round;stroke-linejoin:round;stroke-miterlimit:4;stroke-dasharray:none;stroke-dashoffset:0;stroke-opacity:1"
               id="rect817-6"
               width="12.473214"
               height="2.0788691"
               x="16.252975"
               y="23.345247"
               ry="0.67771965" />
          </g>
        </g>
        <text
           xml:space="preserve"
           style="font-style:normal;font-variant:normal;font-weight:bold;font-stretch:normal;font-size:4.23333311px;line-height:1.25;font-family:sans-serif;-inkscape-font-specification:'sans-serif Bold';letter-spacing:0px;word-spacing:0px;fill:#000000;fill-opacity:1;stroke:none;stroke-width:0.26458332"
           x="13.355258"
           y="9.2455711"
           id="text858"><tspan
             sodipodi:role="line"
             id="tspan856"
             x="13.355258"
             y="9.2455711"
             style="font-size:4.23333311px;stroke-width:0.26458332">Client 1</tspan></text>
      </g>
      <g
         id="g921"
         transform="translate(0,51.030317)">
        <g
           id="g854-5">
          <rect
             ry="0.67771959"
             y="10.305059"
             x="13.229167"
             height="33.072918"
             width="18.520834"
             id="rect815-3"
             style="opacity:1;fill:none;fill-opacity:1;stroke:#000000;stroke-width:0.60000002;stroke-linecap:round;stroke-linejoin:round;stroke-miterlimit:4;stroke-dasharray:none;stroke-dashoffset:0;stroke-opacity:1" />
          <g
             transform="translate(1.4305115e-6)"
             id="g847-5">
            <rect
               style="opacity:1;fill:none;fill-opacity:1;stroke:#000000;stroke-width:0.60000002;stroke-linecap:round;stroke-linejoin:round;stroke-miterlimit:4;stroke-dasharray:none;stroke-dashoffset:0;stroke-opacity:1"
               id="rect817-62"
               width="12.473214"
               height="2.0788691"
               x="16.252975"
               y="13.895824"
               ry="0.67771959" />
            <rect
               style="opacity:1;fill:none;fill-opacity:1;stroke:#000000;stroke-width:0.60000002;stroke-linecap:round;stroke-linejoin:round;stroke-miterlimit:4;stroke-dasharray:none;stroke-dashoffset:0;stroke-opacity:1"
               id="rect817-3-9"
               width="12.473214"
               height="2.0788691"
               x="16.252975"
               y="18.620535"
               ry="0.67771965" />
            <rect
               style="opacity:1;fill:none;fill-opacity:1;stroke:#000000;stroke-width:0.60000002;stroke-linecap:round;stroke-linejoin:round;stroke-miterlimit:4;stroke-dasharray:none;stroke-dashoffset:0;stroke-opacity:1"
               id="rect817-6-1"
               width="12.473214"
               height="2.0788691"
               x="16.252975"
               y="23.345247"
               ry="0.67771965" />
          </g>
        </g>
        <text
           xml:space="preserve"
           style="font-style:normal;font-variant:normal;font-weight:bold;font-stretch:normal;font-size:4.23333311px;line-height:1.25;font-family:sans-serif;-inkscape-font-specification:'sans-serif Bold';letter-spacing:0px;word-spacing:0px;fill:#000000;fill-opacity:1;stroke:none;stroke-width:0.26458332"
           x="13.355258"
           y="9.2455711"
           id="text858-2"><tspan
             sodipodi:role="line"
             id="tspan856-7"
             x="13.355258"
             y="9.2455711"
             style="font-size:4.23333311px;stroke-width:0.26458332">Client N</tspan></text>
      </g>
      <text
         xml:space="preserve"
         style="font-style:normal;font-variant:normal;font-weight:bold;font-stretch:normal;font-size:5.64444447px;line-height:1.25;font-family:sans-serif;-inkscape-font-specification:'sans-serif Bold';letter-spacing:0px;word-spacing:0px;writing-mode:tb-rl;fill:#000000;fill-opacity:1;stroke:none;stroke-width:0.26458332"
         x="23.422516"
         y="47.152416"
         id="text911"><tspan
           sodipodi:role="line"
           id="tspan909"
           x="47.152416"
           y="23.422516"
           style="font-size:5.64444447px;writing-mode:tb-rl;stroke-width:0.26458332">...</tspan></text>
    </g>
    <text
       id="text911-7"
       y="53.957767"
       x="188.97607"
       style="font-style:normal;font-variant:normal;font-weight:bold;font-stretch:normal;font-size:5.64444447px;line-height:1.25;font-family:sans-serif;-inkscape-font-specification:'sans-serif Bold';letter-spacing:0px;word-spacing:0px;writing-mode:tb-rl;fill:#000000;fill-opacity:1;stroke:none;stroke-width:0.26458332"
       xml:space="preserve"><tspan
         style="font-size:5.64444447px;writing-mode:tb-rl;stroke-width:0.26458332"
         y="188.97607"
         x="53.957767"
         id="tspan909-8"
         sodipodi:role="line">...</tspan></text>
    <g
       transform="translate(115.28274,22.741044)"
       id="g1130">
      <g
         id="g2108">
        <g
           id="g996-2"
           transform="translate(50.459818,-18.10507)">
          <g
             id="g1077">
            <g
               id="g854-9-0">
              <rect
                 ry="0.67771959"
                 y="10.305059"
                 x="13.229167"
                 height="33.072918"
                 width="18.520834"
                 id="rect815-36-2"
                 style="opacity:1;fill:none;fill-opacity:1;stroke:#000000;stroke-width:0.60000002;stroke-linecap:round;stroke-linejoin:round;stroke-miterlimit:4;stroke-dasharray:none;stroke-dashoffset:0;stroke-opacity:1" />
              <g
                 transform="translate(1.4305115e-6)"
                 id="g847-0-3">
                <rect
                   style="opacity:1;fill:none;fill-opacity:1;stroke:#000000;stroke-width:0.60000002;stroke-linecap:round;stroke-linejoin:round;stroke-miterlimit:4;stroke-dasharray:none;stroke-dashoffset:0;stroke-opacity:1"
                   id="rect817-626-7"
                   width="12.473214"
                   height="2.0788691"
                   x="16.252975"
                   y="13.895824"
                   ry="0.67771959" />
                <rect
                   style="opacity:1;fill:none;fill-opacity:1;stroke:#000000;stroke-width:0.60000002;stroke-linecap:round;stroke-linejoin:round;stroke-miterlimit:4;stroke-dasharray:none;stroke-dashoffset:0;stroke-opacity:1"
                   id="rect817-3-1-5"
                   width="12.473214"
                   height="2.0788691"
                   x="16.252975"
                   y="18.620535"
                   ry="0.67771965" />
                <rect
                   style="opacity:1;fill:none;fill-opacity:1;stroke:#000000;stroke-width:0.60000002;stroke-linecap:round;stroke-linejoin:round;stroke-miterlimit:4;stroke-dasharray:none;stroke-dashoffset:0;stroke-opacity:1"
                   id="rect817-6-8-9"
                   width="12.473214"
                   height="2.0788691"
                   x="16.252975"
                   y="23.345247"
                   ry="0.67771965" />
              </g>
            </g>
            <text
               xml:space="preserve"
               style="font-style:normal;font-variant:normal;font-weight:bold;font-stretch:normal;font-size:4.23333311px;line-height:1.25;font-family:sans-serif;-inkscape-font-specification:'sans-serif Bold';text-align:center;letter-spacing:0px;word-spacing:0px;text-anchor:middle;fill:#000000;fill-opacity:1;stroke:none;stroke-width:0.26458332"
               x="22.482349"
               y="2.8955717"
               id="text858-7-2"><tspan
                 id="tspan985-8"
                 sodipodi:role="line"
                 x="22.482349"
                 y="2.8955717"
                 style="font-size:4.23333311px;text-align:center;text-anchor:middle;stroke-width:0.26458332">Backend</tspan><tspan
                 sodipodi:role="line"
                 x="22.482349"
                 y="8.1872377"
                 style="font-size:4.23333311px;text-align:center;text-anchor:middle;stroke-width:0.26458332"
                 id="tspan1066">Server 1</tspan></text>
          </g>
        </g>
        <g
           id="g996-9"
           transform="translate(50.459819,38.326789)">
          <g
             id="g1088">
            <g
               id="g854-9-7">
              <rect
                 ry="0.67771959"
                 y="10.305059"
                 x="13.229167"
                 height="33.072918"
                 width="18.520834"
                 id="rect815-36-3"
                 style="opacity:1;fill:none;fill-opacity:1;stroke:#000000;stroke-width:0.60000002;stroke-linecap:round;stroke-linejoin:round;stroke-miterlimit:4;stroke-dasharray:none;stroke-dashoffset:0;stroke-opacity:1" />
              <g
                 transform="translate(1.4305115e-6)"
                 id="g847-0-6">
                <rect
                   style="opacity:1;fill:none;fill-opacity:1;stroke:#000000;stroke-width:0.60000002;stroke-linecap:round;stroke-linejoin:round;stroke-miterlimit:4;stroke-dasharray:none;stroke-dashoffset:0;stroke-opacity:1"
                   id="rect817-626-1"
                   width="12.473214"
                   height="2.0788691"
                   x="16.252975"
                   y="13.895824"
                   ry="0.67771959" />
                <rect
                   style="opacity:1;fill:none;fill-opacity:1;stroke:#000000;stroke-width:0.60000002;stroke-linecap:round;stroke-linejoin:round;stroke-miterlimit:4;stroke-dasharray:none;stroke-dashoffset:0;stroke-opacity:1"
                   id="rect817-3-1-2"
                   width="12.473214"
                   height="2.0788691"
                   x="16.252975"
                   y="18.620535"
                   ry="0.67771965" />
                <rect
                   style="opacity:1;fill:none;fill-opacity:1;stroke:#000000;stroke-width:0.60000002;stroke-linecap:round;stroke-linejoin:round;stroke-miterlimit:4;stroke-dasharray:none;stroke-dashoffset:0;stroke-opacity:1"
                   id="rect817-6-8-93"
                   width="12.473214"
                   height="2.0788691"
                   x="16.252975"
                   y="23.345247"
                   ry="0.67771965" />
              </g>
            </g>
            <text
               xml:space="preserve"
               style="font-style:normal;font-variant:normal;font-weight:bold;font-stretch:normal;font-size:4.23333311px;line-height:1.25;font-family:sans-serif;-inkscape-font-specification:'sans-serif Bold';text-align:center;letter-spacing:0px;word-spacing:0px;text-anchor:middle;fill:#000000;fill-opacity:1;stroke:none;stroke-width:0.26458332"
               x="22.534025"
               y="2.8955717"
               id="text858-7-1"><tspan
                 sodipodi:role="line"
                 id="tspan856-9-9"
                 x="22.534025"
                 y="2.8955717"
                 style="font-size:4.23333311px;text-align:center;text-anchor:middle;stroke-width:0.26458332">Backend</tspan><tspan
                 id="tspan985-4"
                 sodipodi:role="line"
                 x="22.534025"
                 y="8.1872377"
                 style="font-size:4.23333311px;text-align:center;text-anchor:middle;stroke-width:0.26458332">Server N</tspan></text>
          </g>
        </g>
      </g>
    </g>
    <g
       id="g2445"
       transform="translate(0,5.8208336)">
      <g
         id="g944"
         transform="translate(0.56696366,59.912765)">
        <path
           inkscape:connector-curvature="0"
           id="path927"
           d="m 68.720495,-32.046987 a 8.6934528,8.9769343 79.893113 0 0 -7.311831,10.1339 8.6934528,8.9769343 79.893113 0 0 0.935124,2.601687 14.646577,22.962053 79.893113 0 0 -12.731887,16.2982133 14.646577,22.962053 79.893113 0 0 25.176362,10.3898025 14.646577,22.962053 79.893113 0 0 9.10496,-2.971987 13.229166,15.969494 79.893113 0 0 15.651282,5.085888 13.229166,15.969494 79.893113 0 0 13.400235,-15.8262977 13.229166,15.969494 79.893113 0 0 -17.899742,-10.2407421 8.1264875,9.3549106 79.893113 0 0 0.402484,-3.917235 8.1264875,9.3549106 79.893113 0 0 -10.635407,-6.358957 8.1264875,9.3549106 79.893113 0 0 -5.61327,2.968984 8.6934528,8.9769343 79.893113 0 0 -0.114804,-1.180006 8.6934528,8.9769343 79.893113 0 0 -10.363506,-6.98325 z"
           style="opacity:1;fill:none;fill-opacity:1;stroke:#000000;stroke-width:0.60000002;stroke-linecap:round;stroke-linejoin:round;stroke-miterlimit:4;stroke-dasharray:none;stroke-dashoffset:0;stroke-opacity:1" />
        <text
           id="text939"
           y="-5.3305826"
           x="68.988419"
           style="font-style:normal;font-variant:normal;font-weight:bold;font-stretch:normal;font-size:4.58611107px;line-height:1.25;font-family:sans-serif;-inkscape-font-specification:'sans-serif Bold';letter-spacing:0px;word-spacing:0px;fill:#000000;fill-opacity:1;stroke:none;stroke-width:0.26458332"
           xml:space="preserve"><tspan
             style="stroke-width:0.26458332"
             y="-5.3305826"
             x="68.988419"
             id="tspan937"
             sodipodi:role="line">Internet</tspan></text>
      </g>
      <g
         id="g996"
         transform="translate(118.11756,27.03107)">
        <g
           id="g854-9">
          <rect
             ry="0.67771959"
             y="10.305059"
             x="13.229167"
             height="33.072918"
             width="18.520834"
             id="rect815-36"
             style="opacity:1;fill:none;fill-opacity:1;stroke:#000000;stroke-width:0.60000002;stroke-linecap:round;stroke-linejoin:round;stroke-miterlimit:4;stroke-dasharray:none;stroke-dashoffset:0;stroke-opacity:1" />
          <g
             transform="translate(1.4305115e-6)"
             id="g847-0">
            <rect
               style="opacity:1;fill:none;fill-opacity:1;stroke:#000000;stroke-width:0.60000002;stroke-linecap:round;stroke-linejoin:round;stroke-miterlimit:4;stroke-dasharray:none;stroke-dashoffset:0;stroke-opacity:1"
               id="rect817-626"
               width="12.473214"
               height="2.0788691"
               x="16.252975"
               y="13.895824"
               ry="0.67771959" />
            <rect
               style="opacity:1;fill:none;fill-opacity:1;stroke:#000000;stroke-width:0.60000002;stroke-linecap:round;stroke-linejoin:round;stroke-miterlimit:4;stroke-dasharray:none;stroke-dashoffset:0;stroke-opacity:1"
               id="rect817-3-1"
               width="12.473214"
               height="2.0788691"
               x="16.252975"
               y="18.620535"
               ry="0.67771965" />
            <rect
               style="opacity:1;fill:none;fill-opacity:1;stroke:#000000;stroke-width:0.60000002;stroke-linecap:round;stroke-linejoin:round;stroke-miterlimit:4;stroke-dasharray:none;stroke-dashoffset:0;stroke-opacity:1"
               id="rect817-6-8"
               width="12.473214"
               height="2.0788691"
               x="16.252975"
               y="23.345247"
               ry="0.67771965" />
          </g>
        </g>
        <text
           xml:space="preserve"
           style="font-style:normal;font-variant:normal;font-weight:bold;font-stretch:normal;font-size:4.23333311px;line-height:1.25;font-family:sans-serif;-inkscape-font-specification:'sans-serif Bold';text-align:center;letter-spacing:0px;word-spacing:0px;text-anchor:middle;fill:#000000;fill-opacity:1;stroke:none;stroke-width:0.26458332"
           x="22.345924"
           y="2.8955717"
           id="text858-7"><tspan
             sodipodi:role="line"
             id="tspan856-9"
             x="22.345924"
             y="2.8955717"
             style="font-size:4.23333311px;text-align:center;text-anchor:middle;stroke-width:0.26458332">Main</tspan><tspan
             id="tspan985"
             sodipodi:role="line"
             x="22.345924"
             y="8.1872377"
             style="font-size:4.23333311px;text-align:center;text-anchor:middle;stroke-width:0.26458332">Server</tspan></text>
      </g>
      <path
         style="fill:none;stroke:#000000;stroke-width:0.28864861;stroke-linecap:butt;stroke-linejoin:miter;stroke-miterlimit:4;stroke-dasharray:none;stroke-opacity:1;marker-start:url(#Arrow1Lstart);marker-end:url(#Arrow1Lend)"
         d="m 114.55139,56.647179 h 15.47143"
         id="path1136"
         inkscape:connector-curvature="0" />
    </g>
    <path
       inkscape:connector-curvature="0"
       id="path1138"
       d="M 33.261905,28.59911 53.767114,49.104318"
       style="fill:none;stroke:#000000;stroke-width:0.26458332px;stroke-linecap:butt;stroke-linejoin:miter;stroke-opacity:1;marker-start:url(#marker1468);marker-end:url(#marker1514)" />
    <path
       inkscape:connector-curvature="0"
       id="path1140"
       d="M 33.261905,85.219943 50.270833,68.211016"
       style="fill:none;stroke:#000000;stroke-width:0.26458332px;stroke-linecap:butt;stroke-linejoin:miter;stroke-opacity:1;marker-start:url(#marker1618);marker-end:url(#marker1566)" />
    <path
       inkscape:connector-curvature="0"
       id="path1142"
       d="M 177.08184,29.12827 151.56845,54.641662"
       style="fill:none;stroke:#000000;stroke-width:0.26458332px;stroke-linecap:butt;stroke-linejoin:miter;stroke-opacity:1;marker-start:url(#marker1694);marker-end:url(#marker1764)" />
    <path
       inkscape:connector-curvature="0"
       id="path1144"
       d="M 177.45982,86.656248 151.56845,60.76488"
       style="fill:none;stroke:#000000;stroke-width:0.26458332px;stroke-linecap:butt;stroke-linejoin:miter;stroke-opacity:1;marker-start:url(#marker1840);marker-end:url(#marker1922)" />
    <text
       xml:space="preserve"
       style="font-style:normal;font-variant:normal;font-weight:bold;font-stretch:normal;font-size:4.58611107px;line-height:1.25;font-family:sans-serif;-inkscape-font-specification:'sans-serif Bold';letter-spacing:0px;word-spacing:0px;fill:#000000;fill-opacity:1;stroke:none;stroke-width:0.26458332"
       x="52.424702"
       y="-3.6649113"
       id="text962"
       transform="rotate(43.608115)"><tspan
         sodipodi:role="line"
         id="tspan960"
         x="52.424702"
         y="-3.6649113"
         style="stroke-width:0.26458332">https</tspan><tspan
         sodipodi:role="line"
         x="52.424702"
         y="2.0677276"
         style="stroke-width:0.26458332"
         id="tspan964">wss</tspan></text>
    <text
       xml:space="preserve"
       style="font-style:normal;font-variant:normal;font-weight:bold;font-stretch:normal;font-size:4.58611107px;line-height:1.25;font-family:sans-serif;-inkscape-font-specification:'sans-serif Bold';letter-spacing:0px;word-spacing:0px;fill:#000000;fill-opacity:1;stroke:none;stroke-width:0.26458332"
       x="-31.706644"
       y="81.124519"
       id="text962-3"
       transform="rotate(-46.957989)"><tspan
         sodipodi:role="line"
         id="tspan960-6"
         x="-31.706644"
         y="81.124519"
         style="stroke-width:0.26458332">https</tspan><tspan
         sodipodi:role="line"
         x="-31.706644"
         y="86.857155"
         style="stroke-width:0.26458332"
         id="tspan964-7">wss</tspan></text>
    <text
       xml:space="preserve"
       style="font-style:normal;font-variant:normal;font-weight:bold;font-stretch:normal;font-size:4.58611107px;line-height:1.25;font-family:sans-serif;-inkscape-font-specification:'sans-serif Bold';letter-spacing:0px;word-spacing:0px;fill:#000000;fill-opacity:1;stroke:none;stroke-width:0.26458332"
       x="114.35141"
       y="63.525993"
       id="text962-5"
       transform="rotate(-1.391885)"><tspan
         sodipodi:role="line"
         id="tspan960-3"
         x="114.35141"
         y="63.525993"
         style="stroke-width:0.26458332">https</tspan><tspan
         sodipodi:role="line"
         x="114.35141"
         y="69.258629"
         style="stroke-width:0.26458332"
         id="tspan964-5">wss</tspan></text>
    <text
       xml:space="preserve"
       style="font-style:normal;font-variant:normal;font-weight:bold;font-stretch:normal;font-size:4.58611107px;line-height:1.25;font-family:sans-serif;-inkscape-font-specification:'sans-serif Bold';letter-spacing:0px;word-spacing:0px;fill:#000000;fill-opacity:1;stroke:none;stroke-width:0.26458332"
       x="75.786926"
       y="149.57243"
       id="text1718"
       transform="rotate(-47.943021)"
       inkscape:transform-center-y="-3.2127976"><tspan
         sodipodi:role="line"
         id="tspan1716"
         x="75.786926"
         y="149.57243"
         style="stroke-width:0.26458332">ws</tspan></text>
    <text
       xml:space="preserve"
       style="font-style:normal;font-variant:normal;font-weight:bold;font-stretch:normal;font-size:4.58611059px;line-height:1.25;font-family:sans-serif;-inkscape-font-specification:'sans-serif Bold';letter-spacing:0px;word-spacing:0px;fill:#000000;fill-opacity:1;stroke:none;stroke-width:0.26458332"
       x="167.14973"
       y="-63.159786"
       id="text1718-6"
       transform="rotate(44.482805)"
       inkscape:transform-center-y="0.13421383"
       inkscape:transform-center-x="-3.2118969"><tspan
         sodipodi:role="line"
         id="tspan1716-2"
         x="167.14973"
         y="-63.159786"
         style="stroke-width:0.26458332">ws</tspan></text>
    <text
       xml:space="preserve"
       style="font-style:normal;font-variant:normal;font-weight:bold;font-stretch:normal;font-size:4.58611107px;line-height:1.25;font-family:sans-serif;-inkscape-font-specification:'sans-serif Bold';letter-spacing:0px;word-spacing:0px;fill:#000000;fill-opacity:1;stroke:none;stroke-width:0.26458332"
       x="14.363095"
       y="41.488094"
       id="text1740"><tspan
         sodipodi:role="line"
         id="tspan1738"
         x="14.363095"
         y="41.488094"
         style="font-size:3.52777767px;stroke-width:0.26458332">Browser</tspan></text>
    <text
       xml:space="preserve"
       style="font-style:normal;font-variant:normal;font-weight:bold;font-stretch:normal;font-size:4.58611107px;line-height:1.25;font-family:sans-serif;-inkscape-font-specification:'sans-serif Bold';letter-spacing:0px;word-spacing:0px;fill:#000000;fill-opacity:1;stroke:none;stroke-width:0.26458332"
       x="14.348331"
       y="93.964775"
       id="text1740-9"><tspan
         sodipodi:role="line"
         id="tspan1738-1"
         x="14.348331"
         y="93.964775"
         style="font-size:3.52777767px;stroke-width:0.26458332">Browser</tspan></text>
    <text
       xml:space="preserve"
       style="font-style:normal;font-variant:normal;font-weight:bold;font-stretch:normal;font-size:3.52777767px;line-height:1.25;font-family:sans-serif;-inkscape-font-specification:'sans-serif Bold';letter-spacing:0px;word-spacing:0px;fill:#000000;fill-opacity:1;stroke:none;stroke-width:0.26458332"
       x="133.99255"
       y="69.647324"
       id="text1762"><tspan
         sodipodi:role="line"
         id="tspan1760"
         x="133.99255"
         y="69.647324"
         style="stroke-width:0.26458332">NGINX</tspan><tspan
         sodipodi:role="line"
         x="133.99255"
         y="74.057045"
         style="stroke-width:0.26458332"
         id="tspan1764">Flask</tspan></text>
    <text
       xml:space="preserve"
       style="font-style:normal;font-variant:normal;font-weight:bold;font-stretch:normal;font-size:3.52777767px;line-height:1.25;font-family:sans-serif;-inkscape-font-specification:'sans-serif Bold';letter-spacing:0px;word-spacing:0px;fill:#000000;fill-opacity:1;stroke:none;stroke-width:0.26458332"
       x="180.8616"
       y="44.511906"
       id="text1768"><tspan
         sodipodi:role="line"
         id="tspan1766"
         x="180.8616"
         y="44.511906"
         style="stroke-width:0.26458332">Docker</tspan></text>
    <text
       xml:space="preserve"
       style="font-style:normal;font-variant:normal;font-weight:bold;font-stretch:normal;font-size:3.52777767px;line-height:1.25;font-family:sans-serif;-inkscape-font-specification:'sans-serif Bold';letter-spacing:0px;word-spacing:0px;fill:#000000;fill-opacity:1;stroke:none;stroke-width:0.26458332"
       x="181.42857"
       y="101.96429"
       id="text1772"><tspan
         sodipodi:role="line"
         id="tspan1770"
         x="181.42857"
         y="101.96429"
         style="stroke-width:0.26458332">Docker</tspan></text>
  </g>
</svg>
