<?xml version="1.0" encoding="UTF-8" standalone="no"?>
<svg
   xmlns:dc="http://purl.org/dc/elements/1.1/"
   xmlns:cc="http://creativecommons.org/ns#"
   xmlns:rdf="http://www.w3.org/1999/02/22-rdf-syntax-ns#"
   xmlns:svg="http://www.w3.org/2000/svg"
   xmlns="http://www.w3.org/2000/svg"
   xmlns:xlink="http://www.w3.org/1999/xlink"
   xmlns:sodipodi="http://sodipodi.sourceforge.net/DTD/sodipodi-0.dtd"
   xmlns:inkscape="http://www.inkscape.org/namespaces/inkscape"
   width="503.99997pt"
   height="503.99997pt"
   viewBox="0 0 503.99998 503.99997"
   version="1.2"
   id="svg464"
   sodipodi:docname="Expl_correct_vs_SUS.svg"
   inkscape:version="0.92.3 (2405546, 2018-03-11)">
  <metadata
     id="metadata468">
    <rdf:RDF>
      <cc:Work
         rdf:about="">
        <dc:format>image/svg+xml</dc:format>
        <dc:type
           rdf:resource="http://purl.org/dc/dcmitype/StillImage" />
        <dc:title></dc:title>
      </cc:Work>
    </rdf:RDF>
  </metadata>
  <sodipodi:namedview
     pagecolor="#ffffff"
     bordercolor="#666666"
     borderopacity="1"
     objecttolerance="10"
     gridtolerance="10"
     guidetolerance="10"
     inkscape:pageopacity="0"
     inkscape:pageshadow="2"
     inkscape:window-width="758"
     inkscape:window-height="480"
     id="namedview466"
     showgrid="false"
     fit-margin-top="0"
     fit-margin-left="0"
     fit-margin-right="0"
     fit-margin-bottom="0"
     inkscape:zoom="0.2102413"
     inkscape:cx="336.00143"
     inkscape:cy="336.00053"
     inkscape:window-x="0"
     inkscape:window-y="0"
     inkscape:window-maximized="0"
     inkscape:current-layer="svg464" />
  <defs
     id="defs181">
    <g
       id="g149">
      <symbol
         overflow="visible"
         id="glyph0-0"
         style="overflow:visible">
        <path
           style="stroke:none"
           d="m 5.089844,-10.625 c -0.816406,0 -1.425782,0.402344 -1.84375,1.199219 -0.414063,0.800781 -0.605469,2 -0.605469,3.601562 0,1.601563 0.191406,2.800781 0.605469,3.601563 0.417968,0.796875 1.027344,1.199218 1.84375,1.199218 0.8125,0 1.421875,-0.402343 1.839844,-1.199218 0.398437,-0.800782 0.605468,-2 0.605468,-3.601563 0,-1.601562 -0.207031,-2.800781 -0.605468,-3.601562 C 6.511719,-10.222656 5.902344,-10.625 5.089844,-10.625 m 0,-1.246094 c 1.292968,0 2.285156,0.527344 2.988281,1.550782 0.691406,1.039062 1.042969,2.542968 1.042969,4.496093 0,1.96875 -0.351563,3.472657 -1.042969,4.496094 C 7.375,-0.304688 6.382812,0.207031 5.089844,0.207031 c -1.3125,0 -2.320313,-0.511719 -3.011719,-1.535156 -0.6875,-1.023437 -1.023437,-2.527344 -1.023437,-4.496094 0,-1.953125 0.335937,-3.457031 1.023437,-4.496093 0.691406,-1.023438 1.699219,-1.550782 3.011719,-1.550782"
           id="path2"
           inkscape:connector-curvature="0" />
      </symbol>
      <symbol
         overflow="visible"
         id="glyph0-1"
         style="overflow:visible">
        <path
           style="stroke:none"
           d="m 1.984375,-1.328125 h 2.574219 v -8.894531 l -2.796875,0.558594 v -1.441407 l 2.78125,-0.558593 H 6.128906 V -1.328125 H 8.703125 V 0 h -6.71875 v -1.328125"
           id="path5"
           inkscape:connector-curvature="0" />
      </symbol>
      <symbol
         overflow="visible"
         id="glyph0-2"
         style="overflow:visible">
        <path
           style="stroke:none"
           d="M 3.070312,-1.328125 H 8.574219 V 0 H 1.167969 V -1.328125 C 1.761719,-1.9375 2.574219,-2.769531 3.617188,-3.824219 4.640625,-4.863281 5.296875,-5.535156 5.566406,-5.839844 6.078125,-6.398438 6.433594,-6.878906 6.625,-7.28125 6.816406,-7.664062 6.929688,-8.0625 6.929688,-8.449219 c 0,-0.605469 -0.226563,-1.117187 -0.65625,-1.503906 -0.433594,-0.382813 -0.992188,-0.589844 -1.699219,-0.589844 -0.496094,0 -1.023438,0.09375 -1.566407,0.253907 -0.542968,0.175781 -1.136718,0.433593 -1.761718,0.785156 v -1.601563 c 0.640625,-0.253906 1.234375,-0.445312 1.777344,-0.574219 0.542968,-0.128906 1.054687,-0.191406 1.519531,-0.191406 1.199219,0 2.160156,0.304688 2.882812,0.910156 0.71875,0.609376 1.085938,1.410157 1.085938,2.417969 0,0.480469 -0.097657,0.941407 -0.273438,1.359375 -0.175781,0.429688 -0.496093,0.945313 -0.972656,1.519532 -0.128906,0.160156 -0.546875,0.59375 -1.25,1.3125 C 5.3125,-3.632812 4.335938,-2.625 3.070312,-1.328125"
           id="path8"
           inkscape:connector-curvature="0" />
      </symbol>
      <symbol
         overflow="visible"
         id="glyph0-3"
         style="overflow:visible">
        <path
           style="stroke:none"
           d="m 6.496094,-6.289062 c 0.75,0.160156 1.34375,0.496093 1.761718,1.007812 0.414063,0.511719 0.636719,1.152344 0.636719,1.890625 0,1.152344 -0.398437,2.046875 -1.183593,2.671875 -0.800782,0.6210938 -1.917969,0.925781 -3.375,0.925781 C 3.839844,0.207031 3.328125,0.160156 2.816406,0.0625 2.304688,-0.015625 1.761719,-0.160156 1.214844,-0.351562 v -1.519532 c 0.433594,0.253906 0.914062,0.445313 1.441406,0.574219 0.511719,0.128906 1.054688,0.191406 1.632812,0.191406 0.992188,0 1.742188,-0.191406 2.253907,-0.574219 0.511719,-0.382812 0.785156,-0.960937 0.785156,-1.710937 0,-0.671875 -0.238281,-1.21875 -0.71875,-1.601563 C 6.128906,-5.375 5.457031,-5.585938 4.59375,-5.585938 H 3.230469 V -6.878906 H 4.65625 c 0.769531,0 1.359375,-0.144532 1.777344,-0.464844 0.414062,-0.304688 0.621094,-0.753906 0.621094,-1.34375 0,-0.59375 -0.222657,-1.054688 -0.640626,-1.375 -0.429687,-0.320312 -1.039062,-0.480469 -1.820312,-0.480469 -0.433594,0 -0.898438,0.04687 -1.394531,0.144531 -0.496094,0.09375 -1.039063,0.238282 -1.632813,0.429688 V -11.375 c 0.59375,-0.160156 1.152344,-0.289062 1.679688,-0.367188 0.515625,-0.08203 1.011718,-0.128906 1.488281,-0.128906 1.1875,0 2.128906,0.269532 2.832031,0.816406 0.707032,0.542969 1.058594,1.277344 1.058594,2.207032 0,0.640625 -0.191406,1.183594 -0.5625,1.632812 -0.367188,0.445313 -0.894531,0.765625 -1.566406,0.925782"
           id="path11"
           inkscape:connector-curvature="0" />
      </symbol>
      <symbol
         overflow="visible"
         id="glyph0-4"
         style="overflow:visible">
        <path
           style="stroke:none"
           d="M 8.175781,-7.039062 H 5.902344 l -0.65625,2.605468 h 2.289062 l 0.640625,-2.605468 m -1.167969,-4.449219 -0.816406,3.25 h 2.289063 l 0.816406,-3.25 h 1.246094 l -0.800781,3.25 h 2.433593 v 1.199219 H 9.441406 l -0.640625,2.605468 h 2.480469 v 1.203125 H 8.496094 L 7.679688,0 H 6.433594 L 7.230469,-3.230469 H 4.945312 L 4.144531,0 H 2.878906 L 3.695312,-3.230469 H 1.230469 v -1.203125 h 2.753906 l 0.65625,-2.605468 H 2.128906 v -1.199219 h 2.816406 l 0.796876,-3.25 h 1.265624"
           id="path14"
           inkscape:connector-curvature="0" />
      </symbol>
      <symbol
         overflow="visible"
         id="glyph0-5"
         style="overflow:visible">
        <path
           style="stroke:none"
           d=""
           id="path17"
           inkscape:connector-curvature="0" />
      </symbol>
      <symbol
         overflow="visible"
         id="glyph0-6"
         style="overflow:visible">
        <path
           style="stroke:none"
           d="m 1.566406,-11.664062 h 7.378906 v 1.328124 H 3.152344 v 3.457032 h 5.550781 v 1.328125 H 3.152344 v 4.222656 h 5.9375 V 0 H 1.566406 v -11.664062"
           id="path20"
           inkscape:connector-curvature="0" />
      </symbol>
      <symbol
         overflow="visible"
         id="glyph0-7"
         style="overflow:visible">
        <path
           style="stroke:none"
           d="M 8.785156,-8.753906 5.617188,-4.496094 8.945312,0 H 7.246094 L 4.703125,-3.441406 2.160156,0 H 0.464844 L 3.855469,-4.574219 0.753906,-8.753906 h 1.695313 l 2.320312,3.121094 2.320313,-3.121094 h 1.695312"
           id="path23"
           inkscape:connector-curvature="0" />
      </symbol>
      <symbol
         overflow="visible"
         id="glyph0-8"
         style="overflow:visible">
        <path
           style="stroke:none"
           d="m 2.894531,-1.3125 v 4.625 h -1.4375 V -8.753906 h 1.4375 v 1.328125 C 3.183594,-7.9375 3.566406,-8.320312 4.03125,-8.574219 c 0.464844,-0.257812 1.023438,-0.386719 1.664062,-0.386719 1.058594,0 1.921876,0.433594 2.59375,1.265626 0.65625,0.847656 0.992188,1.953124 0.992188,3.328124 0,1.375 -0.335938,2.496094 -0.992188,3.328126 -0.671874,0.832031 -1.535156,1.246093 -2.59375,1.246093 -0.640624,0 -1.199218,-0.128906 -1.664062,-0.367187 -0.464844,-0.238282 -0.847656,-0.625 -1.136719,-1.152344 m 4.898438,-3.054688 c 0,-1.058593 -0.226563,-1.871093 -0.65625,-2.480468 C 6.6875,-7.457031 6.097656,-7.761719 5.34375,-7.761719 c -0.769531,0 -1.359375,0.304688 -1.792969,0.914063 -0.445312,0.609375 -0.65625,1.421875 -0.65625,2.480468 0,1.054688 0.210938,1.886719 0.65625,2.496094 0.433594,0.605469 1.023438,0.894532 1.792969,0.894532 0.753906,0 1.34375,-0.289063 1.792969,-0.894532 0.429687,-0.609375 0.65625,-1.441406 0.65625,-2.496094"
           id="path26"
           inkscape:connector-curvature="0" />
      </symbol>
      <symbol
         overflow="visible"
         id="glyph0-9"
         style="overflow:visible">
        <path
           style="stroke:none"
           d="M 1.503906,-12.160156 H 2.945312 V 0 H 1.503906 v -12.160156"
           id="path29"
           inkscape:connector-curvature="0" />
      </symbol>
      <symbol
         overflow="visible"
         id="glyph0-10"
         style="overflow:visible">
        <path
           style="stroke:none"
           d="m 5.488281,-4.398438 c -1.167969,0 -1.96875,0.140626 -2.417969,0.398438 -0.445312,0.273438 -0.671874,0.71875 -0.671874,1.359375 0,0.511719 0.160156,0.929687 0.496093,1.214844 0.335938,0.304687 0.800781,0.449219 1.378907,0.449219 0.796874,0 1.4375,-0.269532 1.917968,-0.847657 0.480469,-0.558593 0.71875,-1.3125 0.71875,-2.253906 V -4.398438 H 5.488281 m 2.863281,-0.59375 V 0 H 6.910156 v -1.328125 c -0.335937,0.542969 -0.75,0.929687 -1.230468,1.167969 -0.480469,0.238281 -1.085938,0.367187 -1.792969,0.367187 -0.894531,0 -1.613281,-0.238281 -2.144531,-0.734375 -0.527344,-0.496094 -0.78125,-1.167968 -0.78125,-2.015625 0,-0.976562 0.320312,-1.714843 0.992187,-2.226562 0.65625,-0.496094 1.632813,-0.75 2.941406,-0.75 h 2.015625 v -0.144531 c 0,-0.65625 -0.222656,-1.167969 -0.652344,-1.535157 -0.433593,-0.351562 -1.042968,-0.542969 -1.824218,-0.542969 -0.511719,0 -0.992188,0.0625 -1.472656,0.191407 -0.480469,0.125 -0.929688,0.304687 -1.359376,0.527343 V -8.351562 C 2.113281,-8.542969 2.625,-8.703125 3.121094,-8.800781 c 0.496094,-0.09375 0.976562,-0.160157 1.453125,-0.160157 1.265625,0 2.210937,0.335938 2.832031,0.992188 0.625,0.65625 0.945312,1.648438 0.945312,2.976562"
           id="path32"
           inkscape:connector-curvature="0" />
      </symbol>
      <symbol
         overflow="visible"
         id="glyph0-11"
         style="overflow:visible">
        <path
           style="stroke:none"
           d="M 8.785156,-5.28125 V 0 H 7.34375 v -5.230469 c 0,-0.832031 -0.175781,-1.441406 -0.496094,-1.859375 -0.320312,-0.414062 -0.800781,-0.621094 -1.441406,-0.621094 -0.78125,0 -1.390625,0.253907 -1.839844,0.75 -0.445312,0.496094 -0.671875,1.167969 -0.671875,2.015626 V 0 h -1.4375 v -8.753906 h 1.4375 v 1.363281 c 0.335938,-0.511719 0.738281,-0.914063 1.21875,-1.167969 0.460938,-0.257812 1.007813,-0.402344 1.613281,-0.402344 0.992188,0 1.761719,0.320313 2.273438,0.945313 0.511719,0.625 0.785156,1.535156 0.785156,2.734375"
           id="path35"
           inkscape:connector-curvature="0" />
      </symbol>
      <symbol
         overflow="visible"
         id="glyph0-12"
         style="overflow:visible">
        <path
           style="stroke:none"
           d="m 2.929688,-11.230469 v 2.476563 h 2.957031 v 1.121094 H 2.929688 v 4.753906 c 0,0.71875 0.09375,1.183594 0.285156,1.375 0.191406,0.207031 0.59375,0.304687 1.199218,0.304687 H 5.886719 V 0 H 4.414062 C 3.296875,0 2.527344,-0.207031 2.113281,-0.625 c -0.417969,-0.414062 -0.625,-1.167969 -0.625,-2.253906 V -7.632812 H 0.433594 v -1.121094 h 1.054687 v -2.476563 h 1.441407"
           id="path38"
           inkscape:connector-curvature="0" />
      </symbol>
      <symbol
         overflow="visible"
         id="glyph0-13"
         style="overflow:visible">
        <path
           style="stroke:none"
           d="M 1.503906,-8.753906 H 2.945312 V 0 H 1.503906 v -8.753906 m 0,-3.40625 h 1.441406 v 1.824218 H 1.503906 v -1.824218"
           id="path41"
           inkscape:connector-curvature="0" />
      </symbol>
      <symbol
         overflow="visible"
         id="glyph0-14"
         style="overflow:visible">
        <path
           style="stroke:none"
           d="m 4.894531,-7.742188 c -0.765625,0 -1.375,0.300782 -1.824219,0.910157 -0.445312,0.609375 -0.671874,1.425781 -0.671874,2.464843 0,1.054688 0.210937,1.871094 0.65625,2.480469 0.449218,0.605469 1.058593,0.894531 1.839843,0.894531 0.769531,0 1.378907,-0.289062 1.824219,-0.894531 0.449219,-0.609375 0.671875,-1.425781 0.671875,-2.480469 0,-1.023437 -0.222656,-1.855468 -0.671875,-2.464843 C 6.273438,-7.441406 5.664062,-7.742188 4.894531,-7.742188 m 0,-1.21875 c 1.25,0 2.226563,0.417969 2.945313,1.21875 0.703125,0.8125 1.070312,1.933594 1.070312,3.375 0,1.4375 -0.367187,2.558594 -1.070312,3.359376 -0.71875,0.816406 -1.695313,1.214843 -2.945313,1.214843 -1.261719,0 -2.253906,-0.398437 -2.957031,-1.214843 -0.707031,-0.800782 -1.058594,-1.921876 -1.058594,-3.359376 0,-1.441406 0.351563,-2.5625 1.058594,-3.375 0.703125,-0.800781 1.695312,-1.21875 2.957031,-1.21875"
           id="path44"
           inkscape:connector-curvature="0" />
      </symbol>
      <symbol
         overflow="visible"
         id="glyph0-15"
         style="overflow:visible">
        <path
           style="stroke:none"
           d="m 7.089844,-8.496094 v 1.359375 C 6.671875,-7.328125 6.257812,-7.488281 5.824219,-7.601562 5.375,-7.695312 4.929688,-7.761719 4.464844,-7.761719 c -0.722656,0 -1.265625,0.113281 -1.617188,0.335938 -0.351562,0.226562 -0.527344,0.546875 -0.527344,0.976562 0,0.335938 0.128907,0.59375 0.382813,0.785157 0.257813,0.191406 0.769531,0.382812 1.535156,0.542968 l 0.496094,0.113282 c 1.027344,0.222656 1.746094,0.542968 2.175781,0.929687 0.417969,0.398437 0.640625,0.957031 0.640625,1.664063 0,0.8125 -0.320312,1.453124 -0.957031,1.917968 C 5.953125,-0.015625 5.054688,0.207031 3.9375,0.207031 3.457031,0.207031 2.976562,0.160156 2.464844,0.078125 1.953125,0 1.425781,-0.128906 0.863281,-0.320312 v -1.488282 c 0.527344,0.289063 1.058594,0.496094 1.570313,0.625 0.511718,0.144532 1.023437,0.207032 1.535156,0.207032 0.671875,0 1.199219,-0.113282 1.566406,-0.335938 0.351563,-0.222656 0.542969,-0.558594 0.542969,-0.992188 0,-0.382812 -0.140625,-0.6875 -0.398437,-0.894531 C 5.425781,-3.40625 4.847656,-3.617188 3.953125,-3.808594 L 3.457031,-3.921875 C 2.558594,-4.113281 1.902344,-4.398438 1.519531,-4.785156 1.121094,-5.167969 0.929688,-5.695312 0.929688,-6.382812 c 0,-0.816407 0.285156,-1.457032 0.863281,-1.90625 0.574219,-0.445313 1.40625,-0.671876 2.496093,-0.671876 0.527344,0 1.023438,0.050782 1.503907,0.128907 0.464843,0.078125 0.894531,0.191406 1.296875,0.335937"
           id="path47"
           inkscape:connector-curvature="0" />
      </symbol>
      <symbol
         overflow="visible"
         id="glyph0-16"
         style="overflow:visible">
        <path
           style="stroke:none"
           d="m 10.304688,-10.769531 v 1.664062 C 9.761719,-9.585938 9.199219,-9.953125 8.59375,-10.207031 7.984375,-10.449219 7.359375,-10.574219 6.6875,-10.574219 c -1.34375,0 -2.367188,0.414063 -3.070312,1.230469 -0.707032,0.816406 -1.058594,1.984375 -1.058594,3.519531 0,1.535157 0.351562,2.71875 1.058594,3.535157 0.703124,0.816406 1.726562,1.21875 3.070312,1.21875 0.671875,0 1.296875,-0.113282 1.90625,-0.371094 0.605469,-0.238282 1.167969,-0.605469 1.710938,-1.101563 v 1.648438 C 9.742188,-0.511719 9.152344,-0.238281 8.542969,-0.0625 7.9375,0.113281 7.28125,0.207031 6.59375,0.207031 4.832031,0.207031 3.441406,-0.320312 2.414062,-1.390625 1.390625,-2.464844 0.894531,-3.9375 0.894531,-5.824219 c 0,-1.871093 0.496094,-3.34375 1.519531,-4.433593 1.027344,-1.070313 2.417969,-1.613282 4.179688,-1.613282 0.703125,0 1.359375,0.09375 1.964844,0.269532 0.609375,0.195312 1.203125,0.464843 1.746094,0.832031"
           id="path50"
           inkscape:connector-curvature="0" />
      </symbol>
      <symbol
         overflow="visible"
         id="glyph0-17"
         style="overflow:visible">
        <path
           style="stroke:none"
           d="M 6.574219,-7.40625 C 6.414062,-7.503906 6.238281,-7.566406 6.046875,-7.617188 c -0.191406,-0.03125 -0.398437,-0.0625 -0.621094,-0.0625 -0.816406,0 -1.441406,0.273438 -1.875,0.800782 -0.445312,0.527344 -0.65625,1.277344 -0.65625,2.269531 V 0 h -1.4375 v -8.753906 h 1.4375 v 1.363281 c 0.289063,-0.53125 0.691407,-0.929687 1.167969,-1.183594 0.480469,-0.257812 1.074219,-0.386719 1.777344,-0.386719 0.097656,0 0.207031,0.015626 0.335937,0.015626 0.113281,0.015624 0.238281,0.035156 0.398438,0.066406 v 1.472656"
           id="path53"
           inkscape:connector-curvature="0" />
      </symbol>
      <symbol
         overflow="visible"
         id="glyph0-18"
         style="overflow:visible">
        <path
           style="stroke:none"
           d="M 8.992188,-4.734375 V -4.03125 H 2.382812 c 0.066407,0.992188 0.351563,1.757812 0.898438,2.269531 0.527344,0.515625 1.261719,0.769531 2.222656,0.769531 0.542969,0 1.089844,-0.0625 1.601563,-0.191406 0.511719,-0.128906 1.039062,-0.335937 1.550781,-0.625 v 1.359375 C 8.144531,-0.222656 7.617188,-0.046875 7.070312,0.046875 6.527344,0.144531 5.96875,0.207031 5.425781,0.207031 c -1.410156,0 -2.515625,-0.398437 -3.328125,-1.199219 -0.816406,-0.800781 -1.21875,-1.902343 -1.21875,-3.296874 0,-1.421876 0.386719,-2.558594 1.152344,-3.40625 0.769531,-0.832032 1.824219,-1.265626 3.136719,-1.265626 1.183593,0 2.113281,0.386719 2.800781,1.136719 0.671875,0.769531 1.023438,1.792969 1.023438,3.089844 M 7.550781,-5.152344 C 7.535156,-5.9375 7.3125,-6.558594 6.894531,-7.039062 6.464844,-7.503906 5.886719,-7.742188 5.183594,-7.742188 c -0.800782,0 -1.441406,0.238282 -1.917969,0.6875 -0.480469,0.445313 -0.769531,1.085938 -0.832031,1.902344 h 5.117187"
           id="path56"
           inkscape:connector-curvature="0" />
      </symbol>
      <symbol
         overflow="visible"
         id="glyph0-19"
         style="overflow:visible">
        <path
           style="stroke:none"
           d="m 7.808594,-8.414062 v 1.34375 C 7.390625,-7.296875 6.992188,-7.457031 6.574219,-7.566406 6.160156,-7.679688 5.761719,-7.742188 5.34375,-7.742188 c -0.929688,0 -1.664062,0.300782 -2.175781,0.894532 -0.511719,0.589844 -0.769531,1.421875 -0.769531,2.480468 0,1.070313 0.257812,1.902344 0.769531,2.496094 0.511719,0.589844 1.246093,0.878906 2.175781,0.878906 0.417969,0 0.816406,-0.046874 1.230469,-0.160156 0.417969,-0.113281 0.816406,-0.289062 1.234375,-0.511718 v 1.328124 C 7.390625,-0.144531 6.976562,0 6.558594,0.078125 c -0.429688,0.082031 -0.894532,0.128906 -1.375,0.128906 -1.3125,0 -2.367188,-0.398437 -3.136719,-1.230469 -0.78125,-0.816406 -1.167969,-1.9375 -1.167969,-3.34375 0,-1.425781 0.386719,-2.542968 1.167969,-3.359374 0.785156,-0.816407 1.855469,-1.234376 3.234375,-1.234376 0.445312,0 0.878906,0.050782 1.292969,0.144532 0.417969,0.097656 0.832031,0.222656 1.234375,0.402344"
           id="path59"
           inkscape:connector-curvature="0" />
      </symbol>
      <symbol
         overflow="visible"
         id="glyph0-20"
         style="overflow:visible">
        <path
           style="stroke:none"
           d="M 6.046875,-10.289062 2.0625,-4.0625 h 3.984375 v -6.226562 m -0.414063,-1.375 H 7.617188 V -4.0625 H 9.28125 v 1.308594 H 7.617188 V 0 H 6.046875 V -2.753906 H 0.785156 v -1.519532 l 4.847656,-7.390624"
           id="path62"
           inkscape:connector-curvature="0" />
      </symbol>
      <symbol
         overflow="visible"
         id="glyph0-21"
         style="overflow:visible">
        <path
           style="stroke:none"
           d="m 5.28125,-6.464844 c -0.707031,0 -1.265625,0.257813 -1.679688,0.738282 -0.417968,0.480468 -0.625,1.152343 -0.625,1.984374 0,0.847657 0.207032,1.519532 0.625,2 0.414063,0.476563 0.972657,0.71875 1.679688,0.71875 0.703125,0 1.261719,-0.242187 1.679688,-0.71875 0.414062,-0.480468 0.625,-1.152343 0.625,-2 0,-0.832031 -0.210938,-1.503906 -0.625,-1.984374 C 6.542969,-6.207031 5.984375,-6.464844 5.28125,-6.464844 m 3.132812,-4.941406 v 1.4375 c -0.398437,-0.191406 -0.796874,-0.335938 -1.199218,-0.429688 -0.414063,-0.09766 -0.816406,-0.144531 -1.199219,-0.144531 -1.054687,0 -1.855469,0.351563 -2.398437,1.054688 C 3.070312,-8.785156 2.753906,-7.710938 2.6875,-6.304688 2.992188,-6.753906 3.375,-7.105469 3.839844,-7.34375 4.304688,-7.585938 4.816406,-7.710938 5.375,-7.710938 c 1.167969,0 2.097656,0.367188 2.769531,1.070313 0.671875,0.703125 1.023438,1.679687 1.023438,2.898437 0,1.199219 -0.367188,2.15625 -1.070313,2.878907 -0.707031,0.71875 -1.648437,1.070312 -2.816406,1.070312 -1.34375,0 -2.386719,-0.511719 -3.089844,-1.535156 -0.71875,-1.023437 -1.070312,-2.527344 -1.070312,-4.496094 0,-1.839843 0.429687,-3.3125 1.3125,-4.398437 0.863281,-1.089844 2.046875,-1.648438 3.519531,-1.648438 0.382813,0 0.78125,0.04687 1.199219,0.109375 0.398437,0.08203 0.816406,0.195313 1.261718,0.355469"
           id="path65"
           inkscape:connector-curvature="0" />
      </symbol>
      <symbol
         overflow="visible"
         id="glyph0-22"
         style="overflow:visible">
        <path
           style="stroke:none"
           d="m 5.089844,-5.535156 c -0.753906,0 -1.347656,0.207031 -1.777344,0.605468 -0.433594,0.402344 -0.640625,0.945313 -0.640625,1.648438 0,0.707031 0.207031,1.265625 0.640625,1.664062 0.429688,0.402344 1.023438,0.59375 1.777344,0.59375 0.734375,0 1.324218,-0.191406 1.757812,-0.609374 0.433594,-0.398438 0.65625,-0.941407 0.65625,-1.648438 0,-0.703125 -0.222656,-1.246094 -0.640625,-1.648438 C 6.433594,-5.328125 5.839844,-5.535156 5.089844,-5.535156 M 3.503906,-6.207031 C 2.832031,-6.367188 2.304688,-6.6875 1.921875,-7.152344 c -0.386719,-0.464844 -0.5625,-1.023437 -0.5625,-1.695312 0,-0.929688 0.320313,-1.664063 0.992187,-2.207032 0.65625,-0.546874 1.570313,-0.816406 2.738282,-0.816406 1.148437,0 2.0625,0.269532 2.734375,0.816406 0.65625,0.542969 0.992187,1.277344 0.992187,2.207032 0,0.671875 -0.191406,1.230468 -0.578125,1.695312 -0.382812,0.464844 -0.894531,0.785156 -1.566406,0.945313 0.753906,0.175781 1.34375,0.527343 1.777344,1.039062 0.414062,0.511719 0.640625,1.152344 0.640625,1.886719 0,1.136719 -0.355469,2 -1.042969,2.59375 -0.703125,0.609375 -1.679687,0.894531 -2.957031,0.894531 -1.296875,0 -2.289063,-0.285156 -2.976563,-0.894531 -0.6875,-0.59375 -1.023437,-1.457031 -1.023437,-2.59375 0,-0.734375 0.207031,-1.375 0.636718,-1.886719 0.417969,-0.511719 1.007813,-0.863281 1.777344,-1.039062 M 2.929688,-8.703125 c 0,0.605469 0.175781,1.085937 0.558593,1.421875 0.382813,0.335938 0.910157,0.496094 1.601563,0.496094 0.671875,0 1.199218,-0.160156 1.582031,-0.496094 0.382813,-0.335938 0.574219,-0.816406 0.574219,-1.421875 0,-0.609375 -0.191406,-1.074219 -0.574219,-1.410156 C 6.289062,-10.449219 5.761719,-10.625 5.089844,-10.625 c -0.691406,0 -1.21875,0.175781 -1.601563,0.511719 -0.382812,0.335937 -0.558593,0.800781 -0.558593,1.410156"
           id="path68"
           inkscape:connector-curvature="0" />
      </symbol>
      <symbol
         overflow="visible"
         id="glyph1-0"
         style="overflow:visible">
        <path
           style="stroke:none"
           d="m -11.28125,-8.558594 h 1.539062 c -0.289062,0.605469 -0.496093,1.167969 -0.640624,1.695313 -0.128907,0.542969 -0.210938,1.054687 -0.210938,1.535156 0,0.863281 0.179688,1.535156 0.496094,2 0.335937,0.464844 0.816406,0.6875 1.425781,0.6875 0.511719,0 0.910156,-0.144531 1.167969,-0.464844 C -7.230469,-3.40625 -7.023438,-4 -6.863281,-4.863281 l 0.191406,-0.960938 c 0.222656,-1.167969 0.625,-2.03125 1.183594,-2.589843 0.578125,-0.5625 1.328125,-0.851563 2.273437,-0.851563 1.136719,0 1.984375,0.386719 2.558594,1.136719 0.578125,0.769531 0.863281,1.871094 0.863281,3.328125 0,0.5625 -0.0625,1.152343 -0.175781,1.777343 -0.109375,0.625 -0.289062,1.261719 -0.542969,1.917969 h -1.632812 c 0.367187,-0.636719 0.640625,-1.261719 0.816406,-1.871093 0.191406,-0.609376 0.273437,-1.214844 0.273437,-1.824219 0,-0.894531 -0.175781,-1.582031 -0.53125,-2.078125 -0.351562,-0.480469 -0.847656,-0.738282 -1.519531,-0.738282 -0.574219,0 -1.023437,0.175782 -1.34375,0.527344 -0.320312,0.355469 -0.558593,0.929688 -0.71875,1.730469 l -0.191406,0.960937 c -0.226563,1.183594 -0.59375,2.03125 -1.105469,2.558594 -0.496094,0.527344 -1.183594,0.785156 -2.078125,0.785156 -1.023437,0 -1.839843,-0.351562 -2.433593,-1.089843 -0.589844,-0.71875 -0.894532,-1.726563 -0.894532,-3.007813 0,-0.542968 0.04687,-1.085937 0.144532,-1.664062 0.09375,-0.558594 0.253906,-1.136719 0.445312,-1.742188"
           id="path71"
           inkscape:connector-curvature="0" />
      </symbol>
      <symbol
         overflow="visible"
         id="glyph1-1"
         style="overflow:visible">
        <path
           style="stroke:none"
           d="m -11.664062,-1.390625 v -1.585937 h 7.089843 c 1.246094,0 2.160157,-0.222657 2.703125,-0.671876 0.542969,-0.449218 0.816406,-1.183593 0.816406,-2.207031 0,-1.007812 -0.273437,-1.746093 -0.816406,-2.191406 -0.542968,-0.449219 -1.457031,-0.6875 -2.703125,-0.6875 h -7.089843 v -1.585937 h 7.28125 c 1.535156,0 2.671874,0.382812 3.4375,1.136718 0.769531,0.75 1.152343,1.855469 1.152343,3.328125 0,1.472657 -0.382812,2.589844 -1.152343,3.34375 -0.765626,0.75 -1.902344,1.121094 -3.4375,1.121094 h -7.28125"
           id="path74"
           inkscape:connector-curvature="0" />
      </symbol>
      <symbol
         overflow="visible"
         id="glyph1-2"
         style="overflow:visible">
        <path
           style="stroke:none"
           d=""
           id="path77"
           inkscape:connector-curvature="0" />
      </symbol>
      <symbol
         overflow="visible"
         id="glyph1-3"
         style="overflow:visible">
        <path
           style="stroke:none"
           d="m -8.496094,-7.089844 h 1.359375 c -0.191406,0.417969 -0.351562,0.832032 -0.464843,1.265625 -0.09375,0.449219 -0.160157,0.894531 -0.160157,1.359375 0,0.722656 0.113281,1.265625 0.335938,1.617188 0.226562,0.351562 0.546875,0.527344 0.976562,0.527344 0.335938,0 0.59375,-0.128907 0.785157,-0.382813 0.191406,-0.257813 0.382812,-0.769531 0.542968,-1.535156 l 0.113282,-0.496094 c 0.222656,-1.027344 0.542968,-1.746094 0.929687,-2.175781 0.398437,-0.417969 0.957031,-0.640625 1.664063,-0.640625 0.8125,0 1.453124,0.320312 1.917968,0.957031 0.480469,0.640625 0.703125,1.539062 0.703125,2.65625 0,0.480469 -0.046875,0.960938 -0.128906,1.472656 C 0,-1.953125 -0.128906,-1.425781 -0.320312,-0.863281 h -1.488282 c 0.289063,-0.527344 0.496094,-1.058594 0.625,-1.570313 0.144532,-0.511718 0.207032,-1.023437 0.207032,-1.535156 0,-0.671875 -0.113282,-1.199219 -0.335938,-1.566406 -0.222656,-0.351563 -0.558594,-0.542969 -0.992188,-0.542969 -0.382812,0 -0.6875,0.140625 -0.894531,0.398437 -0.207031,0.253907 -0.417969,0.832032 -0.609375,1.726563 l -0.113281,0.496094 c -0.191406,0.898437 -0.476563,1.554687 -0.863281,1.9375 -0.382813,0.398437 -0.910156,0.589843 -1.597656,0.589843 -0.816407,0 -1.457032,-0.285156 -1.90625,-0.863281 -0.445313,-0.574219 -0.671876,-1.40625 -0.671876,-2.496093 0,-0.527344 0.050782,-1.023438 0.128907,-1.503907 0.078125,-0.464843 0.191406,-0.894531 0.335937,-1.296875"
           id="path80"
           inkscape:connector-curvature="0" />
      </symbol>
      <symbol
         overflow="visible"
         id="glyph1-4"
         style="overflow:visible">
        <path
           style="stroke:none"
           d="m -8.414062,-7.808594 h 1.34375 c -0.226563,0.417969 -0.386719,0.816406 -0.496094,1.234375 -0.113282,0.414063 -0.175782,0.8125 -0.175782,1.230469 0,0.929688 0.300782,1.664062 0.894532,2.175781 0.589844,0.511719 1.421875,0.769531 2.480468,0.769531 1.070313,0 1.902344,-0.257812 2.496094,-0.769531 0.589844,-0.511719 0.878906,-1.246093 0.878906,-2.175781 0,-0.417969 -0.046874,-0.816406 -0.160156,-1.230469 -0.113281,-0.417969 -0.289062,-0.816406 -0.511718,-1.234375 h 1.328124 c 0.191407,0.417969 0.335938,0.832032 0.414063,1.25 0.082031,0.429688 0.128906,0.894532 0.128906,1.375 0,1.3125 -0.398437,2.367188 -1.230469,3.136719 -0.816406,0.78125 -1.9375,1.167969 -3.34375,1.167969 -1.425781,0 -2.542968,-0.386719 -3.359374,-1.167969 -0.816407,-0.785156 -1.234376,-1.855469 -1.234376,-3.234375 0,-0.445312 0.050782,-0.878906 0.144532,-1.292969 0.097656,-0.417969 0.222656,-0.832031 0.402344,-1.234375"
           id="path83"
           inkscape:connector-curvature="0" />
      </symbol>
      <symbol
         overflow="visible"
         id="glyph1-5"
         style="overflow:visible">
        <path
           style="stroke:none"
           d="m -7.742188,-4.894531 c 0,0.765625 0.300782,1.375 0.910157,1.824219 0.609375,0.445312 1.425781,0.671874 2.464843,0.671874 1.054688,0 1.871094,-0.210937 2.480469,-0.65625 0.605469,-0.449218 0.894531,-1.058593 0.894531,-1.839843 0,-0.769531 -0.289062,-1.378907 -0.894531,-1.824219 -0.609375,-0.449219 -1.425781,-0.671875 -2.480469,-0.671875 -1.023437,0 -1.855468,0.222656 -2.464843,0.671875 -0.609375,0.445312 -0.910157,1.054688 -0.910157,1.824219 m -1.21875,0 c 0,-1.25 0.417969,-2.226563 1.21875,-2.945313 0.8125,-0.703125 1.933594,-1.070312 3.375,-1.070312 1.4375,0 2.558594,0.367187 3.359376,1.070312 0.816406,0.71875 1.214843,1.695313 1.214843,2.945313 0,1.261719 -0.398437,2.253906 -1.214843,2.957031 -0.800782,0.707031 -1.921876,1.058594 -3.359376,1.058594 -1.441406,0 -2.5625,-0.351563 -3.375,-1.058594 -0.800781,-0.703125 -1.21875,-1.695312 -1.21875,-2.957031"
           id="path86"
           inkscape:connector-curvature="0" />
      </symbol>
      <symbol
         overflow="visible"
         id="glyph1-6"
         style="overflow:visible">
        <path
           style="stroke:none"
           d="m -7.40625,-6.574219 c -0.097656,0.160157 -0.160156,0.335938 -0.210938,0.527344 -0.03125,0.191406 -0.0625,0.398437 -0.0625,0.621094 0,0.816406 0.273438,1.441406 0.800782,1.875 0.527344,0.445312 1.277344,0.65625 2.269531,0.65625 H 0 v 1.4375 h -8.753906 v -1.4375 h 1.363281 c -0.53125,-0.289063 -0.929687,-0.691407 -1.183594,-1.167969 -0.257812,-0.480469 -0.386719,-1.074219 -0.386719,-1.777344 0,-0.097656 0.015626,-0.207031 0.015626,-0.335937 0.015624,-0.113281 0.035156,-0.238281 0.066406,-0.398438 h 1.472656"
           id="path89"
           inkscape:connector-curvature="0" />
      </symbol>
      <symbol
         overflow="visible"
         id="glyph1-7"
         style="overflow:visible">
        <path
           style="stroke:none"
           d="m -4.734375,-8.992188 h 0.703125 v 6.609376 c 0.992188,-0.066407 1.757812,-0.351563 2.269531,-0.898438 0.515625,-0.527344 0.769531,-1.261719 0.769531,-2.222656 0,-0.542969 -0.0625,-1.089844 -0.191406,-1.601563 -0.128906,-0.511719 -0.335937,-1.039062 -0.625,-1.550781 h 1.359375 c 0.226563,0.511719 0.402344,1.039062 0.496094,1.585938 0.097656,0.542968 0.160156,1.101562 0.160156,1.644531 0,1.410156 -0.398437,2.515625 -1.199219,3.328125 -0.800781,0.816406 -1.902343,1.21875 -3.296874,1.21875 -1.421876,0 -2.558594,-0.386719 -3.40625,-1.152344 -0.832032,-0.769531 -1.265626,-1.824219 -1.265626,-3.136719 0,-1.183593 0.386719,-2.113281 1.136719,-2.800781 0.769531,-0.671875 1.792969,-1.023438 3.089844,-1.023438 m -0.417969,1.441407 c -0.785156,0.015625 -1.40625,0.238281 -1.886718,0.65625 -0.464844,0.429687 -0.703126,1.007812 -0.703126,1.710937 0,0.800782 0.238282,1.441406 0.6875,1.917969 0.445313,0.480469 1.085938,0.769531 1.902344,0.832031 v -5.117187"
           id="path92"
           inkscape:connector-curvature="0" />
      </symbol>
      <symbol
         overflow="visible"
         id="glyph2-0"
         style="overflow:visible">
        <path
           style="stroke:none"
           d="m 1.882812,-13.996094 h 8.851563 v 1.59375 H 3.78125 v 4.144532 h 6.664062 v 1.59375 H 3.78125 v 5.070312 h 7.125 V 0 H 1.882812 v -13.996094"
           id="path95"
           inkscape:connector-curvature="0" />
      </symbol>
      <symbol
         overflow="visible"
         id="glyph2-1"
         style="overflow:visible">
        <path
           style="stroke:none"
           d="M 10.539062,-10.503906 6.738281,-5.394531 10.734375,0 H 8.699219 L 5.644531,-4.128906 2.59375,0 H 0.558594 L 4.628906,-5.492188 0.902344,-10.503906 H 2.9375 l 2.785156,3.746094 2.78125,-3.746094 h 2.035156"
           id="path98"
           inkscape:connector-curvature="0" />
      </symbol>
      <symbol
         overflow="visible"
         id="glyph2-2"
         style="overflow:visible">
        <path
           style="stroke:none"
           d="M 3.476562,-1.574219 V 3.972656 H 1.746094 v -14.476562 h 1.730468 v 1.59375 c 0.34375,-0.613282 0.804688,-1.074219 1.363282,-1.382813 0.554687,-0.304687 1.226562,-0.460937 1.996094,-0.460937 1.265624,0 2.304687,0.519531 3.109374,1.519531 0.789063,1.015625 1.191407,2.339844 1.191407,3.992187 0,1.652344 -0.402344,2.996094 -1.191407,3.996094 C 9.140625,-0.25 8.101562,0.25 6.835938,0.25 6.066406,0.25 5.394531,0.0976562 4.839844,-0.191406 4.28125,-0.480469 3.820312,-0.941406 3.476562,-1.574219 m 5.875,-3.667969 C 9.351562,-6.507812 9.082031,-7.488281 8.5625,-8.21875 8.027344,-8.945312 7.316406,-9.3125 6.414062,-9.3125 c -0.921874,0 -1.632812,0.367188 -2.152343,1.09375 -0.535157,0.730469 -0.785157,1.710938 -0.785157,2.976562 0,1.269532 0.25,2.265626 0.785157,2.996094 0.519531,0.730469 1.230469,1.074219 2.152343,1.074219 0.902344,0 1.613282,-0.34375 2.148438,-1.074219 0.519531,-0.730468 0.789062,-1.726562 0.789062,-2.996094"
           id="path101"
           inkscape:connector-curvature="0" />
      </symbol>
      <symbol
         overflow="visible"
         id="glyph2-3"
         style="overflow:visible">
        <path
           style="stroke:none"
           d="M 1.804688,-14.59375 H 3.53125 V 0 H 1.804688 v -14.59375"
           id="path104"
           inkscape:connector-curvature="0" />
      </symbol>
      <symbol
         overflow="visible"
         id="glyph2-4"
         style="overflow:visible">
        <path
           style="stroke:none"
           d="m 6.585938,-5.28125 c -1.402344,0 -2.363282,0.175781 -2.898438,0.480469 -0.539062,0.328125 -0.808594,0.863281 -0.808594,1.632812 0,0.613281 0.191406,1.113281 0.597656,1.460938 0.402344,0.363281 0.957032,0.535156 1.648438,0.535156 0.960938,0 1.730469,-0.324219 2.304688,-1.015625 0.578124,-0.671875 0.863281,-1.574219 0.863281,-2.707031 V -5.28125 H 6.585938 m 3.4375,-0.710938 V 0 H 8.292969 V -1.59375 C 7.890625,-0.941406 7.390625,-0.480469 6.816406,-0.191406 6.238281,0.0976562 5.511719,0.25 4.664062,0.25 3.589844,0.25 2.726562,-0.0390625 2.09375,-0.632812 1.460938,-1.230469 1.152344,-2.035156 1.152344,-3.054688 c 0,-1.167968 0.382812,-2.050781 1.191406,-2.667968 C 3.128906,-6.316406 4.300781,-6.625 5.875,-6.625 h 2.417969 v -0.171875 c 0,-0.789063 -0.265625,-1.402344 -0.785157,-1.84375 -0.519531,-0.421875 -1.25,-0.652344 -2.1875,-0.652344 -0.617187,0 -1.191406,0.078125 -1.769531,0.230469 -0.574219,0.152344 -1.113281,0.363281 -1.628906,0.632812 v -1.59375 c 0.613281,-0.230468 1.226563,-0.421874 1.820313,-0.535156 0.597656,-0.117187 1.171874,-0.195312 1.75,-0.195312 1.515624,0 2.648437,0.40625 3.398437,1.191406 0.746094,0.789062 1.132813,1.976562 1.132813,3.570312"
           id="path107"
           inkscape:connector-curvature="0" />
      </symbol>
      <symbol
         overflow="visible"
         id="glyph2-5"
         style="overflow:visible">
        <path
           style="stroke:none"
           d="M 10.539062,-6.335938 V 0 H 8.8125 v -6.277344 c 0,-1 -0.210938,-1.730468 -0.59375,-2.226562 -0.386719,-0.5 -0.960938,-0.75 -1.730469,-0.75 -0.941406,0 -1.667969,0.308594 -2.207031,0.902344 -0.539062,0.59375 -0.804688,1.402343 -0.804688,2.417968 V 0 H 1.746094 v -10.503906 h 1.730468 v 1.632812 c 0.402344,-0.613281 0.882813,-1.09375 1.457032,-1.402344 0.558594,-0.304687 1.210937,-0.480468 1.941406,-0.480468 1.1875,0 2.109375,0.386718 2.726562,1.132812 0.613282,0.75 0.9375,1.84375 0.9375,3.285156"
           id="path110"
           inkscape:connector-curvature="0" />
      </symbol>
      <symbol
         overflow="visible"
         id="glyph2-6"
         style="overflow:visible">
        <path
           style="stroke:none"
           d="m 3.511719,-13.476562 v 2.972656 h 3.554687 v 1.34375 H 3.511719 v 5.703125 c 0,0.863281 0.117187,1.421875 0.347656,1.652343 0.230469,0.25 0.710937,0.363282 1.441406,0.363282 H 7.066406 V 0 H 5.300781 c -1.34375,0 -2.265625,-0.25 -2.765625,-0.75 -0.5,-0.496094 -0.75,-1.402344 -0.75,-2.707031 V -9.160156 H 0.519531 v -1.34375 h 1.265625 v -2.972656 h 1.726563"
           id="path113"
           inkscape:connector-curvature="0" />
      </symbol>
      <symbol
         overflow="visible"
         id="glyph2-7"
         style="overflow:visible">
        <path
           style="stroke:none"
           d="M 1.804688,-10.503906 H 3.53125 V 0 H 1.804688 v -10.503906 m 0,-4.089844 H 3.53125 v 2.191406 H 1.804688 v -2.191406"
           id="path116"
           inkscape:connector-curvature="0" />
      </symbol>
      <symbol
         overflow="visible"
         id="glyph2-8"
         style="overflow:visible">
        <path
           style="stroke:none"
           d="m 5.875,-9.292969 c -0.921875,0 -1.652344,0.363281 -2.1875,1.09375 -0.539062,0.730469 -0.808594,1.710938 -0.808594,2.957031 0,1.269532 0.25,2.246094 0.789063,2.976563 0.535156,0.730469 1.265625,1.074219 2.207031,1.074219 0.921875,0 1.652344,-0.34375 2.1875,-1.074219 0.539062,-0.730469 0.808594,-1.707031 0.808594,-2.976563 0,-1.226562 -0.269532,-2.226562 -0.808594,-2.957031 -0.535156,-0.730469 -1.265625,-1.09375 -2.1875,-1.09375 m 0,-1.460937 c 1.496094,0 2.667969,0.5 3.53125,1.460937 0.847656,0.980469 1.289062,2.324219 1.289062,4.050781 0,1.730469 -0.441406,3.074219 -1.289062,4.03125 C 8.542969,-0.230469 7.371094,0.25 5.875,0.25 4.359375,0.25 3.167969,-0.230469 2.324219,-1.210938 1.476562,-2.167969 1.054688,-3.511719 1.054688,-5.242188 c 0,-1.726562 0.421874,-3.070312 1.269531,-4.050781 0.84375,-0.960937 2.035156,-1.460937 3.550781,-1.460937"
           id="path119"
           inkscape:connector-curvature="0" />
      </symbol>
      <symbol
         overflow="visible"
         id="glyph2-9"
         style="overflow:visible">
        <path
           style="stroke:none"
           d=""
           id="path122"
           inkscape:connector-curvature="0" />
      </symbol>
      <symbol
         overflow="visible"
         id="glyph2-10"
         style="overflow:visible">
        <path
           style="stroke:none"
           d="m 12.363281,-12.921875 v 1.996094 C 11.710938,-11.5 11.039062,-11.941406 10.308594,-12.25 c -0.726563,-0.289062 -1.476563,-0.441406 -2.28125,-0.441406 -1.613282,0 -2.84375,0.5 -3.6875,1.480468 -0.84375,0.976563 -1.269532,2.378907 -1.269532,4.222657 0,1.84375 0.425782,3.261719 1.269532,4.242187 0.84375,0.980469 2.074218,1.460938 3.6875,1.460938 0.804687,0 1.554687,-0.136719 2.28125,-0.441406 0.730468,-0.289063 1.402344,-0.730469 2.054687,-1.328126 v 1.980469 c -0.671875,0.460938 -1.382812,0.785157 -2.109375,0.996094 C 9.523438,0.132812 8.734375,0.25 7.910156,0.25 5.796875,0.25 4.128906,-0.382812 2.898438,-1.671875 1.671875,-2.957031 1.074219,-4.722656 1.074219,-6.988281 c 0,-2.246094 0.597656,-4.011719 1.824219,-5.320313 1.230468,-1.285156 2.898437,-1.9375 5.011718,-1.9375 0.84375,0 1.632813,0.113282 2.363282,0.324219 0.726562,0.230469 1.4375,0.558594 2.089843,1"
           id="path125"
           inkscape:connector-curvature="0" />
      </symbol>
      <symbol
         overflow="visible"
         id="glyph2-11"
         style="overflow:visible">
        <path
           style="stroke:none"
           d="m 7.890625,-8.890625 c -0.191406,-0.113281 -0.402344,-0.191406 -0.632813,-0.25 -0.230468,-0.035156 -0.480468,-0.074219 -0.75,-0.074219 -0.976562,0 -1.726562,0.324219 -2.246093,0.957032 C 3.726562,-7.621094 3.476562,-6.71875 3.476562,-5.53125 V 0 H 1.746094 v -10.503906 h 1.730468 v 1.632812 c 0.34375,-0.632812 0.824219,-1.113281 1.398438,-1.421875 0.578125,-0.304687 1.289062,-0.460937 2.132812,-0.460937 0.117188,0 0.25,0.01953 0.402344,0.01953 0.136719,0.01953 0.289063,0.03906 0.480469,0.07813 v 1.765625"
           id="path128"
           inkscape:connector-curvature="0" />
      </symbol>
      <symbol
         overflow="visible"
         id="glyph2-12"
         style="overflow:visible">
        <path
           style="stroke:none"
           d="m 10.789062,-5.683594 v 0.84375 H 2.859375 c 0.078125,1.191406 0.421875,2.113282 1.078125,2.726563 0.632812,0.617187 1.515625,0.921875 2.667969,0.921875 0.652343,0 1.304687,-0.074219 1.917969,-0.230469 0.617187,-0.152344 1.25,-0.402344 1.863281,-0.746094 v 1.628907 C 9.773438,-0.269531 9.140625,-0.0585938 8.488281,0.0585938 7.832031,0.171875 7.160156,0.25 6.507812,0.25 4.820312,0.25 3.496094,-0.230469 2.515625,-1.191406 1.535156,-2.152344 1.054688,-3.476562 1.054688,-5.144531 c 0,-1.710938 0.460937,-3.074219 1.382812,-4.089844 0.921875,-1 2.191406,-1.519531 3.765625,-1.519531 1.417969,0 2.53125,0.460937 3.359375,1.363281 0.804688,0.921875 1.226562,2.152344 1.226562,3.707031 m -1.726562,-0.5 C 9.042969,-7.125 8.773438,-7.871094 8.273438,-8.449219 7.757812,-9.003906 7.066406,-9.292969 6.222656,-9.292969 c -0.960937,0 -1.730468,0.289063 -2.304687,0.824219 -0.578125,0.539062 -0.921875,1.308594 -1,2.285156 H 9.0625"
           id="path131"
           inkscape:connector-curvature="0" />
      </symbol>
      <symbol
         overflow="visible"
         id="glyph2-13"
         style="overflow:visible">
        <path
           style="stroke:none"
           d="m 9.371094,-10.097656 v 1.609375 c -0.5,-0.265625 -0.980469,-0.457031 -1.480469,-0.59375 -0.5,-0.132813 -0.980469,-0.210938 -1.476563,-0.210938 -1.113281,0 -2,0.363281 -2.613281,1.074219 -0.613281,0.710938 -0.921875,1.710938 -0.921875,2.976562 0,1.285157 0.308594,2.285157 0.921875,2.996094 0.613281,0.710938 1.5,1.054688 2.613281,1.054688 0.496094,0 0.976563,-0.054688 1.476563,-0.191406 0.5,-0.132813 0.980469,-0.34375 1.480469,-0.613282 v 1.59375 c -0.5,0.230469 -1,0.402344 -1.5,0.5000002 C 7.355469,0.191406 6.796875,0.25 6.222656,0.25 4.644531,0.25 3.378906,-0.230469 2.457031,-1.230469 1.515625,-2.207031 1.054688,-3.550781 1.054688,-5.242188 c 0,-1.707031 0.460937,-3.050781 1.402343,-4.03125 0.941407,-0.980468 2.226563,-1.480468 3.878907,-1.480468 0.539062,0 1.054687,0.05859 1.554687,0.175781 0.5,0.113281 1,0.269531 1.480469,0.480469"
           id="path134"
           inkscape:connector-curvature="0" />
      </symbol>
      <symbol
         overflow="visible"
         id="glyph2-14"
         style="overflow:visible">
        <path
           style="stroke:none"
           d="M 8.503906,-10.195312 V -8.5625 C 8.007812,-8.792969 7.507812,-8.984375 6.988281,-9.121094 6.453125,-9.234375 5.914062,-9.3125 5.355469,-9.3125 c -0.863281,0 -1.515625,0.136719 -1.9375,0.402344 -0.421875,0.269531 -0.632813,0.652344 -0.632813,1.171875 0,0.402343 0.152344,0.710937 0.460938,0.941406 0.304687,0.230469 0.921875,0.460937 1.84375,0.652344 l 0.59375,0.136719 c 1.226562,0.265624 2.09375,0.652343 2.609375,1.113281 0.5,0.480469 0.769531,1.152343 0.769531,1.996093 0,0.976563 -0.382812,1.746094 -1.152344,2.304688 C 7.140625,-0.0195312 6.066406,0.25 4.722656,0.25 4.148438,0.25 3.570312,0.191406 2.957031,0.0976562 2.34375,0 1.707031,-0.152344 1.035156,-0.382812 v -1.785157 c 0.636719,0.34375 1.269532,0.59375 1.882813,0.746094 0.613281,0.175781 1.230469,0.25 1.84375,0.25 0.804687,0 1.441406,-0.132813 1.882812,-0.402344 0.421875,-0.269531 0.652344,-0.671875 0.652344,-1.191406 0,-0.460937 -0.171875,-0.824219 -0.480469,-1.074219 -0.308594,-0.25 -1,-0.5 -2.074218,-0.730468 L 4.148438,-4.703125 C 3.070312,-4.933594 2.285156,-5.28125 1.824219,-5.742188 1.34375,-6.203125 1.113281,-6.835938 1.113281,-7.660156 c 0,-0.980469 0.347657,-1.746094 1.039063,-2.285156 0.6875,-0.539063 1.6875,-0.808594 2.992187,-0.808594 0.632813,0 1.230469,0.05859 1.804688,0.15625 0.558593,0.09375 1.078125,0.230468 1.554687,0.402344"
           id="path137"
           inkscape:connector-curvature="0" />
      </symbol>
      <symbol
         overflow="visible"
         id="glyph2-15"
         style="overflow:visible">
        <path
           style="stroke:none"
           d="m 0.574219,-10.503906 h 1.824219 l 3.285156,8.8125 3.28125,-8.8125 h 1.824218 L 6.855469,0 h -2.34375 l -3.9375,-10.503906"
           id="path140"
           inkscape:connector-curvature="0" />
      </symbol>
      <symbol
         overflow="visible"
         id="glyph2-16"
         style="overflow:visible">
        <path
           style="stroke:none"
           d="m 10.273438,-13.535156 v 1.84375 c -0.730469,-0.347656 -1.402344,-0.597656 -2.035157,-0.769532 -0.652343,-0.152343 -1.269531,-0.25 -1.84375,-0.25 -1.039062,0 -1.84375,0.210938 -2.402343,0.597657 -0.554688,0.402343 -0.824219,0.976562 -0.824219,1.707031 0,0.613281 0.171875,1.09375 0.558593,1.402344 0.363282,0.324218 1.074219,0.574218 2.109376,0.765625 l 1.152343,0.230469 c 1.402344,0.269531 2.4375,0.75 3.109375,1.421874 0.671875,0.691407 1.019532,1.59375 1.019532,2.726563 0,1.363281 -0.460938,2.382813 -1.363282,3.070313 C 8.832031,-0.0976562 7.507812,0.25 5.761719,0.25 5.089844,0.25 4.378906,0.171875 3.628906,0.0390625 2.878906,-0.0976562 2.113281,-0.308594 1.324219,-0.613281 v -1.960938 c 0.769531,0.441407 1.515625,0.769531 2.246093,0.980469 0.730469,0.230469 1.460938,0.328125 2.191407,0.328125 1.074219,0 1.898437,-0.210937 2.496093,-0.636719 0.574219,-0.421875 0.882813,-1.015625 0.882813,-1.824218 0,-0.6875 -0.210937,-1.226563 -0.636719,-1.609376 C 8.082031,-5.722656 7.390625,-6.007812 6.433594,-6.203125 L 5.28125,-6.433594 C 3.859375,-6.699219 2.839844,-7.140625 2.207031,-7.757812 1.574219,-8.351562 1.265625,-9.175781 1.265625,-10.253906 c 0,-1.226563 0.425781,-2.207032 1.308594,-2.917969 0.863281,-0.710937 2.070312,-1.074219 3.609375,-1.074219 0.652344,0 1.304687,0.05859 1.996094,0.171875 0.671874,0.117188 1.363281,0.308594 2.09375,0.539063"
           id="path143"
           inkscape:connector-curvature="0" />
      </symbol>
      <symbol
         overflow="visible"
         id="glyph2-17"
         style="overflow:visible">
        <path
           style="stroke:none"
           d="m 1.671875,-13.996094 h 1.898437 v 8.503906 c 0,1.5 0.269532,2.59375 0.808594,3.246094 0.535156,0.652344 1.417969,0.980469 2.648438,0.980469 1.210937,0 2.09375,-0.328125 2.628906,-0.980469 0.539062,-0.652344 0.828125,-1.746094 0.828125,-3.246094 v -8.503906 h 1.898437 v 8.734375 c 0,1.84375 -0.460937,3.207031 -1.363281,4.128907 C 10.117188,-0.210938 8.792969,0.25 7.027344,0.25 5.261719,0.25 3.917969,-0.210938 3.015625,-1.132812 2.113281,-2.054688 1.671875,-3.417969 1.671875,-5.261719 v -8.734375"
           id="path146"
           inkscape:connector-curvature="0" />
      </symbol>
    </g>
    <clipPath
       id="clip1">
      <path
         d="M 45.636719,168.94531 H 549.63672 v 504 H 45.636719 Z m 0,0"
         id="path151"
         inkscape:connector-curvature="0" />
    </clipPath>
    <clipPath
       id="clip2">
      <path
         d="m 157,229.42578 h 1 v 388.07813 h -1 z m 0,0"
         id="path154"
         inkscape:connector-curvature="0" />
    </clipPath>
    <clipPath
       id="clip3">
      <path
         d="m 254,229.42578 h 2 v 388.07813 h -2 z m 0,0"
         id="path157"
         inkscape:connector-curvature="0" />
    </clipPath>
    <clipPath
       id="clip4">
      <path
         d="m 352,229.42578 h 2 v 388.07813 h -2 z m 0,0"
         id="path160"
         inkscape:connector-curvature="0" />
    </clipPath>
    <clipPath
       id="clip5">
      <path
         d="m 450,229.42578 h 1 v 388.07813 h -1 z m 0,0"
         id="path163"
         inkscape:connector-curvature="0" />
    </clipPath>
    <clipPath
       id="clip6">
      <path
         d="m 108.63672,599 h 390.60156 v 2 H 108.63672 Z m 0,0"
         id="path166"
         inkscape:connector-curvature="0" />
    </clipPath>
    <clipPath
       id="clip7">
      <path
         d="m 108.63672,525 h 390.60156 v 1 H 108.63672 Z m 0,0"
         id="path169"
         inkscape:connector-curvature="0" />
    </clipPath>
    <clipPath
       id="clip8">
      <path
         d="m 108.63672,450 h 390.60156 v 2 H 108.63672 Z m 0,0"
         id="path172"
         inkscape:connector-curvature="0" />
    </clipPath>
    <clipPath
       id="clip9">
      <path
         d="m 108.63672,376 h 390.60156 v 2 H 108.63672 Z m 0,0"
         id="path175"
         inkscape:connector-curvature="0" />
    </clipPath>
    <clipPath
       id="clip10">
      <path
         d="m 108.63672,302 h 390.60156 v 2 H 108.63672 Z m 0,0"
         id="path178"
         inkscape:connector-curvature="0" />
    </clipPath>
  </defs>
  <g
     id="surface3726"
     transform="translate(-45.636719,-168.94531)">
    <g
       clip-path="url(#clip1)"
       id="g185"
       style="clip-rule:nonzero">
      <path
         style="fill:#ffffff;fill-opacity:1;fill-rule:nonzero;stroke:none"
         d="M 45.636719,672.94531 H 549.63672 v -504 H 45.636719 Z m 0,0"
         id="path183"
         inkscape:connector-curvature="0" />
    </g>
    <path
       style="fill:#ffffff;fill-opacity:1;fill-rule:nonzero;stroke:none"
       d="M 108.63672,617.50391 H 499.23828 V 229.42578 H 108.63672 Z m 0,0"
       id="path187"
       inkscape:connector-curvature="0" />
    <g
       clip-path="url(#clip2)"
       id="g191"
       style="clip-rule:nonzero">
      <path
         style="fill:none;stroke:#cacaca;stroke-width:0.80000001;stroke-linecap:round;stroke-linejoin:round;stroke-miterlimit:10;stroke-opacity:1"
         d="M 111.82314,55.440976 V 443.5191"
         transform="matrix(1,0,0,-1,45.637795,672.94488)"
         id="path189"
         inkscape:connector-curvature="0" />
    </g>
    <g
       style="fill:#232323;fill-opacity:1"
       id="g195">
      <use
         xlink:href="#glyph0-0"
         x="152.36905"
         y="636.66113"
         id="use193"
         width="100%"
         height="100%" />
    </g>
    <g
       clip-path="url(#clip3)"
       id="g199"
       style="clip-rule:nonzero">
      <path
         style="fill:none;stroke:#cacaca;stroke-width:0.80000001;stroke-linecap:round;stroke-linejoin:round;stroke-miterlimit:10;stroke-opacity:1"
         d="M 209.47549,55.440976 V 443.5191"
         transform="matrix(1,0,0,-1,45.637795,672.94488)"
         id="path197"
         inkscape:connector-curvature="0" />
    </g>
    <g
       style="fill:#232323;fill-opacity:1"
       id="g203">
      <use
         xlink:href="#glyph0-1"
         x="250.01904"
         y="636.66113"
         id="use201"
         width="100%"
         height="100%" />
    </g>
    <g
       clip-path="url(#clip4)"
       id="g207"
       style="clip-rule:nonzero">
      <path
         style="fill:none;stroke:#cacaca;stroke-width:0.80000001;stroke-linecap:round;stroke-linejoin:round;stroke-miterlimit:10;stroke-opacity:1"
         d="M 307.12392,55.440976 V 443.5191"
         transform="matrix(1,0,0,-1,45.637795,672.94488)"
         id="path205"
         inkscape:connector-curvature="0" />
    </g>
    <g
       style="fill:#232323;fill-opacity:1"
       id="g211">
      <use
         xlink:href="#glyph0-2"
         x="347.66904"
         y="636.66113"
         id="use209"
         width="100%"
         height="100%" />
    </g>
    <g
       clip-path="url(#clip5)"
       id="g215"
       style="clip-rule:nonzero">
      <path
         style="fill:none;stroke:#cacaca;stroke-width:0.80000001;stroke-linecap:round;stroke-linejoin:round;stroke-miterlimit:10;stroke-opacity:1"
         d="M 404.77627,55.440976 V 443.5191"
         transform="matrix(1,0,0,-1,45.637795,672.94488)"
         id="path213"
         inkscape:connector-curvature="0" />
    </g>
    <g
       style="fill:#232323;fill-opacity:1"
       id="g219">
      <use
         xlink:href="#glyph0-3"
         x="445.31903"
         y="636.66113"
         id="use217"
         width="100%"
         height="100%" />
    </g>
    <g
       style="fill:#232323;fill-opacity:1"
       id="g265">
      <use
         xlink:href="#glyph0-4"
         x="211.4456"
         y="656.14551"
         id="use221"
         width="100%"
         height="100%" />
      <use
         xlink:href="#glyph0-5"
         x="224.85361"
         y="656.14551"
         id="use223"
         width="100%"
         height="100%" />
      <use
         xlink:href="#glyph0-6"
         x="229.9416"
         y="656.14551"
         id="use225"
         width="100%"
         height="100%" />
      <use
         xlink:href="#glyph0-7"
         x="240.0536"
         y="656.14551"
         id="use227"
         width="100%"
         height="100%" />
      <use
         xlink:href="#glyph0-8"
         x="249.5256"
         y="656.14551"
         id="use229"
         width="100%"
         height="100%" />
      <use
         xlink:href="#glyph0-9"
         x="259.68561"
         y="656.14551"
         id="use231"
         width="100%"
         height="100%" />
      <use
         xlink:href="#glyph0-10"
         x="264.13361"
         y="656.14551"
         id="use233"
         width="100%"
         height="100%" />
      <use
         xlink:href="#glyph0-11"
         x="273.94162"
         y="656.14551"
         id="use235"
         width="100%"
         height="100%" />
      <use
         xlink:href="#glyph0-10"
         x="284.0856"
         y="656.14551"
         id="use237"
         width="100%"
         height="100%" />
      <use
         xlink:href="#glyph0-12"
         x="293.89362"
         y="656.14551"
         id="use239"
         width="100%"
         height="100%" />
      <use
         xlink:href="#glyph0-13"
         x="300.16562"
         y="656.14551"
         id="use241"
         width="100%"
         height="100%" />
      <use
         xlink:href="#glyph0-14"
         x="304.61362"
         y="656.14551"
         id="use243"
         width="100%"
         height="100%" />
      <use
         xlink:href="#glyph0-11"
         x="314.40561"
         y="656.14551"
         id="use245"
         width="100%"
         height="100%" />
      <use
         xlink:href="#glyph0-15"
         x="324.54962"
         y="656.14551"
         id="use247"
         width="100%"
         height="100%" />
      <use
         xlink:href="#glyph0-5"
         x="332.88562"
         y="656.14551"
         id="use249"
         width="100%"
         height="100%" />
      <use
         xlink:href="#glyph0-16"
         x="337.9736"
         y="656.14551"
         id="use251"
         width="100%"
         height="100%" />
      <use
         xlink:href="#glyph0-14"
         x="349.1416"
         y="656.14551"
         id="use253"
         width="100%"
         height="100%" />
      <use
         xlink:href="#glyph0-17"
         x="358.93359"
         y="656.14551"
         id="use255"
         width="100%"
         height="100%" />
      <use
         xlink:href="#glyph0-17"
         x="365.50961"
         y="656.14551"
         id="use257"
         width="100%"
         height="100%" />
      <use
         xlink:href="#glyph0-18"
         x="372.0856"
         y="656.14551"
         id="use259"
         width="100%"
         height="100%" />
      <use
         xlink:href="#glyph0-19"
         x="381.9256"
         y="656.14551"
         id="use261"
         width="100%"
         height="100%" />
      <use
         xlink:href="#glyph0-12"
         x="390.72562"
         y="656.14551"
         id="use263"
         width="100%"
         height="100%" />
    </g>
    <g
       clip-path="url(#clip6)"
       id="g269"
       style="clip-rule:nonzero">
      <path
         style="fill:none;stroke:#cacaca;stroke-width:0.80000001;stroke-linecap:round;stroke-linejoin:round;stroke-miterlimit:10;stroke-opacity:1"
         d="M 62.998923,73.081601 H 453.60049"
         transform="matrix(1,0,0,-1,45.637795,672.94488)"
         id="path267"
         inkscape:connector-curvature="0" />
    </g>
    <g
       style="fill:#232323;fill-opacity:1"
       id="g273">
      <use
         xlink:href="#glyph0-0"
         x="91.450294"
         y="605.94299"
         id="use271"
         width="100%"
         height="100%" />
    </g>
    <g
       clip-path="url(#clip7)"
       id="g277"
       style="clip-rule:nonzero">
      <path
         style="fill:none;stroke:#cacaca;stroke-width:0.80000001;stroke-linecap:round;stroke-linejoin:round;stroke-miterlimit:10;stroke-opacity:1"
         d="M 62.998923,147.35504 H 453.60049"
         transform="matrix(1,0,0,-1,45.637795,672.94488)"
         id="path275"
         inkscape:connector-curvature="0" />
    </g>
    <g
       style="fill:#232323;fill-opacity:1"
       id="g283">
      <use
         xlink:href="#glyph0-2"
         x="81.262794"
         y="531.66931"
         id="use279"
         width="100%"
         height="100%" />
      <use
         xlink:href="#glyph0-0"
         x="91.438797"
         y="531.66931"
         id="use281"
         width="100%"
         height="100%" />
    </g>
    <g
       clip-path="url(#clip8)"
       id="g287"
       style="clip-rule:nonzero">
      <path
         style="fill:none;stroke:#cacaca;stroke-width:0.80000001;stroke-linecap:round;stroke-linejoin:round;stroke-miterlimit:10;stroke-opacity:1"
         d="M 62.998923,221.62848 H 453.60049"
         transform="matrix(1,0,0,-1,45.637795,672.94488)"
         id="path285"
         inkscape:connector-curvature="0" />
    </g>
    <g
       style="fill:#232323;fill-opacity:1"
       id="g293">
      <use
         xlink:href="#glyph0-20"
         x="81.262794"
         y="457.39563"
         id="use289"
         width="100%"
         height="100%" />
      <use
         xlink:href="#glyph0-0"
         x="91.438797"
         y="457.39563"
         id="use291"
         width="100%"
         height="100%" />
    </g>
    <g
       clip-path="url(#clip9)"
       id="g297"
       style="clip-rule:nonzero">
      <path
         style="fill:none;stroke:#cacaca;stroke-width:0.80000001;stroke-linecap:round;stroke-linejoin:round;stroke-miterlimit:10;stroke-opacity:1"
         d="M 62.998923,295.90191 H 453.60049"
         transform="matrix(1,0,0,-1,45.637795,672.94488)"
         id="path295"
         inkscape:connector-curvature="0" />
    </g>
    <g
       style="fill:#232323;fill-opacity:1"
       id="g303">
      <use
         xlink:href="#glyph0-21"
         x="81.262794"
         y="383.12195"
         id="use299"
         width="100%"
         height="100%" />
      <use
         xlink:href="#glyph0-0"
         x="91.438797"
         y="383.12195"
         id="use301"
         width="100%"
         height="100%" />
    </g>
    <g
       clip-path="url(#clip10)"
       id="g307"
       style="clip-rule:nonzero">
      <path
         style="fill:none;stroke:#cacaca;stroke-width:0.80000001;stroke-linecap:round;stroke-linejoin:round;stroke-miterlimit:10;stroke-opacity:1"
         d="M 62.998923,370.17535 H 453.60049"
         transform="matrix(1,0,0,-1,45.637795,672.94488)"
         id="path305"
         inkscape:connector-curvature="0" />
    </g>
    <g
       style="fill:#232323;fill-opacity:1"
       id="g313">
      <use
         xlink:href="#glyph0-22"
         x="81.262794"
         y="308.84827"
         id="use309"
         width="100%"
         height="100%" />
      <use
         xlink:href="#glyph0-0"
         x="91.438797"
         y="308.84827"
         id="use311"
         width="100%"
         height="100%" />
    </g>
    <g
       style="fill:#232323;fill-opacity:1"
       id="g333">
      <use
         xlink:href="#glyph1-0"
         x="73.934669"
         y="463.51956"
         id="use315"
         width="100%"
         height="100%" />
      <use
         xlink:href="#glyph1-1"
         x="73.934669"
         y="453.35956"
         id="use317"
         width="100%"
         height="100%" />
      <use
         xlink:href="#glyph1-0"
         x="73.934669"
         y="441.64758"
         id="use319"
         width="100%"
         height="100%" />
      <use
         xlink:href="#glyph1-2"
         x="73.934669"
         y="431.48758"
         id="use321"
         width="100%"
         height="100%" />
      <use
         xlink:href="#glyph1-3"
         x="73.934669"
         y="426.39957"
         id="use323"
         width="100%"
         height="100%" />
      <use
         xlink:href="#glyph1-4"
         x="73.934669"
         y="418.06357"
         id="use325"
         width="100%"
         height="100%" />
      <use
         xlink:href="#glyph1-5"
         x="73.934669"
         y="409.26358"
         id="use327"
         width="100%"
         height="100%" />
      <use
         xlink:href="#glyph1-6"
         x="73.934669"
         y="399.47156"
         id="use329"
         width="100%"
         height="100%" />
      <use
         xlink:href="#glyph1-7"
         x="73.934669"
         y="392.89557"
         id="use331"
         width="100%"
         height="100%" />
    </g>
    <path
       style="fill:none;stroke:#000000;stroke-width:1;stroke-linecap:round;stroke-linejoin:round;stroke-miterlimit:10;stroke-opacity:1"
       d="M 111.82314,251.80035 V 193.77301"
       transform="matrix(1,0,0,-1,45.637795,672.94488)"
       id="path335"
       inkscape:connector-curvature="0" />
    <path
       style="fill:none;stroke:#000000;stroke-width:1;stroke-linecap:round;stroke-linejoin:round;stroke-miterlimit:10;stroke-opacity:1"
       d="m 111.82314,314.46832 v 83.55859"
       transform="matrix(1,0,0,-1,45.637795,672.94488)"
       id="path337"
       inkscape:connector-curvature="0" />
    <path
       style="fill:none;stroke:#000000;stroke-width:1;stroke-linecap:round;stroke-linejoin:round;stroke-miterlimit:10;stroke-opacity:1"
       d="m 100.83877,193.77301 h 21.97265"
       transform="matrix(1,0,0,-1,45.637795,672.94488)"
       id="path339"
       inkscape:connector-curvature="0" />
    <path
       style="fill:none;stroke:#000000;stroke-width:1;stroke-linecap:round;stroke-linejoin:round;stroke-miterlimit:10;stroke-opacity:1"
       d="m 100.83877,398.02691 h 21.97265"
       transform="matrix(1,0,0,-1,45.637795,672.94488)"
       id="path341"
       inkscape:connector-curvature="0" />
    <path
       style="fill:none;stroke:#000000;stroke-width:1;stroke-linecap:round;stroke-linejoin:round;stroke-miterlimit:10;stroke-opacity:1"
       d="M 209.47549,258.76519 V 175.2066"
       transform="matrix(1,0,0,-1,45.637795,672.94488)"
       id="path343"
       inkscape:connector-curvature="0" />
    <path
       style="fill:none;stroke:#000000;stroke-width:1;stroke-linecap:round;stroke-linejoin:round;stroke-miterlimit:10;stroke-opacity:1"
       d="m 209.47549,328.3941 v 97.48438"
       transform="matrix(1,0,0,-1,45.637795,672.94488)"
       id="path345"
       inkscape:connector-curvature="0" />
    <path
       style="fill:none;stroke:#000000;stroke-width:1;stroke-linecap:round;stroke-linejoin:round;stroke-miterlimit:10;stroke-opacity:1"
       d="m 198.49111,175.2066 h 21.96875"
       transform="matrix(1,0,0,-1,45.637795,672.94488)"
       id="path347"
       inkscape:connector-curvature="0" />
    <path
       style="fill:none;stroke:#000000;stroke-width:1;stroke-linecap:round;stroke-linejoin:round;stroke-miterlimit:10;stroke-opacity:1"
       d="m 198.49111,425.87848 h 21.96875"
       transform="matrix(1,0,0,-1,45.637795,672.94488)"
       id="path349"
       inkscape:connector-curvature="0" />
    <path
       style="fill:none;stroke:#000000;stroke-width:1;stroke-linecap:butt;stroke-linejoin:round;stroke-miterlimit:10;stroke-opacity:1"
       d="m 209.47549,70.081601 c 0.79687,0 1.55859,0.316406 2.12109,0.878906 0.5625,0.5625 0.87891,1.324219 0.87891,2.121094 0,0.792968 -0.31641,1.558593 -0.87891,2.121093 -0.5625,0.5625 -1.32422,0.878907 -2.12109,0.878907 -0.79688,0 -1.5586,-0.316407 -2.1211,-0.878907 -0.5625,-0.5625 -0.8789,-1.328125 -0.8789,-2.121093 0,-0.796875 0.3164,-1.558594 0.8789,-2.121094 0.5625,-0.5625 1.32422,-0.878906 2.1211,-0.878906 z m 0,0"
       transform="matrix(1,0,0,-1,45.637795,672.94488)"
       id="path351"
       inkscape:connector-curvature="0" />
    <path
       style="fill:none;stroke:#000000;stroke-width:1;stroke-linecap:round;stroke-linejoin:round;stroke-miterlimit:10;stroke-opacity:1"
       d="M 307.12392,293.5816 V 230.90973"
       transform="matrix(1,0,0,-1,45.637795,672.94488)"
       id="path353"
       inkscape:connector-curvature="0" />
    <path
       style="fill:none;stroke:#000000;stroke-width:1;stroke-linecap:round;stroke-linejoin:round;stroke-miterlimit:10;stroke-opacity:1"
       d="m 307.12392,353.92926 v 62.66797"
       transform="matrix(1,0,0,-1,45.637795,672.94488)"
       id="path355"
       inkscape:connector-curvature="0" />
    <path
       style="fill:none;stroke:#000000;stroke-width:1;stroke-linecap:round;stroke-linejoin:round;stroke-miterlimit:10;stroke-opacity:1"
       d="m 296.13955,230.90973 h 21.97266"
       transform="matrix(1,0,0,-1,45.637795,672.94488)"
       id="path357"
       inkscape:connector-curvature="0" />
    <path
       style="fill:none;stroke:#000000;stroke-width:1;stroke-linecap:round;stroke-linejoin:round;stroke-miterlimit:10;stroke-opacity:1"
       d="m 296.13955,416.59723 h 21.97266"
       transform="matrix(1,0,0,-1,45.637795,672.94488)"
       id="path359"
       inkscape:connector-curvature="0" />
    <path
       style="fill:none;stroke:#000000;stroke-width:1;stroke-linecap:butt;stroke-linejoin:round;stroke-miterlimit:10;stroke-opacity:1"
       d="m 307.12392,190.77301 c 0.79688,0 1.5586,0.3164 2.1211,0.8789 0.5625,0.5625 0.8789,1.32813 0.8789,2.1211 0,0.79687 -0.3164,1.55859 -0.8789,2.125 -0.5625,0.5625 -1.32422,0.875 -2.1211,0.875 -0.79296,0 -1.55859,-0.3125 -2.12109,-0.875 -0.5625,-0.56641 -0.87891,-1.32813 -0.87891,-2.125 0,-0.79297 0.31641,-1.5586 0.87891,-2.1211 0.5625,-0.5625 1.32813,-0.8789 2.12109,-0.8789 z m 0,0"
       transform="matrix(1,0,0,-1,45.637795,672.94488)"
       id="path361"
       inkscape:connector-curvature="0" />
    <path
       style="fill:none;stroke:#000000;stroke-width:1;stroke-linecap:round;stroke-linejoin:round;stroke-miterlimit:10;stroke-opacity:1"
       d="M 404.77627,321.43316 V 305.18707"
       transform="matrix(1,0,0,-1,45.637795,672.94488)"
       id="path363"
       inkscape:connector-curvature="0" />
    <path
       style="fill:none;stroke:#000000;stroke-width:1;stroke-linecap:round;stroke-linejoin:round;stroke-miterlimit:10;stroke-opacity:1"
       d="m 404.77627,370.17535 v 55.70313"
       transform="matrix(1,0,0,-1,45.637795,672.94488)"
       id="path365"
       inkscape:connector-curvature="0" />
    <path
       style="fill:none;stroke:#000000;stroke-width:1;stroke-linecap:round;stroke-linejoin:round;stroke-miterlimit:10;stroke-opacity:1"
       d="m 393.78799,305.18707 h 21.97265"
       transform="matrix(1,0,0,-1,45.637795,672.94488)"
       id="path367"
       inkscape:connector-curvature="0" />
    <path
       style="fill:none;stroke:#000000;stroke-width:1;stroke-linecap:round;stroke-linejoin:round;stroke-miterlimit:10;stroke-opacity:1"
       d="m 393.78799,425.87848 h 21.97265"
       transform="matrix(1,0,0,-1,45.637795,672.94488)"
       id="path369"
       inkscape:connector-curvature="0" />
    <path
       style="fill:none;stroke:#000000;stroke-width:1;stroke-linecap:butt;stroke-linejoin:round;stroke-miterlimit:10;stroke-opacity:1"
       d="m 0.00126722,-3.00173 c 0.79296878,0 1.55859378,0.316406 2.12109378,0.878906 0.5625,0.5625 0.878906,1.328125 0.878906,2.12109405 0,0.79687495 -0.316406,1.55859395 -0.878906,2.12499995 -0.5625,0.5625 -1.328125,0.875 -2.12109378,0.875 -0.79687522,0 -1.55859422,-0.3125 -2.12109422,-0.875 -0.5625,-0.566406 -0.878906,-1.328125 -0.878906,-2.12499995 0,-0.79296905 0.316406,-1.55859405 0.878906,-2.12109405 0.5625,-0.5625 1.324219,-0.878906 2.12109422,-0.878906 z m 0,0"
       transform="matrix(1,0,0,-1,450.4128,479.17014)"
       id="path371"
       inkscape:connector-curvature="0" />
    <path
       style="fill:none;stroke:#000000;stroke-width:1;stroke-linecap:butt;stroke-linejoin:round;stroke-miterlimit:10;stroke-opacity:1"
       d="m 0.00126722,-2.998893 c 0.79296878,0 1.55859378,0.316406 2.12109378,0.878906 0.5625,0.5625 0.878906,1.324219 0.878906,2.12109422 0,0.79296878 -0.316406,1.55859378 -0.878906,2.12109378 -0.5625,0.5625 -1.328125,0.878906 -2.12109378,0.878906 -0.79687522,0 -1.55859422,-0.316406 -2.12109422,-0.878906 -0.5625,-0.5625 -0.878906,-1.328125 -0.878906,-2.12109378 0,-0.79687522 0.316406,-1.55859422 0.878906,-2.12109422 0.5625,-0.5625 1.324219,-0.878906 2.12109422,-0.878906 z m 0,0"
       transform="matrix(1,0,0,-1,450.4128,451.31751)"
       id="path373"
       inkscape:connector-curvature="0" />
    <path
       style="fill:none;stroke:#000000;stroke-width:1;stroke-linecap:butt;stroke-linejoin:round;stroke-miterlimit:10;stroke-opacity:1"
       d="m 0.00126722,-3.000908 c 0.79296878,0 1.55859378,0.316407 2.12109378,0.878907 0.5625,0.5625 0.878906,1.328125 0.878906,2.121093416 0,0.796874584 -0.316406,1.558593584 -0.878906,2.121093584 -0.5625,0.5625 -1.328125,0.878906 -2.12109378,0.878906 -0.79687522,0 -1.55859422,-0.316406 -2.12109422,-0.878906 -0.5625,-0.5625 -0.878906,-1.324219 -0.878906,-2.121093584 0,-0.792968416 0.316406,-1.558593416 0.878906,-2.121093416 0.5625,-0.5625 1.324219,-0.878907 2.12109422,-0.878907 z m 0,0"
       transform="matrix(1,0,0,-1,450.4128,432.74909)"
       id="path375"
       inkscape:connector-curvature="0" />
    <path
       style="fill:#cfd9f0;fill-opacity:1;fill-rule:nonzero;stroke:#000000;stroke-width:1;stroke-linecap:butt;stroke-linejoin:miter;stroke-miterlimit:10;stroke-opacity:1"
       d="M 89.854392,251.80035 H 133.7958 v 62.66797 H 89.854392 Z m 0,0"
       transform="matrix(1,0,0,-1,45.637795,672.94488)"
       id="path377"
       inkscape:connector-curvature="0" />
    <path
       style="fill:#8cc2bf;fill-opacity:1;fill-rule:nonzero;stroke:#000000;stroke-width:1;stroke-linecap:butt;stroke-linejoin:miter;stroke-miterlimit:10;stroke-opacity:1"
       d="m 187.50283,258.76519 h 43.94531 v 69.62891 h -43.94531 z m 0,0"
       transform="matrix(1,0,0,-1,45.637795,672.94488)"
       id="path379"
       inkscape:connector-curvature="0" />
    <path
       style="fill:#68a16e;fill-opacity:1;fill-rule:nonzero;stroke:#000000;stroke-width:1;stroke-linecap:butt;stroke-linejoin:miter;stroke-miterlimit:10;stroke-opacity:1"
       d="m 285.15517,293.5816 h 43.94141 v 60.34766 h -43.94141 z m 0,0"
       transform="matrix(1,0,0,-1,45.637795,672.94488)"
       id="path381"
       inkscape:connector-curvature="0" />
    <path
       style="fill:#686b35;fill-opacity:1;fill-rule:nonzero;stroke:#000000;stroke-width:1;stroke-linecap:butt;stroke-linejoin:miter;stroke-miterlimit:10;stroke-opacity:1"
       d="m 382.80361,321.43316 h 43.94141 v 48.74219 h -43.94141 z m 0,0"
       transform="matrix(1,0,0,-1,45.637795,672.94488)"
       id="path383"
       inkscape:connector-curvature="0" />
    <path
       style="fill:none;stroke:#ff7d0c;stroke-width:1;stroke-linecap:round;stroke-linejoin:round;stroke-miterlimit:10;stroke-opacity:1"
       d="M 89.854392,277.3316 H 133.7958"
       transform="matrix(1,0,0,-1,45.637795,672.94488)"
       id="path385"
       inkscape:connector-curvature="0" />
    <path
       style="fill:none;stroke:#ff7d0c;stroke-width:1;stroke-linecap:round;stroke-linejoin:round;stroke-miterlimit:10;stroke-opacity:1"
       d="m 187.50283,295.90191 h 43.94531"
       transform="matrix(1,0,0,-1,45.637795,672.94488)"
       id="path387"
       inkscape:connector-curvature="0" />
    <path
       style="fill:none;stroke:#ff7d0c;stroke-width:1;stroke-linecap:round;stroke-linejoin:round;stroke-miterlimit:10;stroke-opacity:1"
       d="m 285.15517,323.75348 h 43.94141"
       transform="matrix(1,0,0,-1,45.637795,672.94488)"
       id="path389"
       inkscape:connector-curvature="0" />
    <path
       style="fill:none;stroke:#ff7d0c;stroke-width:1;stroke-linecap:round;stroke-linejoin:round;stroke-miterlimit:10;stroke-opacity:1"
       d="m 382.80361,356.24957 h 43.94141"
       transform="matrix(1,0,0,-1,45.637795,672.94488)"
       id="path391"
       inkscape:connector-curvature="0" />
    <path
       style="fill:none;stroke:#cacaca;stroke-width:0.80000001;stroke-linecap:square;stroke-linejoin:miter;stroke-miterlimit:10;stroke-opacity:1"
       d="M 62.998923,55.440976 V 443.5191"
       transform="matrix(1,0,0,-1,45.637795,672.94488)"
       id="path393"
       inkscape:connector-curvature="0" />
    <path
       style="fill:none;stroke:#cacaca;stroke-width:0.80000001;stroke-linecap:square;stroke-linejoin:miter;stroke-miterlimit:10;stroke-opacity:1"
       d="M 453.60049,55.440976 V 443.5191"
       transform="matrix(1,0,0,-1,45.637795,672.94488)"
       id="path395"
       inkscape:connector-curvature="0" />
    <path
       style="fill:none;stroke:#cacaca;stroke-width:0.80000001;stroke-linecap:square;stroke-linejoin:miter;stroke-miterlimit:10;stroke-opacity:1"
       d="M 62.998923,55.440976 H 453.60049"
       transform="matrix(1,0,0,-1,45.637795,672.94488)"
       id="path397"
       inkscape:connector-curvature="0" />
    <path
       style="fill:none;stroke:#cacaca;stroke-width:0.80000001;stroke-linecap:square;stroke-linejoin:miter;stroke-miterlimit:10;stroke-opacity:1"
       d="M 62.998923,443.5191 H 453.60049"
       transform="matrix(1,0,0,-1,45.637795,672.94488)"
       id="path399"
       inkscape:connector-curvature="0" />
    <g
       style="fill:#232323;fill-opacity:1"
       id="g461">
      <use
         xlink:href="#glyph2-0"
         x="150.68779"
         y="223.42488"
         id="use401"
         width="100%"
         height="100%" />
      <use
         xlink:href="#glyph2-1"
         x="162.82219"
         y="223.42488"
         id="use403"
         width="100%"
         height="100%" />
      <use
         xlink:href="#glyph2-2"
         x="174.1886"
         y="223.42488"
         id="use405"
         width="100%"
         height="100%" />
      <use
         xlink:href="#glyph2-3"
         x="186.3806"
         y="223.42488"
         id="use407"
         width="100%"
         height="100%" />
      <use
         xlink:href="#glyph2-4"
         x="191.7182"
         y="223.42488"
         id="use409"
         width="100%"
         height="100%" />
      <use
         xlink:href="#glyph2-5"
         x="203.48779"
         y="223.42488"
         id="use411"
         width="100%"
         height="100%" />
      <use
         xlink:href="#glyph2-4"
         x="215.6606"
         y="223.42488"
         id="use413"
         width="100%"
         height="100%" />
      <use
         xlink:href="#glyph2-6"
         x="227.43019"
         y="223.42488"
         id="use415"
         width="100%"
         height="100%" />
      <use
         xlink:href="#glyph2-7"
         x="234.95659"
         y="223.42488"
         id="use417"
         width="100%"
         height="100%" />
      <use
         xlink:href="#glyph2-8"
         x="240.29419"
         y="223.42488"
         id="use419"
         width="100%"
         height="100%" />
      <use
         xlink:href="#glyph2-5"
         x="252.0446"
         y="223.42488"
         id="use421"
         width="100%"
         height="100%" />
      <use
         xlink:href="#glyph2-9"
         x="264.21741"
         y="223.42488"
         id="use423"
         width="100%"
         height="100%" />
      <use
         xlink:href="#glyph2-10"
         x="270.323"
         y="223.42488"
         id="use425"
         width="100%"
         height="100%" />
      <use
         xlink:href="#glyph2-8"
         x="283.72461"
         y="223.42488"
         id="use427"
         width="100%"
         height="100%" />
      <use
         xlink:href="#glyph2-11"
         x="295.47501"
         y="223.42488"
         id="use429"
         width="100%"
         height="100%" />
      <use
         xlink:href="#glyph2-11"
         x="303.36618"
         y="223.42488"
         id="use431"
         width="100%"
         height="100%" />
      <use
         xlink:href="#glyph2-12"
         x="311.25739"
         y="223.42488"
         id="use433"
         width="100%"
         height="100%" />
      <use
         xlink:href="#glyph2-13"
         x="323.0654"
         y="223.42488"
         id="use435"
         width="100%"
         height="100%" />
      <use
         xlink:href="#glyph2-6"
         x="333.6254"
         y="223.42488"
         id="use437"
         width="100%"
         height="100%" />
      <use
         xlink:href="#glyph2-5"
         x="341.15179"
         y="223.42488"
         id="use439"
         width="100%"
         height="100%" />
      <use
         xlink:href="#glyph2-12"
         x="353.32458"
         y="223.42488"
         id="use441"
         width="100%"
         height="100%" />
      <use
         xlink:href="#glyph2-14"
         x="365.1326"
         y="223.42488"
         id="use443"
         width="100%"
         height="100%" />
      <use
         xlink:href="#glyph2-14"
         x="375.1358"
         y="223.42488"
         id="use445"
         width="100%"
         height="100%" />
      <use
         xlink:href="#glyph2-9"
         x="385.13901"
         y="223.42488"
         id="use447"
         width="100%"
         height="100%" />
      <use
         xlink:href="#glyph2-15"
         x="391.2446"
         y="223.42488"
         id="use449"
         width="100%"
         height="100%" />
      <use
         xlink:href="#glyph2-14"
         x="402.61099"
         y="223.42488"
         id="use451"
         width="100%"
         height="100%" />
      <use
         xlink:href="#glyph2-9"
         x="412.6142"
         y="223.42488"
         id="use453"
         width="100%"
         height="100%" />
      <use
         xlink:href="#glyph2-16"
         x="418.71979"
         y="223.42488"
         id="use455"
         width="100%"
         height="100%" />
      <use
         xlink:href="#glyph2-17"
         x="430.9118"
         y="223.42488"
         id="use457"
         width="100%"
         height="100%" />
      <use
         xlink:href="#glyph2-16"
         x="444.96619"
         y="223.42488"
         id="use459"
         width="100%"
         height="100%" />
    </g>
  </g>
</svg>
