<?xml version="1.0" encoding="UTF-8" standalone="no"?>
<!-- Created with Inkscape (http://www.inkscape.org/) -->

<svg
   xmlns:dc="http://purl.org/dc/elements/1.1/"
   xmlns:cc="http://creativecommons.org/ns#"
   xmlns:rdf="http://www.w3.org/1999/02/22-rdf-syntax-ns#"
   xmlns:svg="http://www.w3.org/2000/svg"
   xmlns="http://www.w3.org/2000/svg"
   xmlns:sodipodi="http://sodipodi.sourceforge.net/DTD/sodipodi-0.dtd"
   xmlns:inkscape="http://www.inkscape.org/namespaces/inkscape"
   width="297mm"
   height="210mm"
   viewBox="0 0 297 210"
   version="1.1"
   id="svg8"
   inkscape:version="0.92.3 (2405546, 2018-03-11)"
   sodipodi:docname="conclusion2.svg">
  <defs
     id="defs2" />
  <sodipodi:namedview
     id="base"
     pagecolor="#ffffff"
     bordercolor="#666666"
     borderopacity="1.0"
     inkscape:pageopacity="0.0"
     inkscape:pageshadow="2"
     inkscape:zoom="0.49497475"
     inkscape:cx="265.18983"
     inkscape:cy="505.4514"
     inkscape:document-units="mm"
     inkscape:current-layer="layer1"
     showgrid="false"
     inkscape:window-width="1853"
     inkscape:window-height="1025"
     inkscape:window-x="1987"
     inkscape:window-y="27"
     inkscape:window-maximized="1" />
  <metadata
     id="metadata5">
    <rdf:RDF>
      <cc:Work
         rdf:about="">
        <dc:format>image/svg+xml</dc:format>
        <dc:type
           rdf:resource="http://purl.org/dc/dcmitype/StillImage" />
        <dc:title></dc:title>
      </cc:Work>
    </rdf:RDF>
  </metadata>
  <g
     inkscape:label="Layer 1"
     inkscape:groupmode="layer"
     id="layer1"
     transform="translate(0,-87)">
    <flowRoot
       xml:space="preserve"
       id="flowRoot1041"
       style="font-style:normal;font-variant:normal;font-weight:bold;font-stretch:normal;font-size:17.33333397px;line-height:1.25;font-family:sans-serif;-inkscape-font-specification:'sans-serif Bold';letter-spacing:0px;word-spacing:0px;fill:#000000;fill-opacity:1;stroke:none"
       transform="matrix(0.26458333,0,0,0.26458333,0,87)"><flowRegion
         id="flowRegion1043"><rect
           id="rect1045"
           width="120"
           height="100"
           x="705.71429"
           y="22.272234" /></flowRegion><flowPara
         id="flowPara1047"></flowPara></flowRoot>    <g
       transform="translate(2.1691033,0.79276387)"
       id="layer1-9"
       inkscape:label="Layer 1">
      <path
         inkscape:connector-curvature="0"
         id="path1007"
         d="m 126.77255,276.33529 c -1.41237,-0.68388 -1.47797,-1.38921 -1.47797,-15.89011 0,-15.05893 -0.15737,-16.78316 -1.9376,-21.23009 -0.992,-2.47799 -3.48317,-6.36438 -5.39538,-8.41717 -0.71666,-0.76935 -2.82702,-2.70561 -4.68969,-4.30282 -9.80937,-8.41139 -16.260735,-19.91065 -18.461265,-32.90637 -0.97385,-5.75125 -0.83582,-15.00022 0.30272,-20.28428 4.87885,-22.64332 21.661175,-39.24427 44.405215,-43.92532 5.53293,-1.13876 15.30464,-1.15351 20.91449,-0.0316 11.11305,2.22254 20.94584,7.39535 28.73685,15.11781 7.35514,7.29042 11.96361,15.05448 14.83219,24.98838 1.49276,5.16939 1.99544,9.83721 1.79677,16.68433 -0.26815,9.24151 -1.75366,15.19363 -5.83213,23.36799 -2.77319,5.55824 -6.53718,10.65081 -11.06296,14.96786 -8.01637,7.64665 -9.17886,8.94785 -10.83864,12.13199 -3.08461,5.91753 -3.10559,6.06512 -3.22578,22.68415 -0.0579,8.00947 -0.18204,14.90135 -0.27582,15.31529 -0.0938,0.41395 -0.5022,1.06165 -0.9076,1.43933 -0.72578,0.67617 -1.08577,0.68636 -23.44857,0.66379 -14.9032,-0.015 -22.96016,-0.14334 -23.43483,-0.37318 z m 42.21002,-13.65856 v -8.29734 h -18.96533 -18.96533 v 8.29734 8.29733 h 18.96533 18.96533 z m 0.466,-16.41054 c 0.69045,-8.27908 5.20875,-16.74072 11.99114,-22.45641 9.88912,-8.3338 15.99328,-18.56291 18.23632,-30.55971 0.85756,-4.58657 0.85844,-13.62307 0.002,-17.93705 -4.09445,-20.61855 -19.26046,-35.98936 -39.83915,-40.37716 -2.24667,-0.47903 -4.40292,-0.61379 -9.82134,-0.61379 -6.03428,0 -7.40793,0.10349 -10.49866,0.79096 -10.08206,2.24254 -18.58777,7.06108 -25.94159,14.69608 -6.86963,7.13228 -11.26727,15.71785 -13.23063,25.83029 -0.887585,4.57159 -0.805965,13.7741 0.16241,18.30989 1.50396,7.04446 4.12775,13.29628 7.91028,18.84821 2.15271,3.1597 6.83806,8.13212 11.33916,12.03393 5.95943,5.16595 10.24449,13.58545 10.83694,21.29291 l 0.21802,2.83639 h 19.20534 19.20535 z M 69.473615,193.3129 c -1.00971,-1.07478 -0.96815,-2.74052 0.0949,-3.80356 0.82667,-0.82668 0.86842,-0.83127 7.54464,-0.83127 7.25122,0 7.90381,0.14355 8.56559,1.88417 0.38068,1.00126 -0.18466,2.74653 -1.03753,3.20297 -0.34597,0.18516 -3.66834,0.33152 -7.52535,0.33152 -6.78076,0 -6.91923,-0.0142 -7.64226,-0.78383 z m 144.967835,0.55717 c -0.72916,-0.29338 -1.46246,-2.0749 -1.23201,-2.99311 0.11802,-0.47021 0.59901,-1.15733 1.06886,-1.52692 0.78704,-0.61908 1.38501,-0.67197 7.59734,-0.67197 6.70773,0 6.74741,0.004 7.57432,0.83127 1.09992,1.09992 1.12139,2.84211 0.0474,3.85103 -0.75411,0.70844 -1.04623,0.73535 -7.70467,0.70962 -3.80646,-0.0147 -7.11454,-0.10467 -7.35129,-0.19992 z M 91.846855,137.11183 c -4.39719,-4.40505 -4.82161,-4.93646 -4.82161,-6.03696 0,-1.56428 1.13132,-2.67947 2.71824,-2.67947 1.02888,0 1.66246,0.51187 5.98951,4.83892 4.402285,4.40228 4.838915,4.94702 4.838915,6.03696 0,1.56302 -1.134625,2.67079 -2.735545,2.67079 -1.05144,0 -1.64864,-0.48161 -5.98951,-4.83024 z m 108.013415,4.04641 c -0.45774,-0.48724 -0.73636,-1.21918 -0.73636,-1.93442 0,-1.02888 0.51186,-1.66245 4.83891,-5.9895 4.40228,-4.40228 4.94702,-4.83892 6.03697,-4.83892 1.56302,0 2.67078,1.13463 2.67078,2.73554 0,1.05144 -0.48161,1.64864 -4.83024,5.98951 -4.40505,4.3972 -4.93645,4.82162 -6.03696,4.82162 -0.82349,0 -1.44058,-0.24893 -1.9431,-0.78383 z M 147.80052,119.7748 c -0.82876,-0.82876 -0.83128,-0.85237 -0.83128,-7.80473 0,-6.95235 0.002,-6.97596 0.83128,-7.80472 1.09976,-1.09977 2.65635,-1.09977 3.75611,0 0.82876,0.82876 0.83128,0.85237 0.83128,7.80472 0,6.95236 -0.002,6.97597 -0.83128,7.80473 -0.52399,0.524 -1.21821,0.83127 -1.87805,0.83127 -0.65985,0 -1.35407,-0.30727 -1.87806,-0.83127 z"
         style="fill:#000000;stroke-width:0.33866665"
         sodipodi:nodetypes="csccsccscscscscccccccccccccccccscccsscsscccccccccsccscccccscccccssssssscsssscsccsccscsc" />
    </g>
    <path
       style="fill:#000000;stroke-width:0.16132797"
       d="m 121.71799,222.58599 c -0.36191,-0.22118 -0.54669,-0.48103 -0.62001,-0.87185 -0.0574,-0.30621 -0.0733,-3.26803 -0.0352,-6.58181 0.0633,-5.50953 0.0985,-6.1318 0.41106,-7.27266 1.35077,-4.93075 4.61093,-8.54303 9.29042,-10.29386 1.6427,-0.61461 2.96588,-0.7944 5.86778,-0.79732 l 2.7829,-0.003 v -2.17792 -2.17793 h -5.7988 -5.79882 l -0.45264,-0.38923 -0.45265,-0.38922 -0.0467,-7.11252 c -0.0375,-5.70613 -0.0882,-7.11253 -0.25656,-7.11253 -0.50798,0 -2.22159,-1.04116 -2.89036,-1.75612 -0.95114,-1.01685 -1.51284,-2.14739 -1.72418,-3.47029 -0.45085,-2.82223 0.95198,-5.63182 3.43032,-6.87027 0.53592,-0.26779 1.06772,-0.48691 1.18179,-0.48691 0.16327,0 0.21784,-1.03239 0.25655,-4.85402 l 0.0492,-4.85402 0.45265,-0.38914 0.45265,-0.38913 h 11.12263 11.12264 v -1.52765 -1.52764 l -0.90548,-0.44337 c -2.64469,-1.29498 -3.77519,-4.71963 -2.43819,-7.38603 0.50836,-1.01382 0.92884,-1.50243 1.80294,-2.095 3.31049,-2.24428 7.56845,-0.61396 8.56598,3.2798 0.33135,1.29338 0.20812,2.3577 -0.42607,3.6799 -0.58027,1.20979 -1.78826,2.35317 -2.90528,2.74991 l -0.79,0.28058 v 1.49475 1.49475 h 11.28397 11.28396 l 0.45264,0.38915 0.45265,0.38916 0.047,4.81849 0.047,4.81849 0.76197,0.27063 c 1.70519,0.60563 3.09306,1.96527 3.78474,3.70775 0.50393,1.26949 0.49063,3.41281 -0.0297,4.78424 -0.51145,1.34805 -1.78114,2.73432 -3.11475,3.40073 -0.5407,0.27019 -1.07819,0.49126 -1.19443,0.49126 -0.17037,0 -0.22012,1.37921 -0.25656,7.11251 l -0.0452,7.11251 -0.45265,0.38924 -0.45264,0.38924 h -5.79882 -5.7988 v 2.16136 2.16137 l 3.26689,0.0772 c 3.76385,0.089 4.36107,0.21227 6.84113,1.41245 4.19806,2.03156 7.03711,5.67407 7.97885,10.23687 0.26108,1.26491 0.30055,2.23811 0.30239,7.45528 l 0.002,6.00048 -0.38934,0.45265 -0.38934,0.45264 -29.658,0.0404 c -29.17413,0.0398 -29.66639,0.0353 -30.17355,-0.27462 z m 13.66379,-8.30863 c 0,-3.72275 0.0603,-5.85196 0.17281,-6.09882 0.40213,-0.88259 -0.30418,-0.84201 15.55667,-0.89396 8.07446,-0.0264 14.9985,-0.003 15.38674,0.0533 0.4254,0.0611 0.85812,0.25357 1.08897,0.48441 l 0.38306,0.38306 v 5.89581 5.8958 h 5.82568 5.82569 l -0.0805,-5.20282 c -0.0903,-5.83589 -0.16983,-6.38642 -1.24128,-8.59072 -1.19534,-2.4592 -3.00491,-4.24209 -5.57041,-5.48831 -2.6165,-1.27099 -1.74986,-1.22401 -21.61795,-1.17209 l -17.58475,0.046 -1.12929,0.38151 c -4.22387,1.42694 -7.11113,4.44106 -8.15177,8.50993 -0.2837,1.10924 -0.31795,1.79659 -0.31795,6.37986 v 5.13669 h 5.72714 5.72714 z m 29.84568,0.79905 v -4.9205 h -13.47089 -13.47089 v 4.9205 4.9205 h 13.47089 13.47089 z m -4.19453,-20.48865 v -2.17793 h -9.35702 -9.35702 v 2.17793 2.17793 h 9.35702 9.35702 z m 12.58358,-21.13397 v -16.21346 h -21.9406 -21.94061 v 16.21346 16.21346 h 21.94061 21.9406 z m -33.99665,12.87499 c -0.19788,-0.039 -0.50642,-0.25744 -0.68565,-0.48529 -0.31017,-0.39433 -0.32587,-0.64295 -0.32587,-5.1623 0,-3.09264 0.0608,-4.86158 0.17432,-5.07373 0.41645,-0.77816 0.48553,-0.78238 12.81258,-0.78238 12.32705,0 12.39613,0.004 12.81259,0.78238 0.11357,0.2122 0.17431,1.98471 0.17431,5.08649 v 4.76078 l -0.3893,0.45265 -0.3893,0.45265 -11.91196,0.0199 c -6.55157,0.0109 -12.07385,-0.012 -12.27172,-0.0511 z m 22.38104,-3.4385 v -0.80783 l -10.28466,0.0416 -10.28466,0.0415 -0.0492,0.76631 -0.0492,0.76631 h 10.33383 10.33383 z m 0,-4.35466 v -0.80664 h -10.32499 -10.32499 v 0.80664 0.80664 h 10.32499 10.32499 z m -23.98854,-7.81013 -0.45265,-0.38905 -0.0517,-3.44249 c -0.033,-2.20131 0.0128,-3.66028 0.12719,-4.04654 0.2995,-1.01146 0.62364,-1.0899 4.50381,-1.0899 1.95187,0 3.57214,0.071 3.82641,0.16767 0.8397,0.31926 0.85997,0.42598 0.86548,4.55851 l 0.005,3.83887 -0.39599,0.39599 -0.39598,0.39598 h -3.78955 c -3.77242,0 -3.79159,-0.002 -4.24219,-0.38904 z m 6.24246,-4.2088 v -1.85527 h -1.93593 -1.93594 v 1.85527 1.85527 h 1.93594 1.93593 z m 12.49559,4.20186 -0.39599,-0.39599 v -3.85108 -3.85108 l 0.41597,-0.39111 c 0.41104,-0.38648 0.45873,-0.39169 4.02474,-0.43996 3.98797,-0.054 4.37542,0.0198 4.74119,0.90285 0.13542,0.32694 0.17829,1.52842 0.14372,4.02817 -0.0486,3.51647 -0.0543,3.56762 -0.44037,3.97823 l -0.39111,0.41595 h -3.85109 -3.85108 z m 6.21845,-4.20186 v -1.85527 h -1.93593 -1.93593 v 1.85527 1.85527 h 1.93593 1.93593 z m -36.13746,4.582 v -3.40373 l -0.52432,0.32565 c -0.85879,0.5334 -1.4682,1.66524 -1.54486,2.86926 -0.0553,0.86767 0.001,1.16869 0.35529,1.89229 0.25197,0.51501 0.66357,1.03307 1.02519,1.29037 0.33231,0.23644 0.62321,0.42989 0.64645,0.42989 0.0232,0 0.0422,-1.53168 0.0422,-3.40373 z m 50.54045,2.87914 c 0.71375,-0.49435 1.24583,-1.71569 1.24583,-2.85969 0,-1.50295 -0.6152,-2.57281 -1.8956,-3.29655 -0.15856,-0.0896 -0.20166,0.61416 -0.20166,3.29294 0,2.6802 0.043,3.38206 0.20166,3.2903 0.11091,-0.0641 0.4033,-0.2563 0.64977,-0.427 z m -24.17021,-25.7898 c 0.86521,-0.59286 1.26896,-1.4487 1.18142,-2.50431 -0.0812,-0.97957 -0.41928,-1.54653 -1.27003,-2.13007 -0.73307,-0.50281 -2.23398,-0.44622 -3.02059,0.1139 -1.01886,0.7255 -1.42015,2.14942 -0.93378,3.31347 0.23974,0.57376 1.14647,1.39258 1.74979,1.58013 0.63475,0.19733 1.71787,0.0211 2.29319,-0.37312 z"
       id="path1780"
       inkscape:connector-curvature="0" />
  </g>
</svg>
