<?xml version="1.0" encoding="UTF-8"?>
<svg xmlns="http://www.w3.org/2000/svg" xmlns:xlink="http://www.w3.org/1999/xlink" width="595.275591pt" height="841.889764pt" viewBox="0 0 595.275591 841.889764" version="1.2">
<defs>
<g>
<symbol overflow="visible" id="glyph0-0">
<path style="stroke:none;" d="M -3.480469 -1.96875 L -0.808594 -1.96875 L -0.808594 -3.550781 C -0.808594 -4.078125 -0.921875 -4.46875 -1.140625 -4.730469 C -1.359375 -4.980469 -1.691406 -5.109375 -2.148438 -5.109375 C -2.601562 -5.109375 -2.929688 -4.980469 -3.148438 -4.730469 C -3.371094 -4.46875 -3.480469 -4.078125 -3.480469 -3.550781 L -3.480469 -1.96875 M -6.480469 -1.96875 L -4.28125 -1.96875 L -4.28125 -3.429688 C -4.28125 -3.910156 -4.371094 -4.261719 -4.550781 -4.5 C -4.730469 -4.738281 -5 -4.859375 -5.378906 -4.859375 C -5.738281 -4.859375 -6.019531 -4.738281 -6.199219 -4.5 C -6.378906 -4.261719 -6.480469 -3.910156 -6.480469 -3.429688 L -6.480469 -1.96875 M -7.289062 -0.980469 L -7.289062 -3.5 C -7.289062 -4.25 -7.128906 -4.828125 -6.820312 -5.238281 C -6.5 -5.640625 -6.058594 -5.851562 -5.488281 -5.851562 C -5.039062 -5.851562 -4.679688 -5.738281 -4.421875 -5.53125 C -4.160156 -5.320312 -3.988281 -5.019531 -3.929688 -4.621094 C -3.820312 -5.101562 -3.601562 -5.480469 -3.269531 -5.75 C -2.941406 -6.011719 -2.53125 -6.148438 -2.039062 -6.148438 C -1.378906 -6.148438 -0.878906 -5.921875 -0.53125 -5.480469 C -0.171875 -5.039062 0 -4.410156 0 -3.601562 L 0 -0.980469 L -7.289062 -0.980469 "/>
</symbol>
<symbol overflow="visible" id="glyph0-1">
<path style="stroke:none;" d="M -2.75 -3.429688 C -2.75 -2.699219 -2.660156 -2.199219 -2.5 -1.921875 C -2.328125 -1.640625 -2.050781 -1.5 -1.648438 -1.5 C -1.328125 -1.5 -1.070312 -1.601562 -0.890625 -1.808594 C -0.699219 -2.019531 -0.609375 -2.308594 -0.609375 -2.671875 C -0.609375 -3.171875 -0.78125 -3.570312 -1.140625 -3.871094 C -1.488281 -4.171875 -1.960938 -4.320312 -2.550781 -4.320312 L -2.75 -4.320312 L -2.75 -3.429688 M -3.121094 -5.21875 L 0 -5.21875 L 0 -4.320312 L -0.828125 -4.320312 C -0.488281 -4.109375 -0.25 -3.851562 -0.101562 -3.550781 C 0.0507812 -3.25 0.128906 -2.871094 0.128906 -2.429688 C 0.128906 -1.871094 -0.0195312 -1.421875 -0.328125 -1.089844 C -0.640625 -0.761719 -1.058594 -0.601562 -1.589844 -0.601562 C -2.199219 -0.601562 -2.660156 -0.800781 -2.980469 -1.21875 C -3.289062 -1.628906 -3.449219 -2.238281 -3.449219 -3.058594 L -3.449219 -4.320312 L -3.539062 -4.320312 C -3.949219 -4.320312 -4.269531 -4.179688 -4.5 -3.910156 C -4.71875 -3.640625 -4.839844 -3.261719 -4.839844 -2.769531 C -4.839844 -2.449219 -4.800781 -2.148438 -4.71875 -1.851562 C -4.640625 -1.550781 -4.53125 -1.269531 -4.390625 -1 L -5.21875 -1 C -5.339844 -1.320312 -5.441406 -1.640625 -5.5 -1.949219 C -5.558594 -2.261719 -5.601562 -2.558594 -5.601562 -2.859375 C -5.601562 -3.648438 -5.390625 -4.238281 -4.980469 -4.628906 C -4.570312 -5.019531 -3.949219 -5.21875 -3.121094 -5.21875 "/>
</symbol>
<symbol overflow="visible" id="glyph0-2">
<path style="stroke:none;" d="M -5.308594 -4.429688 L -4.460938 -4.429688 C -4.578125 -4.171875 -4.679688 -3.910156 -4.75 -3.640625 C -4.808594 -3.359375 -4.851562 -3.078125 -4.851562 -2.789062 C -4.851562 -2.339844 -4.78125 -2 -4.640625 -1.78125 C -4.5 -1.558594 -4.300781 -1.449219 -4.03125 -1.449219 C -3.820312 -1.449219 -3.660156 -1.53125 -3.539062 -1.691406 C -3.421875 -1.851562 -3.300781 -2.171875 -3.199219 -2.648438 L -3.128906 -2.960938 C -2.988281 -3.601562 -2.789062 -4.050781 -2.550781 -4.320312 C -2.300781 -4.578125 -1.949219 -4.71875 -1.511719 -4.71875 C -1 -4.71875 -0.601562 -4.519531 -0.308594 -4.121094 C -0.0117188 -3.71875 0.128906 -3.160156 0.128906 -2.460938 C 0.128906 -2.160156 0.101562 -1.859375 0.0507812 -1.539062 C 0 -1.21875 -0.078125 -0.890625 -0.199219 -0.539062 L -1.128906 -0.539062 C -0.949219 -0.871094 -0.820312 -1.199219 -0.738281 -1.519531 C -0.648438 -1.839844 -0.609375 -2.160156 -0.609375 -2.480469 C -0.609375 -2.898438 -0.679688 -3.230469 -0.820312 -3.460938 C -0.960938 -3.679688 -1.171875 -3.800781 -1.441406 -3.800781 C -1.679688 -3.800781 -1.871094 -3.710938 -2 -3.550781 C -2.128906 -3.390625 -2.261719 -3.03125 -2.378906 -2.46875 L -2.449219 -2.160156 C -2.570312 -1.601562 -2.75 -1.191406 -2.988281 -0.949219 C -3.230469 -0.699219 -3.558594 -0.578125 -3.988281 -0.578125 C -4.5 -0.578125 -4.898438 -0.761719 -5.179688 -1.121094 C -5.460938 -1.480469 -5.601562 -2 -5.601562 -2.679688 C -5.601562 -3.011719 -5.570312 -3.320312 -5.519531 -3.621094 C -5.46875 -3.910156 -5.398438 -4.179688 -5.308594 -4.429688 "/>
</symbol>
<symbol overflow="visible" id="glyph0-3">
<path style="stroke:none;" d="M -2.960938 -5.621094 L -2.519531 -5.621094 L -2.519531 -1.488281 C -1.898438 -1.53125 -1.421875 -1.710938 -1.101562 -2.050781 C -0.78125 -2.378906 -0.621094 -2.839844 -0.621094 -3.441406 C -0.621094 -3.78125 -0.660156 -4.121094 -0.738281 -4.441406 C -0.820312 -4.761719 -0.949219 -5.089844 -1.128906 -5.410156 L -0.28125 -5.410156 C -0.140625 -5.089844 -0.03125 -4.761719 0.03125 -4.421875 C 0.0898438 -4.078125 0.128906 -3.730469 0.128906 -3.390625 C 0.128906 -2.511719 -0.121094 -1.820312 -0.621094 -1.308594 C -1.121094 -0.800781 -1.808594 -0.550781 -2.679688 -0.550781 C -3.570312 -0.550781 -4.28125 -0.789062 -4.808594 -1.269531 C -5.328125 -1.75 -5.601562 -2.410156 -5.601562 -3.230469 C -5.601562 -3.96875 -5.359375 -4.550781 -4.890625 -4.980469 C -4.410156 -5.398438 -3.769531 -5.621094 -2.960938 -5.621094 M -3.21875 -4.71875 C -3.710938 -4.710938 -4.101562 -4.570312 -4.398438 -4.308594 C -4.691406 -4.039062 -4.839844 -3.679688 -4.839844 -3.238281 C -4.839844 -2.738281 -4.691406 -2.339844 -4.410156 -2.039062 C -4.128906 -1.738281 -3.730469 -1.558594 -3.21875 -1.519531 L -3.21875 -4.71875 "/>
</symbol>
<symbol overflow="visible" id="glyph0-4">
<path style="stroke:none;" d="M -7.601562 -0.941406 L -7.601562 -1.839844 L 0 -1.839844 L 0 -0.941406 L -7.601562 -0.941406 "/>
</symbol>
<symbol overflow="visible" id="glyph0-5">
<path style="stroke:none;" d="M -5.46875 -0.941406 L -5.46875 -1.839844 L 0 -1.839844 L 0 -0.941406 L -5.46875 -0.941406 M -7.601562 -0.941406 L -7.601562 -1.839844 L -6.460938 -1.839844 L -6.460938 -0.941406 L -7.601562 -0.941406 "/>
</symbol>
<symbol overflow="visible" id="glyph0-6">
<path style="stroke:none;" d="M -3.300781 -5.488281 L 0 -5.488281 L 0 -4.589844 L -3.269531 -4.589844 C -3.789062 -4.589844 -4.171875 -4.480469 -4.429688 -4.28125 C -4.691406 -4.078125 -4.820312 -3.78125 -4.820312 -3.378906 C -4.820312 -2.890625 -4.660156 -2.511719 -4.351562 -2.230469 C -4.039062 -1.949219 -3.621094 -1.808594 -3.089844 -1.808594 L 0 -1.808594 L 0 -0.910156 L -5.46875 -0.910156 L -5.46875 -1.808594 L -4.621094 -1.808594 C -4.941406 -2.019531 -5.191406 -2.269531 -5.351562 -2.570312 C -5.511719 -2.859375 -5.601562 -3.199219 -5.601562 -3.578125 C -5.601562 -4.199219 -5.398438 -4.679688 -5.011719 -5 C -4.621094 -5.320312 -4.050781 -5.488281 -3.300781 -5.488281 "/>
</symbol>
<symbol overflow="visible" id="glyph0-7">
<path style="stroke:none;" d="M -6.480469 -1.96875 L -0.808594 -1.96875 L -0.808594 -3.160156 C -0.808594 -4.160156 -1.03125 -4.898438 -1.488281 -5.371094 C -1.949219 -5.828125 -2.671875 -6.070312 -3.648438 -6.070312 C -4.628906 -6.070312 -5.339844 -5.828125 -5.800781 -5.371094 C -6.25 -4.898438 -6.480469 -4.160156 -6.480469 -3.160156 L -6.480469 -1.96875 M -7.289062 -0.980469 L -7.289062 -3.011719 C -7.289062 -4.421875 -6.988281 -5.460938 -6.410156 -6.121094 C -5.820312 -6.78125 -4.898438 -7.109375 -3.648438 -7.109375 C -2.390625 -7.109375 -1.46875 -6.769531 -0.878906 -6.109375 C -0.289062 -5.449219 0 -4.410156 0 -3.011719 L 0 -0.980469 L -7.289062 -0.980469 "/>
</symbol>
<symbol overflow="visible" id="glyph0-8">
<path style="stroke:none;" d="M 0 -2.859375 L -7.289062 -0.078125 L -7.289062 -1.109375 L -1.148438 -3.421875 L -7.289062 -5.730469 L -7.289062 -6.761719 L 0 -3.980469 L 0 -2.859375 "/>
</symbol>
<symbol overflow="visible" id="glyph0-9">
<path style="stroke:none;" d="M -6.480469 -1.96875 L -3.738281 -1.96875 L -3.738281 -3.210938 C -3.738281 -3.671875 -3.851562 -4.019531 -4.089844 -4.269531 C -4.328125 -4.519531 -4.671875 -4.648438 -5.109375 -4.648438 C -5.550781 -4.648438 -5.878906 -4.519531 -6.121094 -4.269531 C -6.359375 -4.019531 -6.480469 -3.671875 -6.480469 -3.210938 L -6.480469 -1.96875 M -7.289062 -0.980469 L -7.289062 -3.210938 C -7.289062 -4.019531 -7.101562 -4.640625 -6.730469 -5.058594 C -6.359375 -5.480469 -5.820312 -5.691406 -5.109375 -5.691406 C -4.390625 -5.691406 -3.839844 -5.480469 -3.480469 -5.058594 C -3.109375 -4.640625 -2.929688 -4.019531 -2.929688 -3.210938 L -2.929688 -1.96875 L 0 -1.96875 L 0 -0.980469 L -7.289062 -0.980469 "/>
</symbol>
<symbol overflow="visible" id="glyph0-10">
<path style="stroke:none;" d="M -6.269531 -4.601562 L -3.550781 -4.601562 L -3.550781 -7.320312 L -2.71875 -7.320312 L -2.71875 -4.601562 L 0 -4.601562 L 0 -3.78125 L -2.71875 -3.78125 L -2.71875 -1.058594 L -3.550781 -1.058594 L -3.550781 -3.78125 L -6.269531 -3.78125 L -6.269531 -4.601562 "/>
</symbol>
<symbol overflow="visible" id="glyph0-11">
<path style="stroke:none;" d="M -6.730469 -6.441406 L -5.691406 -6.441406 C -5.988281 -6.101562 -6.21875 -5.75 -6.378906 -5.371094 C -6.53125 -4.988281 -6.609375 -4.601562 -6.609375 -4.179688 C -6.609375 -3.339844 -6.351562 -2.699219 -5.839844 -2.261719 C -5.328125 -1.820312 -4.601562 -1.601562 -3.640625 -1.601562 C -2.679688 -1.601562 -1.941406 -1.820312 -1.429688 -2.261719 C -0.921875 -2.699219 -0.671875 -3.339844 -0.671875 -4.179688 C -0.671875 -4.601562 -0.738281 -4.988281 -0.898438 -5.371094 C -1.050781 -5.75 -1.28125 -6.101562 -1.589844 -6.441406 L -0.558594 -6.441406 C -0.320312 -6.089844 -0.148438 -5.71875 -0.0390625 -5.339844 C 0.0703125 -4.960938 0.128906 -4.550781 0.128906 -4.121094 C 0.128906 -3.019531 -0.199219 -2.148438 -0.871094 -1.511719 C -1.539062 -0.871094 -2.460938 -0.558594 -3.640625 -0.558594 C -4.808594 -0.558594 -5.730469 -0.871094 -6.410156 -1.511719 C -7.078125 -2.148438 -7.421875 -3.019531 -7.421875 -4.121094 C -7.421875 -4.558594 -7.359375 -4.96875 -7.25 -5.351562 C -7.128906 -5.730469 -6.960938 -6.101562 -6.730469 -6.441406 "/>
</symbol>
<symbol overflow="visible" id="glyph0-12">
<path style="stroke:none;" d="M -4.839844 -3.058594 C -4.839844 -2.578125 -4.648438 -2.199219 -4.269531 -1.921875 C -3.890625 -1.640625 -3.378906 -1.5 -2.730469 -1.5 C -2.070312 -1.5 -1.558594 -1.628906 -1.179688 -1.910156 C -0.800781 -2.191406 -0.621094 -2.570312 -0.621094 -3.058594 C -0.621094 -3.539062 -0.800781 -3.921875 -1.179688 -4.199219 C -1.558594 -4.480469 -2.070312 -4.621094 -2.730469 -4.621094 C -3.371094 -4.621094 -3.890625 -4.480469 -4.269531 -4.199219 C -4.648438 -3.921875 -4.839844 -3.539062 -4.839844 -3.058594 M -5.601562 -3.058594 C -5.601562 -3.839844 -5.339844 -4.449219 -4.839844 -4.898438 C -4.328125 -5.339844 -3.628906 -5.570312 -2.730469 -5.570312 C -1.828125 -5.570312 -1.128906 -5.339844 -0.628906 -4.898438 C -0.121094 -4.449219 0.128906 -3.839844 0.128906 -3.058594 C 0.128906 -2.269531 -0.121094 -1.648438 -0.628906 -1.210938 C -1.128906 -0.769531 -1.828125 -0.550781 -2.730469 -0.550781 C -3.628906 -0.550781 -4.328125 -0.769531 -4.839844 -1.210938 C -5.339844 -1.648438 -5.601562 -2.269531 -5.601562 -3.058594 "/>
</symbol>
<symbol overflow="visible" id="glyph0-13">
<path style="stroke:none;" d="M -4.640625 -4.539062 L -7.601562 -4.539062 L -7.601562 -5.441406 L 0 -5.441406 L 0 -4.539062 L -0.820312 -4.539062 C -0.488281 -4.351562 -0.25 -4.109375 -0.101562 -3.820312 C 0.0507812 -3.53125 0.128906 -3.191406 0.128906 -2.789062 C 0.128906 -2.128906 -0.128906 -1.589844 -0.648438 -1.171875 C -1.171875 -0.75 -1.871094 -0.550781 -2.730469 -0.550781 C -3.589844 -0.550781 -4.28125 -0.75 -4.808594 -1.171875 C -5.328125 -1.589844 -5.601562 -2.128906 -5.601562 -2.789062 C -5.601562 -3.191406 -5.519531 -3.53125 -5.359375 -3.820312 C -5.199219 -4.109375 -4.960938 -4.351562 -4.640625 -4.539062 M -2.730469 -1.480469 C -2.070312 -1.480469 -1.550781 -1.609375 -1.171875 -1.878906 C -0.789062 -2.148438 -0.609375 -2.53125 -0.609375 -3.011719 C -0.609375 -3.480469 -0.789062 -3.851562 -1.171875 -4.128906 C -1.550781 -4.398438 -2.070312 -4.539062 -2.730469 -4.539062 C -3.390625 -4.539062 -3.898438 -4.398438 -4.28125 -4.128906 C -4.660156 -3.851562 -4.851562 -3.480469 -4.851562 -3.011719 C -4.851562 -2.53125 -4.660156 -2.148438 -4.28125 -1.878906 C -3.898438 -1.609375 -3.390625 -1.480469 -2.730469 -1.480469 "/>
</symbol>
<symbol overflow="visible" id="glyph0-14">
<path style="stroke:none;" d="M -7.019531 -1.828125 L -5.46875 -1.828125 L -5.46875 -3.679688 L -4.769531 -3.679688 L -4.769531 -1.828125 L -1.800781 -1.828125 C -1.351562 -1.828125 -1.058594 -1.890625 -0.941406 -2.011719 C -0.808594 -2.128906 -0.75 -2.378906 -0.75 -2.761719 L -0.75 -3.679688 L 0 -3.679688 L 0 -2.761719 C 0 -2.058594 -0.128906 -1.578125 -0.390625 -1.320312 C -0.648438 -1.058594 -1.121094 -0.929688 -1.800781 -0.929688 L -4.769531 -0.929688 L -4.769531 -0.269531 L -5.46875 -0.269531 L -5.46875 -0.929688 L -7.019531 -0.929688 L -7.019531 -1.828125 "/>
</symbol>
<symbol overflow="visible" id="glyph0-15">
<path style="stroke:none;" d="M -6.640625 -3.179688 C -6.640625 -2.671875 -6.390625 -2.289062 -5.890625 -2.03125 C -5.390625 -1.769531 -4.640625 -1.648438 -3.640625 -1.648438 C -2.640625 -1.648438 -1.890625 -1.769531 -1.390625 -2.03125 C -0.890625 -2.289062 -0.640625 -2.671875 -0.640625 -3.179688 C -0.640625 -3.691406 -0.890625 -4.070312 -1.390625 -4.328125 C -1.890625 -4.578125 -2.640625 -4.710938 -3.640625 -4.710938 C -4.640625 -4.710938 -5.390625 -4.578125 -5.890625 -4.328125 C -6.390625 -4.070312 -6.640625 -3.691406 -6.640625 -3.179688 M -7.421875 -3.179688 C -7.421875 -3.988281 -7.089844 -4.609375 -6.449219 -5.050781 C -5.800781 -5.480469 -4.859375 -5.699219 -3.640625 -5.699219 C -2.410156 -5.699219 -1.46875 -5.480469 -0.828125 -5.050781 C -0.191406 -4.609375 0.128906 -3.988281 0.128906 -3.179688 C 0.128906 -2.359375 -0.191406 -1.730469 -0.828125 -1.300781 C -1.46875 -0.871094 -2.410156 -0.660156 -3.640625 -0.660156 C -4.859375 -0.660156 -5.800781 -0.871094 -6.449219 -1.300781 C -7.089844 -1.730469 -7.421875 -2.359375 -7.421875 -3.179688 "/>
</symbol>
<symbol overflow="visible" id="glyph0-16">
<path style="stroke:none;" d="M -0.828125 -1.921875 L -0.828125 -5.359375 L 0 -5.359375 L 0 -0.730469 L -0.828125 -0.730469 C -1.210938 -1.101562 -1.730469 -1.609375 -2.390625 -2.261719 C -3.039062 -2.898438 -3.460938 -3.308594 -3.648438 -3.480469 C -4 -3.800781 -4.300781 -4.019531 -4.550781 -4.140625 C -4.789062 -4.261719 -5.039062 -4.328125 -5.28125 -4.328125 C -5.660156 -4.328125 -5.980469 -4.191406 -6.21875 -3.921875 C -6.460938 -3.648438 -6.589844 -3.300781 -6.589844 -2.859375 C -6.589844 -2.550781 -6.53125 -2.21875 -6.429688 -1.878906 C -6.320312 -1.539062 -6.160156 -1.171875 -5.941406 -0.78125 L -6.941406 -0.78125 C -7.101562 -1.179688 -7.21875 -1.550781 -7.300781 -1.890625 C -7.378906 -2.230469 -7.421875 -2.550781 -7.421875 -2.839844 C -7.421875 -3.589844 -7.230469 -4.191406 -6.851562 -4.640625 C -6.46875 -5.089844 -5.96875 -5.320312 -5.339844 -5.320312 C -5.039062 -5.320312 -4.75 -5.261719 -4.488281 -5.148438 C -4.21875 -5.039062 -3.898438 -4.839844 -3.539062 -4.539062 C -3.441406 -4.460938 -3.171875 -4.199219 -2.71875 -3.761719 C -2.269531 -3.320312 -1.640625 -2.710938 -0.828125 -1.921875 "/>
</symbol>
<symbol overflow="visible" id="glyph0-17">
<path style="stroke:none;" d="M -6.429688 -3.78125 L -2.539062 -1.289062 L -2.539062 -3.78125 L -6.429688 -3.78125 M -7.289062 -3.519531 L -7.289062 -4.761719 L -2.539062 -4.761719 L -2.539062 -5.800781 L -1.71875 -5.800781 L -1.71875 -4.761719 L 0 -4.761719 L 0 -3.78125 L -1.71875 -3.78125 L -1.71875 -0.488281 L -2.671875 -0.488281 L -7.289062 -3.519531 "/>
</symbol>
<symbol overflow="visible" id="glyph0-18">
<path style="stroke:none;" d="M -4.039062 -3.300781 C -4.039062 -2.859375 -3.878906 -2.511719 -3.578125 -2.25 C -3.28125 -1.988281 -2.859375 -1.859375 -2.339844 -1.859375 C -1.808594 -1.859375 -1.390625 -1.988281 -1.089844 -2.25 C -0.789062 -2.511719 -0.640625 -2.859375 -0.640625 -3.300781 C -0.640625 -3.738281 -0.789062 -4.089844 -1.089844 -4.351562 C -1.390625 -4.609375 -1.808594 -4.738281 -2.339844 -4.738281 C -2.859375 -4.738281 -3.28125 -4.609375 -3.578125 -4.351562 C -3.878906 -4.089844 -4.039062 -3.738281 -4.039062 -3.300781 M -7.128906 -5.261719 L -6.230469 -5.261719 C -6.351562 -5.011719 -6.441406 -4.761719 -6.5 -4.511719 C -6.558594 -4.25 -6.589844 -4 -6.589844 -3.761719 C -6.589844 -3.101562 -6.371094 -2.601562 -5.929688 -2.261719 C -5.488281 -1.921875 -4.820312 -1.71875 -3.941406 -1.679688 C -4.21875 -1.871094 -4.441406 -2.109375 -4.589844 -2.398438 C -4.738281 -2.691406 -4.820312 -3.011719 -4.820312 -3.359375 C -4.820312 -4.089844 -4.589844 -4.671875 -4.148438 -5.089844 C -3.710938 -5.511719 -3.101562 -5.730469 -2.339844 -5.730469 C -1.589844 -5.730469 -0.988281 -5.5 -0.539062 -5.058594 C -0.0898438 -4.621094 0.128906 -4.03125 0.128906 -3.300781 C 0.128906 -2.460938 -0.191406 -1.808594 -0.828125 -1.371094 C -1.46875 -0.921875 -2.410156 -0.699219 -3.640625 -0.699219 C -4.789062 -0.699219 -5.710938 -0.96875 -6.390625 -1.519531 C -7.070312 -2.058594 -7.421875 -2.800781 -7.421875 -3.71875 C -7.421875 -3.960938 -7.390625 -4.210938 -7.351562 -4.46875 C -7.300781 -4.71875 -7.230469 -4.980469 -7.128906 -5.261719 "/>
</symbol>
<symbol overflow="visible" id="glyph0-19">
<path style="stroke:none;" d="M -3.460938 -3.179688 C -3.460938 -2.710938 -3.328125 -2.339844 -3.078125 -2.070312 C -2.828125 -1.800781 -2.488281 -1.671875 -2.050781 -1.671875 C -1.609375 -1.671875 -1.261719 -1.800781 -1.011719 -2.070312 C -0.761719 -2.339844 -0.640625 -2.710938 -0.640625 -3.179688 C -0.640625 -3.640625 -0.761719 -4.011719 -1.019531 -4.28125 C -1.269531 -4.550781 -1.609375 -4.691406 -2.050781 -4.691406 C -2.488281 -4.691406 -2.828125 -4.550781 -3.078125 -4.289062 C -3.328125 -4.019531 -3.460938 -3.648438 -3.460938 -3.179688 M -3.878906 -2.191406 C -3.980469 -1.769531 -4.179688 -1.441406 -4.46875 -1.199219 C -4.761719 -0.960938 -5.109375 -0.851562 -5.53125 -0.851562 C -6.109375 -0.851562 -6.570312 -1.050781 -6.910156 -1.46875 C -7.25 -1.878906 -7.421875 -2.449219 -7.421875 -3.179688 C -7.421875 -3.898438 -7.25 -4.46875 -6.910156 -4.890625 C -6.570312 -5.300781 -6.109375 -5.511719 -5.53125 -5.511719 C -5.109375 -5.511719 -4.761719 -5.390625 -4.46875 -5.148438 C -4.179688 -4.910156 -3.980469 -4.589844 -3.878906 -4.171875 C -3.769531 -4.640625 -3.550781 -5.011719 -3.230469 -5.28125 C -2.910156 -5.539062 -2.511719 -5.679688 -2.050781 -5.679688 C -1.339844 -5.679688 -0.800781 -5.460938 -0.429688 -5.03125 C -0.0507812 -4.589844 0.128906 -3.980469 0.128906 -3.179688 C 0.128906 -2.371094 -0.0507812 -1.75 -0.429688 -1.320312 C -0.800781 -0.890625 -1.339844 -0.679688 -2.050781 -0.679688 C -2.511719 -0.679688 -2.910156 -0.808594 -3.230469 -1.078125 C -3.550781 -1.339844 -3.769531 -1.710938 -3.878906 -2.191406 M -5.441406 -1.828125 C -5.058594 -1.828125 -4.761719 -1.941406 -4.550781 -2.179688 C -4.339844 -2.421875 -4.238281 -2.75 -4.238281 -3.179688 C -4.238281 -3.601562 -4.339844 -3.929688 -4.550781 -4.171875 C -4.761719 -4.410156 -5.058594 -4.53125 -5.441406 -4.53125 C -5.820312 -4.53125 -6.109375 -4.410156 -6.320312 -4.171875 C -6.53125 -3.929688 -6.640625 -3.601562 -6.640625 -3.179688 C -6.640625 -2.75 -6.53125 -2.421875 -6.320312 -2.179688 C -6.109375 -1.941406 -5.820312 -1.828125 -5.441406 -1.828125 "/>
</symbol>
<symbol overflow="visible" id="glyph0-20">
<path style="stroke:none;" d="M -0.828125 -1.238281 L -0.828125 -2.851562 L -6.390625 -2.851562 L -6.039062 -1.101562 L -6.941406 -1.101562 L -7.289062 -2.839844 L -7.289062 -3.828125 L -0.828125 -3.828125 L -0.828125 -5.441406 L 0 -5.441406 L 0 -1.238281 L -0.828125 -1.238281 "/>
</symbol>
<symbol overflow="visible" id="glyph0-21">
<path style="stroke:none;" d="M -7.289062 -0.871094 L -7.289062 -1.859375 L -2.859375 -1.859375 C -2.078125 -1.859375 -1.511719 -2 -1.171875 -2.28125 C -0.828125 -2.558594 -0.660156 -3.019531 -0.660156 -3.660156 C -0.660156 -4.289062 -0.828125 -4.75 -1.171875 -5.03125 C -1.511719 -5.308594 -2.078125 -5.460938 -2.859375 -5.460938 L -7.289062 -5.460938 L -7.289062 -6.449219 L -2.738281 -6.449219 C -1.78125 -6.449219 -1.070312 -6.210938 -0.589844 -5.738281 C -0.109375 -5.269531 0.128906 -4.578125 0.128906 -3.660156 C 0.128906 -2.738281 -0.109375 -2.039062 -0.589844 -1.570312 C -1.070312 -1.101562 -1.78125 -0.871094 -2.738281 -0.871094 L -7.289062 -0.871094 "/>
</symbol>
<symbol overflow="visible" id="glyph0-22">
<path style="stroke:none;" d="M -4.628906 -4.109375 C -4.691406 -4.011719 -4.730469 -3.898438 -4.761719 -3.78125 C -4.78125 -3.660156 -4.800781 -3.53125 -4.800781 -3.390625 C -4.800781 -2.878906 -4.628906 -2.488281 -4.300781 -2.21875 C -3.96875 -1.941406 -3.5 -1.808594 -2.878906 -1.808594 L 0 -1.808594 L 0 -0.910156 L -5.46875 -0.910156 L -5.46875 -1.808594 L -4.621094 -1.808594 C -4.949219 -1.988281 -5.199219 -2.238281 -5.359375 -2.539062 C -5.519531 -2.839844 -5.601562 -3.210938 -5.601562 -3.648438 C -5.601562 -3.710938 -5.589844 -3.78125 -5.589844 -3.859375 C -5.578125 -3.929688 -5.570312 -4.011719 -5.550781 -4.109375 L -4.628906 -4.109375 "/>
</symbol>
<symbol overflow="visible" id="glyph0-23">
<path style="stroke:none;" d=""/>
</symbol>
<symbol overflow="visible" id="glyph0-24">
<path style="stroke:none;" d="M -3.140625 -0.488281 L -3.140625 -3.121094 L -2.339844 -3.121094 L -2.339844 -0.488281 L -3.140625 -0.488281 "/>
</symbol>
<symbol overflow="visible" id="glyph0-25">
<path style="stroke:none;" d="M -7.289062 -1.078125 L -7.289062 -4.949219 L -6.460938 -4.949219 L -6.460938 -1.980469 L -4.671875 -1.980469 C -4.71875 -2.121094 -4.761719 -2.269531 -4.78125 -2.410156 C -4.800781 -2.550781 -4.820312 -2.699219 -4.820312 -2.839844 C -4.820312 -3.648438 -4.589844 -4.289062 -4.148438 -4.769531 C -3.699219 -5.25 -3.101562 -5.488281 -2.339844 -5.488281 C -1.550781 -5.488281 -0.941406 -5.238281 -0.511719 -4.75 C -0.078125 -4.261719 0.128906 -3.570312 0.128906 -2.691406 C 0.128906 -2.378906 0.101562 -2.070312 0.0585938 -1.75 C 0.0117188 -1.429688 -0.0585938 -1.109375 -0.171875 -0.769531 L -1.160156 -0.769531 C -1 -1.058594 -0.878906 -1.359375 -0.800781 -1.679688 C -0.71875 -1.988281 -0.691406 -2.320312 -0.691406 -2.671875 C -0.691406 -3.230469 -0.828125 -3.679688 -1.128906 -4.011719 C -1.429688 -4.328125 -1.828125 -4.5 -2.339844 -4.5 C -2.839844 -4.5 -3.238281 -4.328125 -3.539062 -4.011719 C -3.839844 -3.679688 -3.988281 -3.230469 -3.988281 -2.671875 C -3.988281 -2.410156 -3.960938 -2.140625 -3.898438 -1.878906 C -3.839844 -1.621094 -3.75 -1.351562 -3.628906 -1.078125 L -7.289062 -1.078125 "/>
</symbol>
<symbol overflow="visible" id="glyph0-26">
<path style="stroke:none;" d="M -0.148438 -1.101562 L -1.050781 -1.101562 C -0.929688 -1.339844 -0.839844 -1.589844 -0.78125 -1.851562 C -0.71875 -2.101562 -0.691406 -2.351562 -0.691406 -2.601562 C -0.691406 -3.238281 -0.898438 -3.738281 -1.339844 -4.078125 C -1.78125 -4.421875 -2.441406 -4.621094 -3.339844 -4.679688 C -3.058594 -4.480469 -2.839844 -4.238281 -2.691406 -3.960938 C -2.539062 -3.671875 -2.46875 -3.351562 -2.46875 -3 C -2.46875 -2.261719 -2.691406 -1.679688 -3.128906 -1.261719 C -3.570312 -0.839844 -4.171875 -0.628906 -4.941406 -0.628906 C -5.679688 -0.628906 -6.28125 -0.851562 -6.738281 -1.289062 C -7.191406 -1.730469 -7.421875 -2.320312 -7.421875 -3.058594 C -7.421875 -3.898438 -7.089844 -4.550781 -6.449219 -4.988281 C -5.800781 -5.429688 -4.859375 -5.660156 -3.640625 -5.660156 C -2.480469 -5.660156 -1.570312 -5.378906 -0.890625 -4.839844 C -0.210938 -4.289062 0.128906 -3.558594 0.128906 -2.640625 C 0.128906 -2.390625 0.101562 -2.140625 0.0585938 -1.890625 C 0.0195312 -1.628906 -0.0507812 -1.371094 -0.148438 -1.101562 M -3.238281 -3.058594 C -3.238281 -3.5 -3.390625 -3.851562 -3.691406 -4.109375 C -3.988281 -4.371094 -4.410156 -4.5 -4.941406 -4.5 C -5.460938 -4.5 -5.878906 -4.371094 -6.179688 -4.109375 C -6.480469 -3.851562 -6.640625 -3.5 -6.640625 -3.058594 C -6.640625 -2.621094 -6.480469 -2.269531 -6.179688 -2.011719 C -5.878906 -1.75 -5.460938 -1.621094 -4.941406 -1.621094 C -4.410156 -1.621094 -3.988281 -1.75 -3.691406 -2.011719 C -3.390625 -2.269531 -3.238281 -2.621094 -3.238281 -3.058594 "/>
</symbol>
<symbol overflow="visible" id="glyph1-0">
<path style="stroke:none;" d="M -3.421875 6.320312 L -2.078125 2.691406 L -4.761719 2.691406 L -3.421875 6.320312 M -2.859375 7.289062 L -3.980469 7.289062 L -6.761719 0 L -5.730469 0 L -5.070312 1.871094 L -1.78125 1.871094 L -1.121094 0 L -0.078125 0 L -2.859375 7.289062 "/>
</symbol>
<symbol overflow="visible" id="glyph1-1">
<path style="stroke:none;" d="M -4.539062 2.800781 C -4.539062 3.441406 -4.398438 3.949219 -4.140625 4.308594 C -3.871094 4.671875 -3.488281 4.851562 -3.011719 4.851562 C -2.53125 4.851562 -2.148438 4.671875 -1.878906 4.308594 C -1.609375 3.949219 -1.480469 3.441406 -1.480469 2.800781 C -1.480469 2.148438 -1.609375 1.648438 -1.878906 1.289062 C -2.148438 0.929688 -2.53125 0.75 -3.011719 0.75 C -3.488281 0.75 -3.871094 0.929688 -4.140625 1.289062 C -4.398438 1.648438 -4.539062 2.148438 -4.539062 2.800781 M -5.441406 0.679688 C -5.441406 -0.238281 -5.230469 -0.929688 -4.820312 -1.390625 C -4.398438 -1.839844 -3.769531 -2.070312 -2.921875 -2.070312 C -2.601562 -2.070312 -2.308594 -2.039062 -2.03125 -2 C -1.75 -1.949219 -1.46875 -1.878906 -1.210938 -1.78125 L -1.210938 -0.910156 C -1.46875 -1.050781 -1.730469 -1.148438 -1.988281 -1.21875 C -2.25 -1.289062 -2.511719 -1.328125 -2.78125 -1.328125 C -3.359375 -1.328125 -3.800781 -1.171875 -4.101562 -0.871094 C -4.390625 -0.558594 -4.539062 -0.101562 -4.539062 0.519531 L -4.539062 0.960938 C -4.351562 0.640625 -4.109375 0.398438 -3.820312 0.238281 C -3.53125 0.078125 -3.191406 0 -2.789062 0 C -2.109375 0 -1.570312 0.25 -1.160156 0.761719 C -0.75 1.269531 -0.550781 1.949219 -0.550781 2.800781 C -0.550781 3.640625 -0.75 4.320312 -1.160156 4.828125 C -1.570312 5.339844 -2.109375 5.601562 -2.789062 5.601562 C -3.191406 5.601562 -3.53125 5.519531 -3.820312 5.359375 C -4.109375 5.199219 -4.351562 4.960938 -4.539062 4.640625 L -4.539062 5.46875 L -5.441406 5.46875 L -5.441406 0.679688 "/>
</symbol>
<symbol overflow="visible" id="glyph1-2">
<path style="stroke:none;" d="M -5.621094 2.960938 L -5.621094 2.519531 L -1.488281 2.519531 C -1.53125 1.898438 -1.710938 1.421875 -2.050781 1.101562 C -2.378906 0.78125 -2.839844 0.621094 -3.441406 0.621094 C -3.78125 0.621094 -4.121094 0.660156 -4.441406 0.738281 C -4.761719 0.820312 -5.089844 0.949219 -5.410156 1.128906 L -5.410156 0.28125 C -5.089844 0.140625 -4.761719 0.03125 -4.421875 -0.03125 C -4.078125 -0.0898438 -3.730469 -0.128906 -3.390625 -0.128906 C -2.511719 -0.128906 -1.820312 0.121094 -1.308594 0.621094 C -0.800781 1.121094 -0.550781 1.808594 -0.550781 2.679688 C -0.550781 3.570312 -0.789062 4.28125 -1.269531 4.808594 C -1.75 5.328125 -2.410156 5.601562 -3.230469 5.601562 C -3.96875 5.601562 -4.550781 5.359375 -4.980469 4.890625 C -5.398438 4.410156 -5.621094 3.769531 -5.621094 2.960938 M -4.71875 3.21875 C -4.710938 3.710938 -4.570312 4.101562 -4.308594 4.398438 C -4.039062 4.691406 -3.679688 4.839844 -3.238281 4.839844 C -2.738281 4.839844 -2.339844 4.691406 -2.039062 4.410156 C -1.738281 4.128906 -1.558594 3.730469 -1.519531 3.21875 L -4.71875 3.21875 "/>
</symbol>
<symbol overflow="visible" id="glyph1-3">
<path style="stroke:none;" d=""/>
</symbol>
<symbol overflow="visible" id="glyph1-4">
<path style="stroke:none;" d="M -1.96875 6.480469 L -1.96875 0.808594 L -3.160156 0.808594 C -4.160156 0.808594 -4.898438 1.03125 -5.371094 1.488281 C -5.828125 1.949219 -6.070312 2.671875 -6.070312 3.648438 C -6.070312 4.628906 -5.828125 5.339844 -5.371094 5.800781 C -4.898438 6.25 -4.160156 6.480469 -3.160156 6.480469 L -1.96875 6.480469 M -0.980469 7.289062 L -3.011719 7.289062 C -4.421875 7.289062 -5.460938 6.988281 -6.121094 6.410156 C -6.78125 5.820312 -7.109375 4.898438 -7.109375 3.648438 C -7.109375 2.390625 -6.769531 1.46875 -6.109375 0.878906 C -5.449219 0.289062 -4.410156 0 -3.011719 0 L -0.980469 0 L -0.980469 7.289062 "/>
</symbol>
<symbol overflow="visible" id="glyph1-5">
<path style="stroke:none;" d="M -0.941406 5.46875 L -1.839844 5.46875 L -1.839844 0 L -0.941406 0 L -0.941406 5.46875 M -0.941406 7.601562 L -1.839844 7.601562 L -1.839844 6.460938 L -0.941406 6.460938 L -0.941406 7.601562 "/>
</symbol>
<symbol overflow="visible" id="glyph1-6">
<path style="stroke:none;" d="M -4.429688 5.308594 L -4.429688 4.460938 C -4.171875 4.578125 -3.910156 4.679688 -3.640625 4.75 C -3.359375 4.808594 -3.078125 4.851562 -2.789062 4.851562 C -2.339844 4.851562 -2 4.78125 -1.78125 4.640625 C -1.558594 4.5 -1.449219 4.300781 -1.449219 4.03125 C -1.449219 3.820312 -1.53125 3.660156 -1.691406 3.539062 C -1.851562 3.421875 -2.171875 3.300781 -2.648438 3.199219 L -2.960938 3.128906 C -3.601562 2.988281 -4.050781 2.789062 -4.320312 2.550781 C -4.578125 2.300781 -4.71875 1.949219 -4.71875 1.511719 C -4.71875 1 -4.519531 0.601562 -4.121094 0.308594 C -3.71875 0.0117188 -3.160156 -0.128906 -2.460938 -0.128906 C -2.160156 -0.128906 -1.859375 -0.101562 -1.539062 -0.0507812 C -1.21875 0 -0.890625 0.078125 -0.539062 0.199219 L -0.539062 1.128906 C -0.871094 0.949219 -1.199219 0.820312 -1.519531 0.738281 C -1.839844 0.648438 -2.160156 0.609375 -2.480469 0.609375 C -2.898438 0.609375 -3.230469 0.679688 -3.460938 0.820312 C -3.679688 0.960938 -3.800781 1.171875 -3.800781 1.441406 C -3.800781 1.679688 -3.710938 1.871094 -3.550781 2 C -3.390625 2.128906 -3.03125 2.261719 -2.46875 2.378906 L -2.160156 2.449219 C -1.601562 2.570312 -1.191406 2.75 -0.949219 2.988281 C -0.699219 3.230469 -0.578125 3.558594 -0.578125 3.988281 C -0.578125 4.5 -0.761719 4.898438 -1.121094 5.179688 C -1.480469 5.460938 -2 5.601562 -2.679688 5.601562 C -3.011719 5.601562 -3.320312 5.570312 -3.621094 5.519531 C -3.910156 5.46875 -4.179688 5.398438 -4.429688 5.308594 "/>
</symbol>
<symbol overflow="visible" id="glyph1-7">
<path style="stroke:none;" d="M -1.828125 7.019531 L -1.828125 5.46875 L -3.679688 5.46875 L -3.679688 4.769531 L -1.828125 4.769531 L -1.828125 1.800781 C -1.828125 1.351562 -1.890625 1.058594 -2.011719 0.941406 C -2.128906 0.808594 -2.378906 0.75 -2.761719 0.75 L -3.679688 0.75 L -3.679688 0 L -2.761719 0 C -2.058594 0 -1.578125 0.128906 -1.320312 0.390625 C -1.058594 0.648438 -0.929688 1.121094 -0.929688 1.800781 L -0.929688 4.769531 L -0.269531 4.769531 L -0.269531 5.46875 L -0.929688 5.46875 L -0.929688 7.019531 L -1.828125 7.019531 "/>
</symbol>
<symbol overflow="visible" id="glyph1-8">
<path style="stroke:none;" d="M -4.109375 4.628906 C -4.011719 4.691406 -3.898438 4.730469 -3.78125 4.761719 C -3.660156 4.78125 -3.53125 4.800781 -3.390625 4.800781 C -2.878906 4.800781 -2.488281 4.628906 -2.21875 4.300781 C -1.941406 3.96875 -1.808594 3.5 -1.808594 2.878906 L -1.808594 0 L -0.910156 0 L -0.910156 5.46875 L -1.808594 5.46875 L -1.808594 4.621094 C -1.988281 4.949219 -2.238281 5.199219 -2.539062 5.359375 C -2.839844 5.519531 -3.210938 5.601562 -3.648438 5.601562 C -3.710938 5.601562 -3.78125 5.589844 -3.859375 5.589844 C -3.929688 5.578125 -4.011719 5.570312 -4.109375 5.550781 L -4.109375 4.628906 "/>
</symbol>
<symbol overflow="visible" id="glyph1-9">
<path style="stroke:none;" d="M -4.871094 2.730469 C -4.871094 3.390625 -4.730469 3.898438 -4.460938 4.28125 C -4.179688 4.660156 -3.808594 4.851562 -3.339844 4.851562 C -2.859375 4.851562 -2.488281 4.660156 -2.21875 4.28125 C -1.941406 3.898438 -1.808594 3.390625 -1.808594 2.730469 C -1.808594 2.070312 -1.941406 1.550781 -2.21875 1.171875 C -2.488281 0.789062 -2.859375 0.609375 -3.339844 0.609375 C -3.808594 0.609375 -4.179688 0.789062 -4.460938 1.171875 C -4.730469 1.550781 -4.871094 2.070312 -4.871094 2.730469 M -1.808594 4.640625 C -1.988281 4.960938 -2.230469 5.199219 -2.519531 5.359375 C -2.808594 5.519531 -3.160156 5.601562 -3.558594 5.601562 C -4.21875 5.601562 -4.761719 5.328125 -5.179688 4.808594 C -5.589844 4.28125 -5.800781 3.589844 -5.800781 2.730469 C -5.800781 1.871094 -5.589844 1.171875 -5.179688 0.648438 C -4.761719 0.128906 -4.21875 -0.128906 -3.558594 -0.128906 C -3.160156 -0.128906 -2.808594 -0.0507812 -2.519531 0.101562 C -2.230469 0.25 -1.988281 0.488281 -1.808594 0.820312 L -1.808594 0 L -0.910156 0 L -0.910156 7.601562 L -1.808594 7.601562 L -1.808594 4.640625 "/>
</symbol>
<symbol overflow="visible" id="glyph1-10">
<path style="stroke:none;" d="M -0.851562 2.160156 L -0.851562 5.46875 L -1.75 5.46875 L -1.75 2.191406 C -1.75 1.671875 -1.851562 1.289062 -2.050781 1.03125 C -2.25 0.769531 -2.550781 0.640625 -2.960938 0.640625 C -3.441406 0.640625 -3.828125 0.789062 -4.109375 1.101562 C -4.390625 1.410156 -4.53125 1.828125 -4.53125 2.371094 L -4.53125 5.46875 L -5.429688 5.46875 L -5.429688 0 L -4.53125 0 L -4.53125 0.839844 C -4.308594 0.5 -4.050781 0.261719 -3.769531 0.101562 C -3.480469 -0.0507812 -3.148438 -0.128906 -2.769531 -0.128906 C -2.140625 -0.128906 -1.660156 0.0585938 -1.339844 0.449219 C -1.011719 0.828125 -0.851562 1.398438 -0.851562 2.160156 M -3.109375 5.601562 L -3.109375 5.601562 "/>
</symbol>
<symbol overflow="visible" id="glyph1-11">
<path style="stroke:none;" d="M -3.058594 4.839844 C -2.578125 4.839844 -2.199219 4.648438 -1.921875 4.269531 C -1.640625 3.890625 -1.5 3.378906 -1.5 2.730469 C -1.5 2.070312 -1.628906 1.558594 -1.910156 1.179688 C -2.191406 0.800781 -2.570312 0.621094 -3.058594 0.621094 C -3.539062 0.621094 -3.921875 0.800781 -4.199219 1.179688 C -4.480469 1.558594 -4.621094 2.070312 -4.621094 2.730469 C -4.621094 3.371094 -4.480469 3.890625 -4.199219 4.269531 C -3.921875 4.648438 -3.539062 4.839844 -3.058594 4.839844 M -3.058594 5.601562 C -3.839844 5.601562 -4.449219 5.339844 -4.898438 4.839844 C -5.339844 4.328125 -5.570312 3.628906 -5.570312 2.730469 C -5.570312 1.828125 -5.339844 1.128906 -4.898438 0.628906 C -4.449219 0.121094 -3.839844 -0.128906 -3.058594 -0.128906 C -2.269531 -0.128906 -1.648438 0.121094 -1.210938 0.628906 C -0.769531 1.128906 -0.550781 1.828125 -0.550781 2.730469 C -0.550781 3.628906 -0.769531 4.328125 -1.210938 4.839844 C -1.648438 5.339844 -2.269531 5.601562 -3.058594 5.601562 "/>
</symbol>
<symbol overflow="visible" id="glyph1-12">
<path style="stroke:none;" d="M -5.488281 3.300781 L -5.488281 0 L -4.589844 0 L -4.589844 3.269531 C -4.589844 3.789062 -4.480469 4.171875 -4.28125 4.429688 C -4.078125 4.691406 -3.78125 4.820312 -3.378906 4.820312 C -2.890625 4.820312 -2.511719 4.660156 -2.230469 4.351562 C -1.949219 4.039062 -1.808594 3.621094 -1.808594 3.089844 L -1.808594 0 L -0.910156 0 L -0.910156 5.46875 L -1.808594 5.46875 L -1.808594 4.621094 C -2.019531 4.941406 -2.269531 5.191406 -2.570312 5.351562 C -2.859375 5.511719 -3.199219 5.601562 -3.578125 5.601562 C -4.199219 5.601562 -4.679688 5.398438 -5 5.011719 C -5.320312 4.621094 -5.488281 4.050781 -5.488281 3.300781 "/>
</symbol>
<symbol overflow="visible" id="glyph2-0">
<path style="stroke:none;" d="M -7.777344 -2.363281 L -4.488281 -2.363281 L -4.488281 -3.851562 C -4.488281 -4.402344 -4.621094 -4.824219 -4.90625 -5.125 C -5.195312 -5.425781 -5.605469 -5.578125 -6.132812 -5.578125 C -6.660156 -5.578125 -7.054688 -5.425781 -7.34375 -5.125 C -7.632812 -4.824219 -7.777344 -4.402344 -7.777344 -3.851562 L -7.777344 -2.363281 M -8.746094 -1.175781 L -8.746094 -3.851562 C -8.746094 -4.824219 -8.519531 -5.566406 -8.074219 -6.070312 C -7.632812 -6.574219 -6.984375 -6.828125 -6.132812 -6.828125 C -5.269531 -6.828125 -4.609375 -6.574219 -4.175781 -6.070312 C -3.730469 -5.566406 -3.515625 -4.824219 -3.515625 -3.851562 L -3.515625 -2.363281 L 0 -2.363281 L 0 -1.175781 L -8.746094 -1.175781 "/>
</symbol>
<symbol overflow="visible" id="glyph2-1">
<path style="stroke:none;" d="M -3.300781 -4.117188 C -3.300781 -3.238281 -3.191406 -2.640625 -3 -2.304688 C -2.796875 -1.96875 -2.460938 -1.800781 -1.980469 -1.800781 C -1.597656 -1.800781 -1.285156 -1.921875 -1.066406 -2.171875 C -0.839844 -2.425781 -0.730469 -2.773438 -0.730469 -3.203125 C -0.730469 -3.804688 -0.9375 -4.285156 -1.367188 -4.644531 C -1.789062 -5.003906 -2.351562 -5.183594 -3.058594 -5.183594 L -3.300781 -5.183594 L -3.300781 -4.117188 M -3.742188 -6.265625 L 0 -6.265625 L 0 -5.183594 L -0.996094 -5.183594 C -0.589844 -4.933594 -0.300781 -4.621094 -0.121094 -4.261719 C 0.0585938 -3.898438 0.15625 -3.445312 0.15625 -2.914062 C 0.15625 -2.242188 -0.0234375 -1.703125 -0.394531 -1.308594 C -0.769531 -0.910156 -1.273438 -0.71875 -1.90625 -0.71875 C -2.640625 -0.71875 -3.191406 -0.960938 -3.574219 -1.464844 C -3.949219 -1.957031 -4.140625 -2.6875 -4.140625 -3.671875 L -4.140625 -5.183594 L -4.246094 -5.183594 C -4.738281 -5.183594 -5.125 -5.015625 -5.398438 -4.691406 C -5.664062 -4.367188 -5.808594 -3.910156 -5.808594 -3.324219 C -5.808594 -2.941406 -5.761719 -2.578125 -5.664062 -2.21875 C -5.566406 -1.859375 -5.4375 -1.523438 -5.269531 -1.199219 L -6.265625 -1.199219 C -6.40625 -1.585938 -6.527344 -1.96875 -6.601562 -2.339844 C -6.671875 -2.710938 -6.71875 -3.070312 -6.71875 -3.433594 C -6.71875 -4.378906 -6.46875 -5.089844 -5.976562 -5.554688 C -5.484375 -6.023438 -4.738281 -6.265625 -3.742188 -6.265625 "/>
</symbol>
<symbol overflow="visible" id="glyph2-2">
<path style="stroke:none;" d="M -5.554688 -4.933594 C -5.628906 -4.8125 -5.675781 -4.679688 -5.710938 -4.535156 C -5.734375 -4.390625 -5.761719 -4.234375 -5.761719 -4.066406 C -5.761719 -3.457031 -5.554688 -2.988281 -5.160156 -2.664062 C -4.765625 -2.328125 -4.199219 -2.171875 -3.457031 -2.171875 L 0 -2.171875 L 0 -1.09375 L -6.5625 -1.09375 L -6.5625 -2.171875 L -5.542969 -2.171875 C -5.941406 -2.386719 -6.238281 -2.6875 -6.433594 -3.046875 C -6.625 -3.40625 -6.71875 -3.851562 -6.71875 -4.378906 C -6.71875 -4.453125 -6.707031 -4.535156 -6.707031 -4.632812 C -6.695312 -4.714844 -6.683594 -4.8125 -6.660156 -4.933594 L -5.554688 -4.933594 "/>
</symbol>
<symbol overflow="visible" id="glyph2-3">
<path style="stroke:none;" d="M -8.425781 -2.195312 L -6.5625 -2.195312 L -6.5625 -4.414062 L -5.722656 -4.414062 L -5.722656 -2.195312 L -2.160156 -2.195312 C -1.621094 -2.195312 -1.273438 -2.269531 -1.128906 -2.410156 C -0.972656 -2.554688 -0.898438 -2.855469 -0.898438 -3.3125 L -0.898438 -4.414062 L 0 -4.414062 L 0 -3.3125 C 0 -2.472656 -0.15625 -1.894531 -0.46875 -1.585938 C -0.78125 -1.273438 -1.34375 -1.117188 -2.160156 -1.117188 L -5.722656 -1.117188 L -5.722656 -0.324219 L -6.5625 -0.324219 L -6.5625 -1.117188 L -8.425781 -1.117188 L -8.425781 -2.195312 "/>
</symbol>
<symbol overflow="visible" id="glyph2-4">
<path style="stroke:none;" d="M -6.5625 -1.128906 L -6.5625 -2.207031 L 0 -2.207031 L 0 -1.128906 L -6.5625 -1.128906 M -9.121094 -1.128906 L -9.121094 -2.207031 L -7.753906 -2.207031 L -7.753906 -1.128906 L -9.121094 -1.128906 "/>
</symbol>
<symbol overflow="visible" id="glyph2-5">
<path style="stroke:none;" d="M -6.3125 -5.855469 L -5.304688 -5.855469 C -5.472656 -5.542969 -5.59375 -5.242188 -5.675781 -4.933594 C -5.761719 -4.621094 -5.808594 -4.320312 -5.808594 -4.007812 C -5.808594 -3.3125 -5.578125 -2.761719 -5.136719 -2.375 C -4.691406 -1.992188 -4.066406 -1.800781 -3.277344 -1.800781 C -2.472656 -1.800781 -1.847656 -1.992188 -1.402344 -2.375 C -0.960938 -2.761719 -0.742188 -3.3125 -0.742188 -4.007812 C -0.742188 -4.320312 -0.78125 -4.621094 -0.863281 -4.933594 C -0.949219 -5.242188 -1.078125 -5.542969 -1.246094 -5.855469 L -0.253906 -5.855469 C -0.109375 -5.542969 0 -5.230469 0.0585938 -4.921875 C 0.121094 -4.597656 0.15625 -4.246094 0.15625 -3.886719 C 0.15625 -2.902344 -0.144531 -2.113281 -0.769531 -1.535156 C -1.378906 -0.949219 -2.21875 -0.660156 -3.277344 -0.660156 C -4.34375 -0.660156 -5.183594 -0.949219 -5.796875 -1.535156 C -6.40625 -2.125 -6.71875 -2.929688 -6.71875 -3.960938 C -6.71875 -4.296875 -6.683594 -4.621094 -6.613281 -4.933594 C -6.539062 -5.242188 -6.445312 -5.554688 -6.3125 -5.855469 "/>
</symbol>
<symbol overflow="visible" id="glyph2-6">
<path style="stroke:none;" d="M -0.984375 -2.171875 L 2.484375 -2.171875 L 2.484375 -1.09375 L -6.5625 -1.09375 L -6.5625 -2.171875 L -5.566406 -2.171875 C -5.953125 -2.386719 -6.238281 -2.675781 -6.433594 -3.023438 C -6.625 -3.371094 -6.71875 -3.792969 -6.71875 -4.273438 C -6.71875 -5.0625 -6.394531 -5.710938 -5.773438 -6.214844 C -5.136719 -6.707031 -4.308594 -6.960938 -3.277344 -6.960938 C -2.242188 -6.960938 -1.402344 -6.707031 -0.78125 -6.214844 C -0.15625 -5.710938 0.15625 -5.0625 0.15625 -4.273438 C 0.15625 -3.792969 0.0585938 -3.371094 -0.121094 -3.023438 C -0.300781 -2.675781 -0.589844 -2.386719 -0.984375 -2.171875 M -3.277344 -5.84375 C -4.066406 -5.84375 -4.679688 -5.675781 -5.136719 -5.351562 C -5.59375 -5.015625 -5.820312 -4.570312 -5.820312 -4.007812 C -5.820312 -3.433594 -5.59375 -2.988281 -5.136719 -2.664062 C -4.679688 -2.328125 -4.066406 -2.171875 -3.277344 -2.171875 C -2.484375 -2.171875 -1.859375 -2.328125 -1.402344 -2.664062 C -0.949219 -2.988281 -0.730469 -3.433594 -0.730469 -4.007812 C -0.730469 -4.570312 -0.949219 -5.015625 -1.402344 -5.351562 C -1.859375 -5.675781 -2.484375 -5.84375 -3.277344 -5.84375 "/>
</symbol>
<symbol overflow="visible" id="glyph2-7">
<path style="stroke:none;" d="M -3.960938 -6.589844 L 0 -6.589844 L 0 -5.507812 L -3.925781 -5.507812 C -4.546875 -5.507812 -5.003906 -5.375 -5.316406 -5.136719 C -5.628906 -4.894531 -5.785156 -4.535156 -5.785156 -4.054688 C -5.785156 -3.46875 -5.59375 -3.011719 -5.21875 -2.675781 C -4.847656 -2.339844 -4.34375 -2.171875 -3.707031 -2.171875 L 0 -2.171875 L 0 -1.09375 L -6.5625 -1.09375 L -6.5625 -2.171875 L -5.542969 -2.171875 C -5.929688 -2.425781 -6.226562 -2.722656 -6.421875 -3.085938 C -6.613281 -3.433594 -6.71875 -3.839844 -6.71875 -4.296875 C -6.71875 -5.039062 -6.480469 -5.617188 -6.011719 -6 C -5.542969 -6.382812 -4.859375 -6.589844 -3.960938 -6.589844 "/>
</symbol>
<symbol overflow="visible" id="glyph2-8">
<path style="stroke:none;" d="M -6.371094 -5.316406 L -5.351562 -5.316406 C -5.496094 -5.003906 -5.617188 -4.691406 -5.699219 -4.367188 C -5.773438 -4.03125 -5.820312 -3.695312 -5.820312 -3.347656 C -5.820312 -2.808594 -5.734375 -2.398438 -5.566406 -2.136719 C -5.398438 -1.871094 -5.160156 -1.738281 -4.835938 -1.738281 C -4.585938 -1.738281 -4.390625 -1.835938 -4.246094 -2.027344 C -4.105469 -2.21875 -3.960938 -2.605469 -3.839844 -3.179688 L -3.757812 -3.550781 C -3.589844 -4.320312 -3.347656 -4.859375 -3.058594 -5.183594 C -2.761719 -5.496094 -2.339844 -5.664062 -1.8125 -5.664062 C -1.199219 -5.664062 -0.71875 -5.425781 -0.371094 -4.945312 C -0.0117188 -4.464844 0.15625 -3.792969 0.15625 -2.953125 C 0.15625 -2.59375 0.121094 -2.230469 0.0585938 -1.847656 C 0 -1.464844 -0.0976562 -1.066406 -0.238281 -0.648438 L -1.355469 -0.648438 C -1.140625 -1.042969 -0.984375 -1.441406 -0.886719 -1.824219 C -0.78125 -2.207031 -0.730469 -2.59375 -0.730469 -2.976562 C -0.730469 -3.480469 -0.816406 -3.875 -0.984375 -4.152344 C -1.152344 -4.414062 -1.402344 -4.558594 -1.726562 -4.558594 C -2.015625 -4.558594 -2.242188 -4.453125 -2.398438 -4.261719 C -2.554688 -4.066406 -2.710938 -3.636719 -2.855469 -2.964844 L -2.941406 -2.59375 C -3.085938 -1.921875 -3.300781 -1.429688 -3.589844 -1.140625 C -3.875 -0.839844 -4.273438 -0.695312 -4.789062 -0.695312 C -5.398438 -0.695312 -5.878906 -0.910156 -6.214844 -1.34375 C -6.550781 -1.777344 -6.71875 -2.398438 -6.71875 -3.214844 C -6.71875 -3.613281 -6.683594 -3.984375 -6.625 -4.34375 C -6.5625 -4.691406 -6.480469 -5.015625 -6.371094 -5.316406 "/>
</symbol>
<symbol overflow="visible" id="glyph2-9">
<path style="stroke:none;" d=""/>
</symbol>
<symbol overflow="visible" id="glyph2-10">
<path style="stroke:none;" d="M -1.246094 -7.140625 L -3.601562 -7.140625 L -3.601562 -5.207031 L -4.570312 -5.207031 L -4.570312 -8.316406 L -0.816406 -8.316406 C -0.480469 -7.859375 -0.238281 -7.355469 -0.0859375 -6.804688 C 0.0703125 -6.253906 0.15625 -5.664062 0.15625 -5.039062 C 0.15625 -3.671875 -0.238281 -2.59375 -1.03125 -1.824219 C -1.824219 -1.054688 -2.941406 -0.671875 -4.367188 -0.671875 C -5.785156 -0.671875 -6.898438 -1.054688 -7.703125 -1.824219 C -8.496094 -2.59375 -8.902344 -3.671875 -8.902344 -5.039062 C -8.902344 -5.605469 -8.832031 -6.144531 -8.6875 -6.660156 C -8.542969 -7.175781 -8.339844 -7.65625 -8.074219 -8.089844 L -6.816406 -8.089844 C -7.175781 -7.644531 -7.453125 -7.175781 -7.644531 -6.683594 C -7.835938 -6.191406 -7.933594 -5.675781 -7.933594 -5.136719 C -7.933594 -4.054688 -7.632812 -3.253906 -7.03125 -2.722656 C -6.433594 -2.183594 -5.542969 -1.921875 -4.367188 -1.921875 C -3.179688 -1.921875 -2.292969 -2.183594 -1.691406 -2.722656 C -1.09375 -3.253906 -0.804688 -4.054688 -0.804688 -5.136719 C -0.804688 -5.542969 -0.839844 -5.914062 -0.910156 -6.253906 C -0.984375 -6.589844 -1.09375 -6.875 -1.246094 -7.140625 "/>
</symbol>
<symbol overflow="visible" id="glyph2-11">
<path style="stroke:none;" d="M -3.550781 -6.742188 L -3.023438 -6.742188 L -3.023438 -1.789062 C -2.28125 -1.835938 -1.703125 -2.050781 -1.320312 -2.460938 C -0.9375 -2.855469 -0.742188 -3.40625 -0.742188 -4.128906 C -0.742188 -4.535156 -0.792969 -4.945312 -0.886719 -5.328125 C -0.984375 -5.710938 -1.140625 -6.109375 -1.355469 -6.492188 L -0.335938 -6.492188 C -0.167969 -6.109375 -0.0351562 -5.710938 0.0351562 -5.304688 C 0.109375 -4.894531 0.15625 -4.476562 0.15625 -4.066406 C 0.15625 -3.011719 -0.144531 -2.183594 -0.742188 -1.570312 C -1.34375 -0.960938 -2.171875 -0.660156 -3.214844 -0.660156 C -4.285156 -0.660156 -5.136719 -0.949219 -5.773438 -1.523438 C -6.394531 -2.101562 -6.71875 -2.890625 -6.71875 -3.875 C -6.71875 -4.765625 -6.433594 -5.460938 -5.867188 -5.976562 C -5.292969 -6.480469 -4.523438 -6.742188 -3.550781 -6.742188 M -3.863281 -5.664062 C -4.453125 -5.652344 -4.921875 -5.484375 -5.28125 -5.171875 C -5.628906 -4.847656 -5.808594 -4.414062 -5.808594 -3.886719 C -5.808594 -3.289062 -5.628906 -2.808594 -5.292969 -2.449219 C -4.957031 -2.089844 -4.476562 -1.871094 -3.863281 -1.824219 L -3.863281 -5.664062 "/>
</symbol>
<symbol overflow="visible" id="glyph2-12">
<path style="stroke:none;" d="M -5.566406 -5.449219 L -9.121094 -5.449219 L -9.121094 -6.527344 L 0 -6.527344 L 0 -5.449219 L -0.984375 -5.449219 C -0.589844 -5.21875 -0.300781 -4.933594 -0.121094 -4.585938 C 0.0585938 -4.234375 0.15625 -3.828125 0.15625 -3.347656 C 0.15625 -2.554688 -0.15625 -1.90625 -0.78125 -1.402344 C -1.402344 -0.898438 -2.242188 -0.660156 -3.277344 -0.660156 C -4.308594 -0.660156 -5.136719 -0.898438 -5.773438 -1.402344 C -6.394531 -1.90625 -6.71875 -2.554688 -6.71875 -3.347656 C -6.71875 -3.828125 -6.625 -4.234375 -6.433594 -4.585938 C -6.238281 -4.933594 -5.953125 -5.21875 -5.566406 -5.449219 M -3.277344 -1.777344 C -2.484375 -1.777344 -1.859375 -1.933594 -1.402344 -2.257812 C -0.949219 -2.578125 -0.730469 -3.035156 -0.730469 -3.613281 C -0.730469 -4.175781 -0.949219 -4.621094 -1.402344 -4.957031 C -1.859375 -5.28125 -2.484375 -5.449219 -3.277344 -5.449219 C -4.066406 -5.449219 -4.679688 -5.28125 -5.136719 -4.957031 C -5.59375 -4.621094 -5.820312 -4.175781 -5.820312 -3.613281 C -5.820312 -3.035156 -5.59375 -2.578125 -5.136719 -2.257812 C -4.679688 -1.933594 -4.066406 -1.777344 -3.277344 -1.777344 "/>
</symbol>
<symbol overflow="visible" id="glyph2-13">
<path style="stroke:none;" d="M -7.523438 -5.519531 L -4.261719 -5.519531 L -4.261719 -8.785156 L -3.265625 -8.785156 L -3.265625 -5.519531 L 0 -5.519531 L 0 -4.535156 L -3.265625 -4.535156 L -3.265625 -1.273438 L -4.261719 -1.273438 L -4.261719 -4.535156 L -7.523438 -4.535156 L -7.523438 -5.519531 "/>
</symbol>
<symbol overflow="visible" id="glyph2-14">
<path style="stroke:none;" d="M -7.585938 -4.105469 L -3.226562 -2.496094 L -3.226562 -5.710938 L -7.585938 -4.105469 M -8.746094 -3.433594 L -8.746094 -4.777344 L 0 -8.113281 L 0 -6.875 L -2.242188 -6.085938 L -2.242188 -2.136719 L 0 -1.34375 L 0 -0.0976562 L -8.746094 -3.433594 "/>
</symbol>
<symbol overflow="visible" id="glyph2-15">
<path style="stroke:none;" d="M -3.359375 -5.449219 C -4.128906 -5.449219 -4.738281 -5.28125 -5.171875 -4.96875 C -5.605469 -4.644531 -5.820312 -4.1875 -5.820312 -3.613281 C -5.820312 -3.035156 -5.605469 -2.578125 -5.171875 -2.257812 C -4.738281 -1.933594 -4.128906 -1.777344 -3.359375 -1.777344 C -2.578125 -1.777344 -1.980469 -1.933594 -1.546875 -2.257812 C -1.117188 -2.578125 -0.898438 -3.035156 -0.898438 -3.613281 C -0.898438 -4.1875 -1.117188 -4.644531 -1.546875 -4.96875 C -1.980469 -5.28125 -2.578125 -5.449219 -3.359375 -5.449219 M -0.816406 -6.527344 C 0.289062 -6.527344 1.117188 -6.277344 1.667969 -5.785156 C 2.207031 -5.28125 2.484375 -4.523438 2.484375 -3.503906 C 2.484375 -3.121094 2.449219 -2.773438 2.398438 -2.4375 C 2.339844 -2.101562 2.257812 -1.765625 2.136719 -1.453125 L 1.09375 -1.453125 C 1.261719 -1.765625 1.378906 -2.074219 1.464844 -2.386719 C 1.546875 -2.699219 1.597656 -3.011719 1.597656 -3.335938 C 1.597656 -4.03125 1.402344 -4.558594 1.042969 -4.921875 C 0.671875 -5.269531 0.121094 -5.449219 -0.625 -5.449219 L -1.152344 -5.449219 C -0.769531 -5.21875 -0.480469 -4.933594 -0.289062 -4.585938 C -0.0976562 -4.234375 0 -3.828125 0 -3.347656 C 0 -2.53125 -0.300781 -1.882812 -0.910156 -1.390625 C -1.523438 -0.898438 -2.339844 -0.660156 -3.359375 -0.660156 C -4.367188 -0.660156 -5.183594 -0.898438 -5.796875 -1.390625 C -6.40625 -1.882812 -6.71875 -2.53125 -6.71875 -3.347656 C -6.71875 -3.828125 -6.625 -4.234375 -6.433594 -4.585938 C -6.238281 -4.933594 -5.953125 -5.21875 -5.566406 -5.449219 L -6.5625 -5.449219 L -6.5625 -6.527344 L -0.816406 -6.527344 "/>
</symbol>
</g>
<clipPath id="clip1">
  <path d="M 124.835938 190.542969 L 470.4375 190.542969 L 470.4375 651.34375 L 124.835938 651.34375 Z M 124.835938 190.542969 "/>
</clipPath>
<clipPath id="clip2">
  <path d="M 396 512 L 432.421875 512 L 432.421875 578 L 396 578 Z M 396 512 "/>
</clipPath>
<clipPath id="clip3">
  <path d="M 360 426 L 432.421875 426 L 432.421875 491 L 360 491 Z M 360 426 "/>
</clipPath>
<clipPath id="clip4">
  <path d="M 347 339 L 432.421875 339 L 432.421875 405 L 347 405 Z M 347 339 "/>
</clipPath>
<clipPath id="clip5">
  <path d="M 360 252 L 432.421875 252 L 432.421875 318 L 360 318 Z M 360 252 "/>
</clipPath>
</defs>
<g id="surface4170">
<g clip-path="url(#clip1)" clip-rule="nonzero">
<path style=" stroke:none;fill-rule:nonzero;fill:rgb(100%,100%,100%);fill-opacity:1;" d="M 470.4375 651.34375 L 470.4375 190.542969 L 124.835938 190.542969 L 124.835938 651.34375 Z M 470.4375 651.34375 "/>
</g>
<path style=" stroke:none;fill-rule:nonzero;fill:rgb(100%,100%,100%);fill-opacity:1;" d="M 432.421875 593.746094 L 432.421875 236.625 L 166.308594 236.625 L 166.308594 593.746094 Z M 432.421875 593.746094 "/>
<g clip-path="url(#clip2)" clip-rule="nonzero">
<path style=" stroke:none;fill-rule:nonzero;fill:rgb(68.127441%,74.249268%,54.089355%);fill-opacity:1;" d="M 432.421875 577.511719 L 432.421875 512.582031 L 396.214844 512.582031 L 396.214844 577.511719 Z M 432.421875 577.511719 "/>
</g>
<g clip-path="url(#clip3)" clip-rule="nonzero">
<path style=" stroke:none;fill-rule:nonzero;fill:rgb(68.127441%,74.249268%,54.089355%);fill-opacity:1;" d="M 432.421875 490.9375 L 432.421875 426.007812 L 360.011719 426.007812 L 360.011719 490.9375 Z M 432.421875 490.9375 "/>
</g>
<g clip-path="url(#clip4)" clip-rule="nonzero">
<path style=" stroke:none;fill-rule:nonzero;fill:rgb(68.127441%,74.249268%,54.089355%);fill-opacity:1;" d="M 432.421875 404.363281 L 432.421875 339.433594 L 347.941406 339.433594 L 347.941406 404.363281 Z M 432.421875 404.363281 "/>
</g>
<g clip-path="url(#clip5)" clip-rule="nonzero">
<path style=" stroke:none;fill-rule:nonzero;fill:rgb(68.127441%,74.249268%,54.089355%);fill-opacity:1;" d="M 432.421875 317.789062 L 432.421875 252.859375 L 360.011719 252.859375 L 360.011719 317.789062 Z M 432.421875 317.789062 "/>
</g>
<path style=" stroke:none;fill-rule:nonzero;fill:rgb(67.883301%,50.991821%,40.461731%);fill-opacity:1;" d="M 396.214844 577.511719 L 396.214844 512.582031 L 239.324219 512.582031 L 239.324219 577.511719 Z M 396.214844 577.511719 "/>
<path style=" stroke:none;fill-rule:nonzero;fill:rgb(67.883301%,50.991821%,40.461731%);fill-opacity:1;" d="M 360.011719 490.9375 L 360.011719 426.007812 L 191.050781 426.007812 L 191.050781 490.9375 Z M 360.011719 490.9375 "/>
<path style=" stroke:none;fill-rule:nonzero;fill:rgb(67.883301%,50.991821%,40.461731%);fill-opacity:1;" d="M 347.941406 404.363281 L 347.941406 339.433594 L 203.117188 339.433594 L 203.117188 404.363281 Z M 347.941406 404.363281 "/>
<path style=" stroke:none;fill-rule:nonzero;fill:rgb(67.883301%,50.991821%,40.461731%);fill-opacity:1;" d="M 360.011719 317.789062 L 360.011719 252.859375 L 215.1875 252.859375 L 215.1875 317.789062 Z M 360.011719 317.789062 "/>
<path style=" stroke:none;fill-rule:nonzero;fill:rgb(56.871033%,31.051636%,41.978455%);fill-opacity:1;" d="M 239.324219 577.511719 L 239.324219 512.582031 L 191.050781 512.582031 L 191.050781 577.511719 Z M 239.324219 577.511719 "/>
<path style=" stroke:none;fill-rule:nonzero;fill:rgb(56.871033%,31.051636%,41.978455%);fill-opacity:1;" d="M 191.050781 490.9375 L 191.050781 426.007812 L 178.980469 426.007812 L 178.980469 490.9375 Z M 191.050781 490.9375 "/>
<path style=" stroke:none;fill-rule:nonzero;fill:rgb(56.871033%,31.051636%,41.978455%);fill-opacity:1;" d="M 203.117188 404.363281 L 203.117188 339.433594 L 191.050781 339.433594 L 191.050781 404.363281 Z M 203.117188 404.363281 "/>
<path style=" stroke:none;fill-rule:nonzero;fill:rgb(56.871033%,31.051636%,41.978455%);fill-opacity:1;" d="M 215.1875 317.789062 L 215.1875 252.859375 L 191.050781 252.859375 L 191.050781 317.789062 Z M 215.1875 317.789062 "/>
<path style="fill:none;stroke-width:0.8;stroke-linecap:butt;stroke-linejoin:round;stroke:rgb(0%,0%,0%);stroke-opacity:1;stroke-miterlimit:10;" d="M 106.298007 38.01592 L 106.298007 34.51592 " transform="matrix(0,-1,-1,0,470.437795,651.344882)"/>
<g style="fill:rgb(0%,0%,0%);fill-opacity:1;">
  <use xlink:href="#glyph0-0" x="447.015545" y="566.257638"/>
  <use xlink:href="#glyph0-1" x="447.015545" y="559.397638"/>
  <use xlink:href="#glyph0-2" x="447.015545" y="553.267638"/>
  <use xlink:href="#glyph0-3" x="447.015545" y="548.057638"/>
  <use xlink:href="#glyph0-4" x="447.015545" y="541.907638"/>
  <use xlink:href="#glyph0-5" x="447.015545" y="539.127638"/>
  <use xlink:href="#glyph0-6" x="447.015545" y="536.347638"/>
  <use xlink:href="#glyph0-3" x="447.015545" y="530.007638"/>
</g>
<path style="fill:none;stroke-width:0.8;stroke-linecap:butt;stroke-linejoin:round;stroke:rgb(0%,0%,0%);stroke-opacity:1;stroke-miterlimit:10;" d="M 192.872226 38.01592 L 192.872226 34.51592 " transform="matrix(0,-1,-1,0,470.437795,651.344882)"/>
<g style="fill:rgb(0%,0%,0%);fill-opacity:1;">
  <use xlink:href="#glyph0-7" x="447.015545" y="465.683092"/>
  <use xlink:href="#glyph0-8" x="447.015545" y="457.983092"/>
</g>
<path style="fill:none;stroke-width:0.8;stroke-linecap:butt;stroke-linejoin:round;stroke:rgb(0%,0%,0%);stroke-opacity:1;stroke-miterlimit:10;" d="M 279.446444 38.01592 L 279.446444 34.51592 " transform="matrix(0,-1,-1,0,470.437795,651.344882)"/>
<g style="fill:rgb(0%,0%,0%);fill-opacity:1;">
  <use xlink:href="#glyph0-8" x="447.015545" y="378.335109"/>
  <use xlink:href="#glyph0-9" x="447.015545" y="371.495109"/>
</g>
<path style="fill:none;stroke-width:0.8;stroke-linecap:butt;stroke-linejoin:round;stroke:rgb(0%,0%,0%);stroke-opacity:1;stroke-miterlimit:10;" d="M 366.020663 38.01592 L 366.020663 34.51592 " transform="matrix(0,-1,-1,0,470.437795,651.344882)"/>
<g style="fill:rgb(0%,0%,0%);fill-opacity:1;">
  <use xlink:href="#glyph0-8" x="447.015545" y="303.159001"/>
  <use xlink:href="#glyph0-9" x="447.015545" y="296.319001"/>
  <use xlink:href="#glyph0-10" x="447.015545" y="290.289001"/>
  <use xlink:href="#glyph0-7" x="447.015545" y="281.909001"/>
  <use xlink:href="#glyph0-8" x="447.015545" y="274.209001"/>
</g>
<g style="fill:rgb(0%,0%,0%);fill-opacity:1;">
  <use xlink:href="#glyph0-11" x="460.68742" y="439.059882"/>
  <use xlink:href="#glyph0-12" x="460.68742" y="432.079882"/>
  <use xlink:href="#glyph0-6" x="460.68742" y="425.959882"/>
  <use xlink:href="#glyph0-13" x="460.68742" y="419.619882"/>
  <use xlink:href="#glyph0-5" x="460.68742" y="413.269882"/>
  <use xlink:href="#glyph0-14" x="460.68742" y="410.489882"/>
  <use xlink:href="#glyph0-5" x="460.68742" y="406.569882"/>
  <use xlink:href="#glyph0-12" x="460.68742" y="403.789882"/>
  <use xlink:href="#glyph0-6" x="460.68742" y="397.669882"/>
</g>
<path style="fill:none;stroke-width:0.8;stroke-linecap:butt;stroke-linejoin:round;stroke:rgb(0%,0%,0%);stroke-opacity:1;stroke-miterlimit:10;" d="M 57.598788 38.01592 L 54.098788 38.01592 " transform="matrix(0,-1,-1,0,470.437795,651.344882)"/>
<g style="fill:rgb(0%,0%,0%);fill-opacity:1;">
  <use xlink:href="#glyph0-15" x="436.21867" y="607.104257"/>
</g>
<path style="fill:none;stroke-width:0.8;stroke-linecap:butt;stroke-linejoin:round;stroke:rgb(0%,0%,0%);stroke-opacity:1;stroke-miterlimit:10;" d="M 57.598788 62.152639 L 54.098788 62.152639 " transform="matrix(0,-1,-1,0,470.437795,651.344882)"/>
<g style="fill:rgb(0%,0%,0%);fill-opacity:1;">
  <use xlink:href="#glyph0-16" x="412.081527" y="607.104257"/>
</g>
<path style="fill:none;stroke-width:0.8;stroke-linecap:butt;stroke-linejoin:round;stroke:rgb(0%,0%,0%);stroke-opacity:1;stroke-miterlimit:10;" d="M 57.598788 86.289358 L 54.098788 86.289358 " transform="matrix(0,-1,-1,0,470.437795,651.344882)"/>
<g style="fill:rgb(0%,0%,0%);fill-opacity:1;">
  <use xlink:href="#glyph0-17" x="387.944385" y="607.104257"/>
</g>
<path style="fill:none;stroke-width:0.8;stroke-linecap:butt;stroke-linejoin:round;stroke:rgb(0%,0%,0%);stroke-opacity:1;stroke-miterlimit:10;" d="M 57.598788 110.426077 L 54.098788 110.426077 " transform="matrix(0,-1,-1,0,470.437795,651.344882)"/>
<g style="fill:rgb(0%,0%,0%);fill-opacity:1;">
  <use xlink:href="#glyph0-18" x="363.807242" y="607.104257"/>
</g>
<path style="fill:none;stroke-width:0.8;stroke-linecap:butt;stroke-linejoin:round;stroke:rgb(0%,0%,0%);stroke-opacity:1;stroke-miterlimit:10;" d="M 57.598788 134.562795 L 54.098788 134.562795 " transform="matrix(0,-1,-1,0,470.437795,651.344882)"/>
<g style="fill:rgb(0%,0%,0%);fill-opacity:1;">
  <use xlink:href="#glyph0-19" x="339.670099" y="607.104257"/>
</g>
<path style="fill:none;stroke-width:0.8;stroke-linecap:butt;stroke-linejoin:round;stroke:rgb(0%,0%,0%);stroke-opacity:1;stroke-miterlimit:10;" d="M 57.598788 158.70342 L 54.098788 158.70342 " transform="matrix(0,-1,-1,0,470.437795,651.344882)"/>
<g style="fill:rgb(0%,0%,0%);fill-opacity:1;">
  <use xlink:href="#glyph0-20" x="315.532956" y="613.463632"/>
  <use xlink:href="#glyph0-15" x="315.532956" y="607.103632"/>
</g>
<path style="fill:none;stroke-width:0.8;stroke-linecap:butt;stroke-linejoin:round;stroke:rgb(0%,0%,0%);stroke-opacity:1;stroke-miterlimit:10;" d="M 57.598788 182.840139 L 54.098788 182.840139 " transform="matrix(0,-1,-1,0,470.437795,651.344882)"/>
<g style="fill:rgb(0%,0%,0%);fill-opacity:1;">
  <use xlink:href="#glyph0-20" x="291.395813" y="613.463632"/>
  <use xlink:href="#glyph0-16" x="291.395813" y="607.103632"/>
</g>
<path style="fill:none;stroke-width:0.8;stroke-linecap:butt;stroke-linejoin:round;stroke:rgb(0%,0%,0%);stroke-opacity:1;stroke-miterlimit:10;" d="M 57.598788 206.976858 L 54.098788 206.976858 " transform="matrix(0,-1,-1,0,470.437795,651.344882)"/>
<g style="fill:rgb(0%,0%,0%);fill-opacity:1;">
  <use xlink:href="#glyph0-20" x="267.25867" y="613.463632"/>
  <use xlink:href="#glyph0-17" x="267.25867" y="607.103632"/>
</g>
<path style="fill:none;stroke-width:0.8;stroke-linecap:butt;stroke-linejoin:round;stroke:rgb(0%,0%,0%);stroke-opacity:1;stroke-miterlimit:10;" d="M 57.598788 231.113577 L 54.098788 231.113577 " transform="matrix(0,-1,-1,0,470.437795,651.344882)"/>
<g style="fill:rgb(0%,0%,0%);fill-opacity:1;">
  <use xlink:href="#glyph0-20" x="243.121527" y="613.463632"/>
  <use xlink:href="#glyph0-18" x="243.121527" y="607.103632"/>
</g>
<path style="fill:none;stroke-width:0.8;stroke-linecap:butt;stroke-linejoin:round;stroke:rgb(0%,0%,0%);stroke-opacity:1;stroke-miterlimit:10;" d="M 57.598788 255.250295 L 54.098788 255.250295 " transform="matrix(0,-1,-1,0,470.437795,651.344882)"/>
<g style="fill:rgb(0%,0%,0%);fill-opacity:1;">
  <use xlink:href="#glyph0-20" x="218.984385" y="613.463632"/>
  <use xlink:href="#glyph0-19" x="218.984385" y="607.103632"/>
</g>
<path style="fill:none;stroke-width:0.8;stroke-linecap:butt;stroke-linejoin:round;stroke:rgb(0%,0%,0%);stroke-opacity:1;stroke-miterlimit:10;" d="M 57.598788 279.387014 L 54.098788 279.387014 " transform="matrix(0,-1,-1,0,470.437795,651.344882)"/>
<g style="fill:rgb(0%,0%,0%);fill-opacity:1;">
  <use xlink:href="#glyph0-16" x="194.847242" y="613.463632"/>
  <use xlink:href="#glyph0-15" x="194.847242" y="607.103632"/>
</g>
<g style="fill:rgb(0%,0%,0%);fill-opacity:1;">
  <use xlink:href="#glyph1-0" x="339.81892" y="619.541757"/>
  <use xlink:href="#glyph1-1" x="332.97892" y="619.541757"/>
  <use xlink:href="#glyph1-2" x="326.62892" y="619.541757"/>
  <use xlink:href="#glyph1-3" x="320.47892" y="619.541757"/>
  <use xlink:href="#glyph1-4" x="317.29892" y="619.541757"/>
  <use xlink:href="#glyph1-5" x="309.59892" y="619.541757"/>
  <use xlink:href="#glyph1-6" x="306.81892" y="619.541757"/>
  <use xlink:href="#glyph1-7" x="301.60892" y="619.541757"/>
  <use xlink:href="#glyph1-8" x="297.68892" y="619.541757"/>
  <use xlink:href="#glyph1-5" x="293.57892" y="619.541757"/>
  <use xlink:href="#glyph1-9" x="290.79892" y="619.541757"/>
  <use xlink:href="#glyph1-10" x="284.44892" y="619.541757"/>
  <use xlink:href="#glyph1-7" x="278.10892" y="619.541757"/>
  <use xlink:href="#glyph1-5" x="274.18892" y="619.541757"/>
  <use xlink:href="#glyph1-11" x="271.40892" y="619.541757"/>
  <use xlink:href="#glyph1-12" x="265.28892" y="619.541757"/>
</g>
<path style="fill:none;stroke-width:0.8;stroke-linecap:square;stroke-linejoin:miter;stroke:rgb(0%,0%,0%);stroke-opacity:1;stroke-miterlimit:10;" d="M 57.598788 38.01592 L 57.598788 304.129202 " transform="matrix(0,-1,-1,0,470.437795,651.344882)"/>
<path style="fill:none;stroke-width:0.8;stroke-linecap:square;stroke-linejoin:miter;stroke:rgb(0%,0%,0%);stroke-opacity:1;stroke-miterlimit:10;" d="M 414.719882 38.01592 L 414.719882 304.129202 " transform="matrix(0,-1,-1,0,470.437795,651.344882)"/>
<path style="fill:none;stroke-width:0.8;stroke-linecap:square;stroke-linejoin:miter;stroke:rgb(0%,0%,0%);stroke-opacity:1;stroke-miterlimit:10;" d="M 57.598788 38.01592 L 414.719882 38.01592 " transform="matrix(0,-1,-1,0,470.437795,651.344882)"/>
<path style="fill:none;stroke-width:0.8;stroke-linecap:square;stroke-linejoin:miter;stroke:rgb(0%,0%,0%);stroke-opacity:1;stroke-miterlimit:10;" d="M 57.598788 304.129202 L 414.719882 304.129202 " transform="matrix(0,-1,-1,0,470.437795,651.344882)"/>
<g style="fill:rgb(0%,0%,0%);fill-opacity:1;">
  <use xlink:href="#glyph2-0" x="160.309795" y="494.934882"/>
  <use xlink:href="#glyph2-1" x="160.309795" y="487.698882"/>
  <use xlink:href="#glyph2-2" x="160.309795" y="480.342882"/>
  <use xlink:href="#glyph2-3" x="160.309795" y="475.410882"/>
  <use xlink:href="#glyph2-4" x="160.309795" y="470.706882"/>
  <use xlink:href="#glyph2-5" x="160.309795" y="467.370882"/>
  <use xlink:href="#glyph2-4" x="160.309795" y="460.770882"/>
  <use xlink:href="#glyph2-6" x="160.309795" y="457.434882"/>
  <use xlink:href="#glyph2-1" x="160.309795" y="449.814882"/>
  <use xlink:href="#glyph2-7" x="160.309795" y="442.458882"/>
  <use xlink:href="#glyph2-3" x="160.309795" y="434.850882"/>
  <use xlink:href="#glyph2-8" x="160.309795" y="430.146882"/>
  <use xlink:href="#glyph2-9" x="160.309795" y="423.894882"/>
  <use xlink:href="#glyph2-10" x="160.309795" y="420.078882"/>
  <use xlink:href="#glyph2-11" x="160.309795" y="410.778882"/>
  <use xlink:href="#glyph2-7" x="160.309795" y="403.398882"/>
  <use xlink:href="#glyph2-12" x="160.309795" y="395.790882"/>
  <use xlink:href="#glyph2-11" x="160.309795" y="388.170882"/>
  <use xlink:href="#glyph2-2" x="160.309795" y="380.790882"/>
  <use xlink:href="#glyph2-9" x="160.309795" y="375.858882"/>
  <use xlink:href="#glyph2-13" x="160.309795" y="372.042882"/>
  <use xlink:href="#glyph2-9" x="160.309795" y="361.986882"/>
  <use xlink:href="#glyph2-14" x="160.309795" y="358.170882"/>
  <use xlink:href="#glyph2-15" x="160.309795" y="349.962882"/>
  <use xlink:href="#glyph2-11" x="160.309795" y="342.342882"/>
</g>
<path style="fill-rule:nonzero;fill:rgb(100%,100%,100%);fill-opacity:0.8;stroke-width:1;stroke-linecap:butt;stroke-linejoin:miter;stroke:rgb(79.998779%,79.998779%,79.998779%);stroke-opacity:0.8;stroke-miterlimit:10;" d="M 64.598788 237.441702 L 142.786288 237.441702 C 144.122226 237.441702 144.786288 238.105764 144.786288 239.441702 L 144.786288 297.129202 C 144.786288 298.461233 144.122226 299.129202 142.786288 299.129202 L 64.598788 299.129202 C 63.266757 299.129202 62.598788 298.461233 62.598788 297.129202 L 62.598788 239.441702 C 62.598788 238.105764 63.266757 237.441702 64.598788 237.441702 Z M 64.598788 237.441702 " transform="matrix(0,-1,-1,0,470.437795,651.344882)"/>
<path style=" stroke:none;fill-rule:nonzero;fill:rgb(77.116394%,89.903259%,81.083679%);fill-opacity:1;" d="M 182.902344 584.746094 L 182.902344 564.746094 L 175.902344 564.746094 L 175.902344 584.746094 Z M 182.902344 584.746094 "/>
<g style="fill:rgb(0%,0%,0%);fill-opacity:1;">
  <use xlink:href="#glyph0-21" x="182.903545" y="556.744882"/>
  <use xlink:href="#glyph0-6" x="182.903545" y="549.424882"/>
  <use xlink:href="#glyph0-13" x="182.903545" y="543.084882"/>
  <use xlink:href="#glyph0-3" x="182.903545" y="536.734882"/>
  <use xlink:href="#glyph0-22" x="182.903545" y="530.584882"/>
  <use xlink:href="#glyph0-23" x="182.903545" y="526.474882"/>
  <use xlink:href="#glyph0-20" x="182.903545" y="523.294882"/>
  <use xlink:href="#glyph0-18" x="182.903545" y="516.934882"/>
</g>
<path style=" stroke:none;fill-rule:nonzero;fill:rgb(68.127441%,74.249268%,54.089355%);fill-opacity:1;" d="M 197.574219 584.746094 L 197.574219 564.746094 L 190.574219 564.746094 L 190.574219 584.746094 Z M 197.574219 584.746094 "/>
<g style="fill:rgb(0%,0%,0%);fill-opacity:1;">
  <use xlink:href="#glyph0-20" x="197.57542" y="556.744882"/>
  <use xlink:href="#glyph0-18" x="197.57542" y="550.384882"/>
  <use xlink:href="#glyph0-24" x="197.57542" y="544.024882"/>
  <use xlink:href="#glyph0-16" x="197.57542" y="540.414882"/>
  <use xlink:href="#glyph0-25" x="197.57542" y="534.054882"/>
</g>
<path style=" stroke:none;fill-rule:nonzero;fill:rgb(67.883301%,50.991821%,40.461731%);fill-opacity:1;" d="M 212.246094 584.746094 L 212.246094 564.746094 L 205.246094 564.746094 L 205.246094 584.746094 Z M 212.246094 584.746094 "/>
<g style="fill:rgb(0%,0%,0%);fill-opacity:1;">
  <use xlink:href="#glyph0-16" x="212.247295" y="556.744882"/>
  <use xlink:href="#glyph0-18" x="212.247295" y="550.384882"/>
  <use xlink:href="#glyph0-24" x="212.247295" y="544.024882"/>
  <use xlink:href="#glyph0-17" x="212.247295" y="540.414882"/>
  <use xlink:href="#glyph0-26" x="212.247295" y="534.054882"/>
</g>
<path style=" stroke:none;fill-rule:nonzero;fill:rgb(56.871033%,31.051636%,41.978455%);fill-opacity:1;" d="M 226.917969 584.746094 L 226.917969 564.746094 L 219.917969 564.746094 L 219.917969 584.746094 Z M 226.917969 584.746094 "/>
<g style="fill:rgb(0%,0%,0%);fill-opacity:1;">
  <use xlink:href="#glyph0-25" x="226.91917" y="556.744882"/>
  <use xlink:href="#glyph0-15" x="226.91917" y="550.384882"/>
  <use xlink:href="#glyph0-24" x="226.91917" y="544.024882"/>
  <use xlink:href="#glyph0-18" x="226.91917" y="540.414882"/>
  <use xlink:href="#glyph0-25" x="226.91917" y="534.054882"/>
</g>
</g>
</svg>
