<?xml version="1.0" encoding="UTF-8" standalone="no"?>
<!-- Created with Inkscape (http://www.inkscape.org/) -->

<svg
   xmlns:dc="http://purl.org/dc/elements/1.1/"
   xmlns:cc="http://creativecommons.org/ns#"
   xmlns:rdf="http://www.w3.org/1999/02/22-rdf-syntax-ns#"
   xmlns:svg="http://www.w3.org/2000/svg"
   xmlns="http://www.w3.org/2000/svg"
   xmlns:sodipodi="http://sodipodi.sourceforge.net/DTD/sodipodi-0.dtd"
   xmlns:inkscape="http://www.inkscape.org/namespaces/inkscape"
   width="120.6719mm"
   height="86.873505mm"
   viewBox="0 0 120.6719 86.873505"
   version="1.1"
   id="svg8"
   inkscape:version="0.92.3 (2405546, 2018-03-11)"
   sodipodi:docname="ToM.svg">
  <defs
     id="defs2">
    <inkscape:path-effect
       effect="bspline"
       id="path-effect843"
       is_visible="true"
       weight="33.333333"
       steps="2"
       helper_size="0"
       apply_no_weight="true"
       apply_with_weight="true"
       only_selected="false" />
    <inkscape:path-effect
       effect="bspline"
       id="path-effect843-3"
       is_visible="true"
       weight="33.333333"
       steps="2"
       helper_size="0"
       apply_no_weight="true"
       apply_with_weight="true"
       only_selected="false" />
    <inkscape:path-effect
       effect="bspline"
       id="path-effect843-7"
       is_visible="true"
       weight="33.333333"
       steps="2"
       helper_size="0"
       apply_no_weight="true"
       apply_with_weight="true"
       only_selected="false" />
    <inkscape:path-effect
       effect="bspline"
       id="path-effect843-35"
       is_visible="true"
       weight="33.333333"
       steps="2"
       helper_size="0"
       apply_no_weight="true"
       apply_with_weight="true"
       only_selected="false" />
    <inkscape:path-effect
       effect="bspline"
       id="path-effect843-9"
       is_visible="true"
       weight="33.333333"
       steps="2"
       helper_size="0"
       apply_no_weight="true"
       apply_with_weight="true"
       only_selected="false" />
    <inkscape:path-effect
       effect="bspline"
       id="path-effect843-3-1"
       is_visible="true"
       weight="33.333333"
       steps="2"
       helper_size="0"
       apply_no_weight="true"
       apply_with_weight="true"
       only_selected="false" />
    <inkscape:path-effect
       effect="bspline"
       id="path-effect843-7-2"
       is_visible="true"
       weight="33.333333"
       steps="2"
       helper_size="0"
       apply_no_weight="true"
       apply_with_weight="true"
       only_selected="false" />
    <inkscape:path-effect
       effect="bspline"
       id="path-effect843-35-7"
       is_visible="true"
       weight="33.333333"
       steps="2"
       helper_size="0"
       apply_no_weight="true"
       apply_with_weight="true"
       only_selected="false" />
    <marker
       inkscape:isstock="true"
       style="overflow:visible"
       id="Arrow2Lend"
       refX="0"
       refY="0"
       orient="auto"
       inkscape:stockid="Arrow2Lend">
      <path
         inkscape:connector-curvature="0"
         transform="matrix(-1.1,0,0,-1.1,-1.1,0)"
         d="M 8.7185878,4.0337352 -2.2072895,0.01601326 8.7185884,-4.0017078 c -1.7454984,2.3720609 -1.7354408,5.6174519 -6e-7,8.035443 z"
         style="fill:#000000;fill-opacity:1;fill-rule:evenodd;stroke:#000000;stroke-width:0.625;stroke-linejoin:round;stroke-opacity:1"
         id="path1880" />
    </marker>
  </defs>
  <sodipodi:namedview
     id="base"
     pagecolor="#ffffff"
     bordercolor="#666666"
     borderopacity="1.0"
     inkscape:pageopacity="0.0"
     inkscape:pageshadow="2"
     inkscape:zoom="0.98994949"
     inkscape:cx="261.19643"
     inkscape:cy="281.32406"
     inkscape:document-units="mm"
     inkscape:current-layer="layer1-3"
     showgrid="false"
     fit-margin-top="0"
     fit-margin-left="0"
     fit-margin-right="0"
     fit-margin-bottom="0"
     inkscape:window-width="1853"
     inkscape:window-height="1025"
     inkscape:window-x="1987"
     inkscape:window-y="27"
     inkscape:window-maximized="1" />
  <metadata
     id="metadata5">
    <rdf:RDF>
      <cc:Work
         rdf:about="">
        <dc:format>image/svg+xml</dc:format>
        <dc:type
           rdf:resource="http://purl.org/dc/dcmitype/StillImage" />
        <dc:title></dc:title>
      </cc:Work>
    </rdf:RDF>
  </metadata>
  <g
     inkscape:label="Layer 1"
     inkscape:groupmode="layer"
     id="layer1"
     transform="translate(-42.957379,-52.604379)">
    <g
       transform="translate(34.784732,44.013309)"
       id="layer1-36"
       inkscape:label="Layer 1">
      <g
         transform="translate(-26.634478,13.429087)"
         inkscape:label="Layer 1"
         id="layer1-3">
        <g
           transform="matrix(0.94487847,0,0,0.94487847,11.219321,-48.405506)"
           id="g1108">
          <g
             id="g930"
             transform="matrix(0.1254469,0,0,0.1254469,38.836643,66.87023)">
            <g
               id="g831">
              <g
                 id="g829" />
            </g>
            <g
               id="g1076"
               transform="translate(-93.944188,112.12693)">
              <g
                 id="g843">
                <g
                   id="g841">
                  <path
                     inkscape:connector-curvature="0"
                     d="m 341.119,179.914 c -1.531,-2.834 -3.333,-5.548 -5.36,-8.068 -4.115,-5.114 -9.074,-9.379 -14.737,-12.674 -8.083,-4.705 -17.323,-7.191 -26.721,-7.191 h -76.604 c -29.327,0 -53.187,23.859 -53.187,53.186 v 99.445 c 0,7.193 5.853,13.045 13.046,13.045 h 22.626 v 7.596 c 0,4.404 3.57,7.975 7.975,7.975 4.405,0 7.975,-3.571 7.975,-7.975 v -15.571 c 0,-0.482 -0.05,-0.952 -0.132,-1.41 v -90.254 c 0,-4.404 -3.57,-7.975 -7.975,-7.975 -4.405,0 -7.975,3.571 -7.975,7.975 v 83.689 h -19.59 v -96.54 c 0,-20.532 16.704,-37.236 37.237,-37.236 h 76.604 c 6.583,0 13.048,1.738 18.698,5.026 3.97,2.31 7.447,5.301 10.332,8.888 1.421,1.765 2.683,3.666 3.756,5.651 2.912,5.388 4.451,11.499 4.451,17.671 0,4.404 3.57,7.975 7.975,7.975 4.405,0 7.975,-3.571 7.975,-7.975 0,-8.811 -2.202,-17.544 -6.369,-25.253 z"
                     id="path839-2" />
                </g>
              </g>
              <g
                 id="g849">
                <g
                   id="g847">
                  <path
                     inkscape:connector-curvature="0"
                     d="m 339.514,226.769 c -4.405,0 -7.975,3.571 -7.975,7.975 v 66.964 h -19.852 v -83.689 c 0,-4.404 -3.57,-7.975 -7.975,-7.975 -4.405,0 -7.975,3.571 -7.975,7.975 v 91.664 c 0,0.477 0.049,0.942 0.13,1.396 v 128.258 h -79.734 v -82.802 c 0,-4.405 -3.57,-7.975 -7.975,-7.975 -4.405,0 -7.975,3.571 -7.975,7.975 v 90.777 c 0,4.404 3.57,7.975 7.975,7.975 h 95.684 c 4.405,0 7.975,-3.571 7.975,-7.975 V 317.658 h 22.626 c 7.193,0 13.046,-5.852 13.046,-13.045 v -69.869 c -10e-4,-4.404 -3.571,-7.975 -7.975,-7.975 z"
                     id="path845" />
                </g>
              </g>
              <g
                 id="g855">
                <g
                   id="g853">
                  <path
                     inkscape:connector-curvature="0"
                     d="m 257.709,56.712 c -25.268,0 -45.824,20.557 -45.824,45.825 0,25.268 20.556,45.825 45.824,45.825 25.268,0 45.825,-20.557 45.825,-45.825 0,-25.268 -20.557,-45.825 -45.825,-45.825 z m 0,75.7 c -16.472,0 -29.874,-13.402 -29.874,-29.875 0,-16.473 13.402,-29.874 29.874,-29.874 16.473,0 29.874,13.401 29.874,29.874 -0.001,16.473 -13.402,29.875 -29.874,29.875 z"
                     id="path851" />
                </g>
              </g>
            </g>
            <g
               id="g857" />
            <g
               id="g859" />
            <g
               id="g861" />
            <g
               id="g863" />
            <g
               id="g865" />
            <g
               id="g867" />
            <g
               id="g869" />
            <g
               id="g871" />
            <g
               id="g873" />
            <g
               id="g875" />
            <g
               id="g877" />
            <g
               id="g879" />
            <g
               id="g881" />
            <g
               id="g883" />
            <g
               id="g885" />
          </g>
        </g>
        <g
           transform="matrix(0.94487847,0,0,0.94487847,60.789121,-48.405506)"
           id="g1108-0">
          <g
             id="g930-6"
             transform="matrix(0.1254469,0,0,0.1254469,38.836643,66.87023)">
            <g
               id="g831-2">
              <g
                 id="g829-6" />
            </g>
            <g
               id="g1076-1"
               transform="translate(-93.944188,112.12693)">
              <g
                 id="g843-8">
                <g
                   id="g841-7">
                  <path
                     inkscape:connector-curvature="0"
                     d="m 341.119,179.914 c -1.531,-2.834 -3.333,-5.548 -5.36,-8.068 -4.115,-5.114 -9.074,-9.379 -14.737,-12.674 -8.083,-4.705 -17.323,-7.191 -26.721,-7.191 h -76.604 c -29.327,0 -53.187,23.859 -53.187,53.186 v 99.445 c 0,7.193 5.853,13.045 13.046,13.045 h 22.626 v 7.596 c 0,4.404 3.57,7.975 7.975,7.975 4.405,0 7.975,-3.571 7.975,-7.975 v -15.571 c 0,-0.482 -0.05,-0.952 -0.132,-1.41 v -90.254 c 0,-4.404 -3.57,-7.975 -7.975,-7.975 -4.405,0 -7.975,3.571 -7.975,7.975 v 83.689 h -19.59 v -96.54 c 0,-20.532 16.704,-37.236 37.237,-37.236 h 76.604 c 6.583,0 13.048,1.738 18.698,5.026 3.97,2.31 7.447,5.301 10.332,8.888 1.421,1.765 2.683,3.666 3.756,5.651 2.912,5.388 4.451,11.499 4.451,17.671 0,4.404 3.57,7.975 7.975,7.975 4.405,0 7.975,-3.571 7.975,-7.975 0,-8.811 -2.202,-17.544 -6.369,-25.253 z"
                     id="path839-2-9" />
                </g>
              </g>
              <g
                 id="g849-2">
                <g
                   id="g847-0">
                  <path
                     inkscape:connector-curvature="0"
                     d="m 339.514,226.769 c -4.405,0 -7.975,3.571 -7.975,7.975 v 66.964 h -19.852 v -83.689 c 0,-4.404 -3.57,-7.975 -7.975,-7.975 -4.405,0 -7.975,3.571 -7.975,7.975 v 91.664 c 0,0.477 0.049,0.942 0.13,1.396 v 128.258 h -79.734 v -82.802 c 0,-4.405 -3.57,-7.975 -7.975,-7.975 -4.405,0 -7.975,3.571 -7.975,7.975 v 90.777 c 0,4.404 3.57,7.975 7.975,7.975 h 95.684 c 4.405,0 7.975,-3.571 7.975,-7.975 V 317.658 h 22.626 c 7.193,0 13.046,-5.852 13.046,-13.045 v -69.869 c -10e-4,-4.404 -3.571,-7.975 -7.975,-7.975 z"
                     id="path845-2" />
                </g>
              </g>
              <g
                 id="g855-3">
                <g
                   id="g853-7">
                  <path
                     inkscape:connector-curvature="0"
                     d="m 257.709,56.712 c -25.268,0 -45.824,20.557 -45.824,45.825 0,25.268 20.556,45.825 45.824,45.825 25.268,0 45.825,-20.557 45.825,-45.825 0,-25.268 -20.557,-45.825 -45.825,-45.825 z m 0,75.7 c -16.472,0 -29.874,-13.402 -29.874,-29.875 0,-16.473 13.402,-29.874 29.874,-29.874 16.473,0 29.874,13.401 29.874,29.874 -0.001,16.473 -13.402,29.875 -29.874,29.875 z"
                     id="path851-5" />
                </g>
              </g>
            </g>
            <g
               id="g857-9" />
            <g
               id="g859-2" />
            <g
               id="g861-2" />
            <g
               id="g863-8" />
            <g
               id="g865-9" />
            <g
               id="g867-7" />
            <g
               id="g869-3" />
            <g
               id="g871-6" />
            <g
               id="g873-1" />
            <g
               id="g875-2" />
            <g
               id="g877-9" />
            <g
               id="g879-3" />
            <g
               id="g881-1" />
            <g
               id="g883-9" />
            <g
               id="g885-4" />
          </g>
        </g>
        <circle
           style="opacity:1;fill:none;fill-opacity:1;stroke:#000000;stroke-width:0.4502556;stroke-linecap:round;stroke-linejoin:round;stroke-miterlimit:4;stroke-dasharray:none;stroke-dashoffset:0;stroke-opacity:1"
           id="path1102"
           cx="62.011581"
           cy="32.662884"
           r="1.6267771" />
        <circle
           style="opacity:1;fill:none;fill-opacity:1;stroke:#000000;stroke-width:0.4502556;stroke-linecap:round;stroke-linejoin:round;stroke-miterlimit:4;stroke-dasharray:none;stroke-dashoffset:0;stroke-opacity:1"
           id="path1102-7"
           cx="58.260162"
           cy="27.994881"
           r="1.6267772" />
        <circle
           style="opacity:1;fill:none;fill-opacity:1;stroke:#000000;stroke-width:0.4502556;stroke-linecap:round;stroke-linejoin:round;stroke-miterlimit:4;stroke-dasharray:none;stroke-dashoffset:0;stroke-opacity:1"
           id="path1102-8"
           cx="57.995579"
           cy="21.796072"
           r="1.6267772" />
        <ellipse
           style="opacity:1;fill:none;fill-opacity:1;stroke:#000000;stroke-width:0.80630141;stroke-linecap:round;stroke-linejoin:round;stroke-miterlimit:4;stroke-dasharray:none;stroke-dashoffset:0;stroke-opacity:1"
           id="path1131"
           cx="52.720238"
           cy="6.9470267"
           rx="17.509962"
           ry="11.381893" />
        <g
           id="layer1-0"
           inkscape:label="Layer 1"
           transform="matrix(0.45149275,0,0,0.45149275,195.74234,78.568145)">
          <text
             id="text1170-88"
             y="24.117813"
             x="103.16604"
             style="font-style:normal;font-variant:normal;font-weight:bold;font-stretch:normal;font-size:9.8777771px;line-height:1.25;font-family:sans-serif;-inkscape-font-specification:'sans-serif Bold';letter-spacing:0px;word-spacing:0px;fill:#000000;fill-opacity:1;stroke:none;stroke-width:0.26458332"
             xml:space="preserve"><tspan
               style="stroke-width:0.26458332"
               y="32.85733"
               x="103.16604"
               id="tspan1168-3"
               sodipodi:role="line" /></text>
          <flowRoot
             style="font-style:normal;font-variant:normal;font-weight:bold;font-stretch:normal;font-size:24px;line-height:1.25;font-family:sans-serif;-inkscape-font-specification:'sans-serif Bold';letter-spacing:0px;word-spacing:0px;fill:#000000;fill-opacity:1;stroke:none"
             id="flowRoot1180-3"
             xml:space="preserve"><flowRegion
               style="font-size:24px"
               id="flowRegion1182-3"><rect
                 style="font-size:24px"
                 y="223.48392"
                 x="119.198"
                 height="85.862968"
                 width="211.12189"
                 id="rect1184-3" /></flowRegion><flowPara
               id="flowPara1186-8" /></flowRoot>          <flowRoot
             style="font-style:normal;font-variant:normal;font-weight:bold;font-stretch:normal;font-size:24px;line-height:1.25;font-family:sans-serif;-inkscape-font-specification:'sans-serif Bold';letter-spacing:0px;word-spacing:0px;fill:#000000;fill-opacity:1;stroke:none"
             id="flowRoot1190-6"
             xml:space="preserve"><flowRegion
               style="font-size:24px"
               id="flowRegion1192-0"><rect
                 style="font-size:24px"
                 y="204.23709"
                 x="126.00827"
                 height="114.20117"
                 width="205.32176"
                 id="rect1194-4" /></flowRegion><flowPara
               id="flowPara1196-8" /></flowRoot>          <text
             id="text1200-8"
             y="63.940971"
             x="40.624966"
             style="font-style:normal;font-variant:normal;font-weight:bold;font-stretch:normal;font-size:9.8777771px;line-height:1.25;font-family:sans-serif;-inkscape-font-specification:'sans-serif Bold';letter-spacing:0px;word-spacing:0px;fill:#000000;fill-opacity:1;stroke:none;stroke-width:0.26458332"
             xml:space="preserve"><tspan
               style="stroke-width:0.26458332"
               y="72.680489"
               x="40.624966"
               id="tspan1198-8"
               sodipodi:role="line" /></text>
          <flowRoot
             style="font-style:normal;font-variant:normal;font-weight:bold;font-stretch:normal;font-size:37.33333206px;line-height:1.25;font-family:sans-serif;-inkscape-font-specification:'sans-serif Bold';letter-spacing:0px;word-spacing:0px;fill:#000000;fill-opacity:1;stroke:none"
             id="flowRoot1202-9"
             xml:space="preserve"><flowRegion
               id="flowRegion1204-7"><rect
                 y="221.96869"
                 x="122.22845"
                 height="118.69292"
                 width="288.39856"
                 id="rect1206-7" /></flowRegion><flowPara
               id="flowPara1208-6" /></flowRoot>          <flowRoot
             style="font-style:normal;font-variant:normal;font-weight:bold;font-stretch:normal;font-size:21.33333397px;line-height:1.25;font-family:sans-serif;-inkscape-font-specification:'sans-serif Bold';letter-spacing:0px;word-spacing:0px;fill:#000000;fill-opacity:1;stroke:none"
             id="flowRoot1226-4"
             xml:space="preserve"><flowRegion
               style="font-size:21.33333397px"
               id="flowRegion1228-3"><rect
                 style="font-size:21.33333397px"
                 y="216.91792"
                 x="113.64216"
                 height="98.489876"
                 width="221.72849"
                 id="rect1230-0" /></flowRegion><flowPara
               id="flowPara1232-3" /></flowRoot>          <g
             transform="matrix(-1,0,0,1,-348.80848,-58.565501)"
             id="g1046">
            <g
               id="g1376"
               transform="matrix(-0.09196347,0,0,0.09196347,-11.848446,-120.25032)">
              <g
                 id="g1320">
                <path
                   id="path1318"
                   d="m 438.465,147.145 c -0.436,-5.241 -4.242,-9.24 -8.793,-9.24 H 241.506 c -2.16,0 -4.146,0.908 -5.689,2.414 -9.619,0.108 -19.447,0.984 -27.528,5.3 -6.944,3.709 -15.079,11.346 -16.708,26.901 -8.909,-1.793 -12.578,-5.981 -12.314,-12.217 0.097,-2.288 1.164,-8.317 4.685,-8.583 2.039,-0.154 4.449,0.583 7.012,1.675 3.782,-6.289 8.837,-10.247 13.438,-12.705 3.419,-1.825 7.057,-3.071 10.755,-3.93 -1.785,-1.642 -3.842,-3.427 -6.205,-5.374 -10.748,-8.852 -27.472,-18.608 -33.639,-18.608 -16.833,0 -49.333,13.584 -64.111,26.608 -15.141,13.345 -30.222,52 -70.935,52 L 0,191.471 v 96.832 c 37.328,0 60.121,13.122 79.125,20.916 43.068,17.662 73.184,17.357 88.932,16.773 32.658,-1.216 35.402,-27.871 36.287,-33.177 8.475,-3.372 14.045,-8.526 16.6,-15.342 0.998,-2.656 1.504,-5.562 1.504,-8.604 0,-5.121 -1.404,-9.729 -2.656,-12.817 5.812,-3.201 9.886,-7.246 12.19,-12.058 10.365,4.637 22.957,7.467 38.117,7.676 10.918,10.414 23.688,18.302 37.652,22.844 h 55.676 c 43.518,-14.155 75.529,-60.643 75.529,-115.658 -0.001,-3.866 -0.167,-7.807 -0.491,-11.711 z m -206.042,18.828 c 0.192,3.812 0.544,7.574 1.036,11.283 -4.352,-2.828 -10.216,-3.81 -16.641,-3.759 l -3.073,0.002 c 1.009,-4.011 4.754,-6.923 18.678,-7.526 z m -1.767,48.849 c 2.721,-2.34 6.553,-6.414 8.717,-12.146 2.449,7.235 5.479,14.134 9.037,20.607 -7.346,-2.018 -13.148,-4.985 -17.754,-8.461 z"
                   inkscape:connector-curvature="0" />
              </g>
              <g
                 id="g1322" />
              <g
                 id="g1324" />
              <g
                 id="g1326" />
              <g
                 id="g1328" />
              <g
                 id="g1330" />
              <g
                 id="g1332" />
              <g
                 id="g1334" />
              <g
                 id="g1336" />
              <g
                 id="g1338" />
              <g
                 id="g1340" />
              <g
                 id="g1342" />
              <g
                 id="g1344" />
              <g
                 id="g1346" />
              <g
                 id="g1348" />
              <g
                 id="g1350" />
            </g>
          </g>
        </g>
        <g
           id="g2196"
           transform="translate(0,0.15690408)">
          <g
             transform="matrix(0.0218296,0,0,0.0218296,141.1206,57.551455)"
             id="g1073-7">
            <g
               id="g971-2">
              <g
                 id="g969-7">
                <path
                   inkscape:connector-curvature="0"
                   d="M 386.76,181.717 H 36.831 c -10.172,0 -18.417,8.245 -18.417,18.417 V 318.618 C 18.414,425.255 105.166,512 211.796,512 318.426,512 405.177,425.255 405.177,318.619 V 200.134 c 0,-10.172 -8.245,-18.417 -18.417,-18.417 z m -18.418,136.902 c 0,86.322 -70.225,156.547 -156.547,156.547 -86.322,0 -156.546,-70.226 -156.546,-156.547 V 218.552 h 313.094 v 100.067 z"
                   id="path967-2" />
              </g>
            </g>
            <g
               id="g977-2">
              <g
                 id="g975-6">
                <path
                   inkscape:connector-curvature="0"
                   d="M 436.492,257.228 H 386.76 v 36.835 h 49.733 c 18.638,0 34.379,15.741 34.379,34.379 0,18.638 -15.747,34.379 -34.379,34.379 h -62.011 v 36.835 h 62.011 c 39.266,0 71.213,-31.942 71.213,-71.213 0,-39.274 -31.948,-71.215 -71.214,-71.215 z"
                   id="path973-1" />
              </g>
            </g>
            <g
               id="g983-0">
              <g
                 id="g981-6">
                <path
                   inkscape:connector-curvature="0"
                   d="m 211.796,0 c -10.172,0 -18.417,8.245 -18.417,18.417 v 87.789 c 0,10.172 8.245,18.417 18.417,18.417 10.172,0 18.417,-8.245 18.417,-18.417 V 18.417 C 230.213,8.245 221.968,0 211.796,0 Z"
                   id="path979-1" />
              </g>
            </g>
            <g
               id="g989-5">
              <g
                 id="g987-9">
                <path
                   inkscape:connector-curvature="0"
                   d="m 299.584,29.468 c -10.172,0 -18.417,8.245 -18.417,18.417 v 87.789 c 0,10.172 8.245,18.417 18.417,18.417 10.172,0 18.417,-8.245 18.417,-18.417 V 47.885 c 0.001,-10.173 -8.244,-18.417 -18.417,-18.417 z"
                   id="path985-4" />
              </g>
            </g>
            <g
               id="g995-9">
              <g
                 id="g993-0">
                <path
                   inkscape:connector-curvature="0"
                   d="m 124.007,29.468 c -10.172,0 -18.417,8.245 -18.417,18.417 v 87.789 c 0,10.172 8.245,18.417 18.417,18.417 10.172,0 18.417,-8.245 18.417,-18.417 V 47.885 c 0,-10.173 -8.245,-18.417 -18.417,-18.417 z"
                   id="path991-9" />
              </g>
            </g>
            <g
               id="g1001-1">
              <g
                 id="g999-7">
                <path
                   inkscape:connector-curvature="0"
                   d="M 395.968,475.165 H 22.712 c -10.172,0 -18.417,8.245 -18.417,18.417 0,10.172 8.245,18.417 18.417,18.417 h 373.257 c 10.172,0 18.417,-8.245 18.417,-18.417 -0.001,-10.172 -8.245,-18.417 -18.418,-18.417 z"
                   id="path997-7" />
              </g>
            </g>
            <g
               id="g1003-3-1" />
            <g
               id="g1005-1" />
            <g
               id="g1007-5" />
            <g
               id="g1009-9" />
            <g
               id="g1011-7" />
            <g
               id="g1013-7" />
            <g
               id="g1015-6" />
            <g
               id="g1017-7" />
            <g
               id="g1019-3" />
            <g
               id="g1021-6" />
            <g
               id="g1023-5" />
            <g
               id="g1025-6" />
            <g
               id="g1027-3" />
            <g
               id="g1029-9" />
            <g
               id="g1031-4" />
          </g>
          <g
             transform="matrix(0.0370497,0,0,0.0370497,136.50958,65.576713)"
             id="g1136-8">
            <g
               id="g1079-1">
              <g
                 id="g1077-2">
                <path
                   inkscape:connector-curvature="0"
                   d="M 504,72 H 8 c -4.418,0 -8,3.582 -8,8 v 48 c 0,4.418 3.582,8 8,8 h 24 v 296 c 0,4.418 3.582,8 8,8 h 32 c 4.418,0 8,-3.582 8,-8 V 136 h 352 v 296 c 0,4.418 3.582,8 8,8 h 32 c 4.418,0 8,-3.582 8,-8 V 136 h 24 c 4.418,0 8,-3.582 8,-8 V 80 c 0,-4.418 -3.582,-8 -8,-8 z m -8,48 h -24 c -4.418,0 -8,3.582 -8,8 V 424 H 448 V 128 c 0,-4.418 -3.582,-8 -8,-8 H 72 c -4.418,0 -8,3.582 -8,8 V 424 H 48 V 128 c 0,-4.418 -3.582,-8 -8,-8 H 16 V 88 h 480 z"
                   id="path1075-9" />
              </g>
            </g>
            <g
               id="g1081-3" />
            <g
               id="g1083-9" />
            <g
               id="g1085-0" />
            <g
               id="g1087-8" />
            <g
               id="g1089-8" />
            <g
               id="g1091-5" />
            <g
               id="g1093-0" />
            <g
               id="g1095-9" />
            <g
               id="g1097-6" />
            <g
               id="g1099-3" />
            <g
               id="g1101-8" />
            <g
               id="g1103-5" />
            <g
               id="g1105-6" />
            <g
               id="g1107-1" />
            <g
               id="g1109-1" />
          </g>
        </g>
        <path
           style="fill:none;stroke:#000000;stroke-width:0.26458332;stroke-linecap:butt;stroke-linejoin:miter;stroke-miterlimit:4;stroke-dasharray:2.11666654, 2.11666654;stroke-dashoffset:0;stroke-opacity:1;marker-end:url(#Arrow2Lend)"
           d="M 75.798254,40.36415 H 104.52443"
           id="path2081"
           inkscape:connector-curvature="0" />
      </g>
    </g>
  </g>
</svg>
