<?xml version="1.0" encoding="UTF-8" standalone="no"?>
<!-- Created with Inkscape (http://www.inkscape.org/) -->

<svg
   xmlns:dc="http://purl.org/dc/elements/1.1/"
   xmlns:cc="http://creativecommons.org/ns#"
   xmlns:rdf="http://www.w3.org/1999/02/22-rdf-syntax-ns#"
   xmlns:svg="http://www.w3.org/2000/svg"
   xmlns="http://www.w3.org/2000/svg"
   xmlns:xlink="http://www.w3.org/1999/xlink"
   xmlns:sodipodi="http://sodipodi.sourceforge.net/DTD/sodipodi-0.dtd"
   xmlns:inkscape="http://www.inkscape.org/namespaces/inkscape"
   width="297mm"
   height="210mm"
   viewBox="0 0 297 210"
   version="1.1"
   id="svg2933"
   inkscape:version="0.92.3 (2405546, 2018-03-11)"
   sodipodi:docname="interaction.svg">
  <defs
     id="defs2927">
    <marker
       inkscape:isstock="true"
       style="overflow:visible"
       id="Scissors"
       refX="0.0"
       refY="0.0"
       orient="auto"
       inkscape:stockid="Scissors">
      <path
         style="fill:#000000;stroke:#000000;stroke-opacity:1;fill-opacity:1"
         d="M 9.0898857,-3.6061018 C 8.1198849,-4.7769976 6.3697607,-4.7358294 5.0623558,-4.2327734 L -3.1500488,-1.1548705 C -5.5383421,-2.4615840 -7.8983361,-2.0874077 -7.8983361,-2.7236578 C -7.8983361,-3.2209742 -7.4416699,-3.1119800 -7.5100293,-4.4068519 C -7.5756648,-5.6501286 -8.8736064,-6.5699315 -10.100428,-6.4884954 C -11.327699,-6.4958500 -12.599867,-5.5553341 -12.610769,-4.2584343 C -12.702194,-2.9520479 -11.603560,-1.7387447 -10.304005,-1.6532027 C -8.7816644,-1.4265411 -6.0857470,-2.3487593 -4.8210600,-0.082342643 C -5.7633447,1.6559151 -7.4350844,1.6607341 -8.9465707,1.5737277 C -10.201445,1.5014928 -11.708664,1.8611256 -12.307219,3.0945882 C -12.885586,4.2766744 -12.318421,5.9591904 -10.990470,6.3210002 C -9.6502788,6.8128279 -7.8098011,6.1912892 -7.4910978,4.6502760 C -7.2454393,3.4624530 -8.0864637,2.9043186 -7.7636052,2.4731223 C -7.5199917,2.1477623 -5.9728246,2.3362771 -3.2164999,1.0982979 L 5.6763468,4.2330688 C 6.8000164,4.5467672 8.1730685,4.5362646 9.1684433,3.4313614 L -0.051640930,-0.053722219 L 9.0898857,-3.6061018 z M -9.2179159,-5.5066058 C -7.9233569,-4.7838060 -8.0290767,-2.8230356 -9.3743431,-2.4433169 C -10.590861,-2.0196559 -12.145370,-3.2022863 -11.757521,-4.5207817 C -11.530373,-5.6026336 -10.104134,-6.0014137 -9.2179159,-5.5066058 z M -9.1616516,2.5107591 C -7.8108215,3.0096239 -8.0402087,5.2951947 -9.4138723,5.6023681 C -10.324932,5.9187072 -11.627422,5.4635705 -11.719569,4.3902287 C -11.897178,3.0851737 -10.363484,1.9060805 -9.1616516,2.5107591 z "
         id="schere" />
    </marker>
    <marker
       inkscape:isstock="true"
       style="overflow:visible;"
       id="Arrow1Lend"
       refX="0.0"
       refY="0.0"
       orient="auto"
       inkscape:stockid="Arrow1Lend">
      <path
         transform="scale(0.8) rotate(180) translate(12.5,0)"
         style="fill-rule:evenodd;stroke:#000000;stroke-width:1pt;stroke-opacity:1;fill:#000000;fill-opacity:1"
         d="M 0.0,0.0 L 5.0,-5.0 L -12.5,0.0 L 5.0,5.0 L 0.0,0.0 z "
         id="path1149" />
    </marker>
  </defs>
  <sodipodi:namedview
     id="base"
     pagecolor="#ffffff"
     bordercolor="#666666"
     borderopacity="1.0"
     inkscape:pageopacity="0.0"
     inkscape:pageshadow="2"
     inkscape:zoom="1"
     inkscape:cx="554.42317"
     inkscape:cy="659.86728"
     inkscape:document-units="mm"
     inkscape:current-layer="layer1-5-5"
     showgrid="false"
     inkscape:window-width="1853"
     inkscape:window-height="1025"
     inkscape:window-x="1987"
     inkscape:window-y="27"
     inkscape:window-maximized="1"
     inkscape:snap-global="false" />
  <metadata
     id="metadata2930">
    <rdf:RDF>
      <cc:Work
         rdf:about="">
        <dc:format>image/svg+xml</dc:format>
        <dc:type
           rdf:resource="http://purl.org/dc/dcmitype/StillImage" />
        <dc:title />
      </cc:Work>
    </rdf:RDF>
  </metadata>
  <g
     inkscape:label="Layer 1"
     inkscape:groupmode="layer"
     id="layer1"
     transform="translate(0,-87)">
    <g
       id="g3595"
       transform="matrix(0.26458333,0,0,0.26458333,-3.5885136,15.451045)">
      <g
         id="g3496">
        <g
           id="g3494" />
      </g>
      <g
         id="g3522" />
      <g
         id="g3524" />
      <g
         id="g3526" />
      <g
         id="g3528" />
      <g
         id="g3530" />
      <g
         id="g3532" />
      <g
         id="g3534" />
      <g
         id="g3536" />
      <g
         id="g3538" />
      <g
         id="g3540" />
      <g
         id="g3542" />
      <g
         id="g3544" />
      <g
         id="g3546" />
      <g
         id="g3548" />
      <g
         id="g3550" />
      <g
         id="layer1-5"
         inkscape:label="Layer 1"
         transform="matrix(3.7795276,0,0,3.7795276,57.217855,-33.202768)">
        <text
           id="text1170"
           y="24.117813"
           x="103.16604"
           style="font-style:normal;font-variant:normal;font-weight:bold;font-stretch:normal;font-size:9.8777771px;line-height:1.25;font-family:sans-serif;-inkscape-font-specification:'sans-serif Bold';letter-spacing:0px;word-spacing:0px;fill:#000000;fill-opacity:1;stroke:none;stroke-width:0.26458332"
           xml:space="preserve"><tspan
             style="stroke-width:0.26458332"
             y="32.85733"
             x="103.16604"
             id="tspan1168"
             sodipodi:role="line" /></text>
        <flowRoot
           style="font-style:normal;font-variant:normal;font-weight:bold;font-stretch:normal;font-size:24px;line-height:1.25;font-family:sans-serif;-inkscape-font-specification:'sans-serif Bold';letter-spacing:0px;word-spacing:0px;fill:#000000;fill-opacity:1;stroke:none"
           id="flowRoot1180"
           xml:space="preserve"><flowRegion
             style="font-size:24px"
             id="flowRegion1182"><rect
               style="font-size:24px"
               y="223.48392"
               x="119.198"
               height="85.862968"
               width="211.12189"
               id="rect1184" /></flowRegion><flowPara
             id="flowPara1186" /></flowRoot>        <flowRoot
           style="font-style:normal;font-variant:normal;font-weight:bold;font-stretch:normal;font-size:24px;line-height:1.25;font-family:sans-serif;-inkscape-font-specification:'sans-serif Bold';letter-spacing:0px;word-spacing:0px;fill:#000000;fill-opacity:1;stroke:none"
           id="flowRoot1190"
           xml:space="preserve"><flowRegion
             style="font-size:24px"
             id="flowRegion1192"><rect
               style="font-size:24px"
               y="204.23709"
               x="126.00827"
               height="114.20117"
               width="205.32176"
               id="rect1194" /></flowRegion><flowPara
             id="flowPara1196" /></flowRoot>        <text
           id="text1200"
           y="63.940971"
           x="40.624966"
           style="font-style:normal;font-variant:normal;font-weight:bold;font-stretch:normal;font-size:9.8777771px;line-height:1.25;font-family:sans-serif;-inkscape-font-specification:'sans-serif Bold';letter-spacing:0px;word-spacing:0px;fill:#000000;fill-opacity:1;stroke:none;stroke-width:0.26458332"
           xml:space="preserve"><tspan
             style="stroke-width:0.26458332"
             y="72.680489"
             x="40.624966"
             id="tspan1198"
             sodipodi:role="line" /></text>
        <flowRoot
           style="font-style:normal;font-variant:normal;font-weight:bold;font-stretch:normal;font-size:37.33333206px;line-height:1.25;font-family:sans-serif;-inkscape-font-specification:'sans-serif Bold';letter-spacing:0px;word-spacing:0px;fill:#000000;fill-opacity:1;stroke:none"
           id="flowRoot1202"
           xml:space="preserve"><flowRegion
             id="flowRegion1204"><rect
               y="221.96869"
               x="122.22845"
               height="118.69292"
               width="288.39856"
               id="rect1206" /></flowRegion><flowPara
             id="flowPara1208" /></flowRoot>        <flowRoot
           style="font-style:normal;font-variant:normal;font-weight:bold;font-stretch:normal;font-size:21.33333397px;line-height:1.25;font-family:sans-serif;-inkscape-font-specification:'sans-serif Bold';letter-spacing:0px;word-spacing:0px;fill:#000000;fill-opacity:1;stroke:none"
           id="flowRoot1226"
           xml:space="preserve"><flowRegion
             style="font-size:21.33333397px"
             id="flowRegion1228"><rect
               style="font-size:21.33333397px"
               y="216.91792"
               x="113.64216"
               height="98.489876"
               width="221.72849"
               id="rect1230" /></flowRegion><flowPara
             id="flowPara1232" /></flowRoot>        <g
           id="g1011"
           transform="matrix(1.6376148,0,0,1.6376148,-41.918116,-72.364449)">
          <g
             id="g1502"
             transform="translate(2.5388985,6.7455016)">
            <path
               inkscape:connector-curvature="0"
               id="rect871"
               d="m 35.68753,110.0191 c -1.081469,0 -1.952124,0.69418 -1.952124,1.55644 v 4.69864 c 0,0.86227 0.870655,1.55644 1.952124,1.55644 h 7.223248 l -0.630263,4.2582 6.475654,-4.2582 h 2.806071 c 1.081467,0 1.952123,-0.69417 1.952123,-1.55644 v -4.69864 c 0,-0.86226 -0.870656,-1.55644 -1.952123,-1.55644 z"
               style="opacity:1;fill:#000000;fill-opacity:0.04278074;stroke:#000000;stroke-width:0.40974495;stroke-miterlimit:4;stroke-dasharray:none;stroke-opacity:1" />
            <path
               sodipodi:nodetypes="cccccccc"
               inkscape:connector-curvature="0"
               id="path880"
               d="m 58.386356,99.362203 c -5.562559,-3.1e-5 -10.071935,2.118317 -10.071998,4.731457 0.0047,1.62298 1.779884,3.13156 4.702894,3.99671 l 6.160639,6.67778 -1.947782,-5.97727 c 0.383693,0.0218 0.769745,0.0333 1.156247,0.0344 5.562575,-1e-5 10.071896,-2.11842 10.071813,-4.7316 -6.3e-5,-2.61311 -4.509344,-4.731447 -10.071813,-4.731458 z"
               style="opacity:1;fill:#000000;fill-opacity:0.04278074;stroke:#000000;stroke-width:0.39650032;stroke-miterlimit:4;stroke-dasharray:none;stroke-opacity:1" />
            <g
               transform="matrix(0.0281233,0,0,0.0281233,29.65101,121.39311)"
               id="g1019">
              <g
                 id="g890">
                <g
                   id="g888">
                  <path
                     inkscape:connector-curvature="0"
                     d="m 181.956,102.43 c -17.275,0 -31.28,14.005 -31.28,31.28 0.044,17.257 14.023,31.236 31.28,31.28 17.275,0 31.28,-14.005 31.28,-31.28 0,-17.275 -14.005,-31.28 -31.28,-31.28 z m 0,46.48 c -8.439,0 -15.28,-6.841 -15.28,-15.28 0,-8.439 6.841,-15.28 15.28,-15.28 8.439,0 15.28,6.841 15.28,15.28 0,8.439 -6.841,15.28 -15.28,15.28 z"
                     id="path886" />
                </g>
              </g>
              <g
                 id="g896">
                <g
                   id="g894">
                  <path
                     inkscape:connector-curvature="0"
                     d="m 271.076,102.43 c -17.275,0 -31.28,14.005 -31.28,31.28 0.044,17.257 14.023,31.236 31.28,31.28 17.276,0 31.28,-14.005 31.28,-31.28 0,-17.275 -14.005,-31.28 -31.28,-31.28 z m 0,46.48 c -8.439,0 -15.28,-6.841 -15.28,-15.28 0,-8.439 6.841,-15.28 15.28,-15.28 8.439,0 15.28,6.841 15.28,15.28 0,8.439 -6.841,15.28 -15.28,15.28 z"
                     id="path892" />
                </g>
              </g>
              <g
                 id="g902">
                <g
                   id="g900">
                  <path
                     inkscape:connector-curvature="0"
                     d="m 366.525,138.427 c -3.332,-18.73 -18.424,-33.137 -37.289,-35.597 -5.2,-19.04 -20.08,-35.2 -49.84,-35.2 h -44.88 V 50.91 C 248.225,46.492 255.757,31.796 251.339,18.087 246.92,4.378 232.225,-3.154 218.516,1.264 c -13.709,4.418 -21.241,19.113 -16.823,32.823 2.574,7.988 8.835,14.248 16.823,16.823 v 16 h -44.96 c -21.04,0 -43.28,9.68 -50,35.2 -23.871,3.164 -40.657,25.08 -37.493,48.951 2.499,18.851 16.926,33.908 35.653,37.209 v 0.72 c 2.48,34.24 27.92,46.64 51.84,46.64 h 105.84 c 35.68,0 50,-23.2 51.84,-46.64 23.707,-4.218 39.507,-26.856 35.289,-50.563 z M 121.476,172.43 c -14.558,-4.366 -22.82,-19.708 -18.454,-34.266 2.658,-8.863 9.592,-15.796 18.454,-18.454 z m 94.88,-145.52 c -0.221,-5.563 4.11,-10.251 9.672,-10.472 5.562,-0.221 10.251,4.11 10.472,9.672 0.221,5.563 -4.11,10.251 -9.672,10.472 -0.104,0.004 -0.208,0.007 -0.312,0.008 -5.429,0.006 -9.904,-4.257 -10.16,-9.68 z m 99.12,156.8 c 0,13.52 -4.72,36.08 -36.08,36.08 h -105.84 c -13.52,0 -36.08,-4.72 -36.08,-36.08 v -64 c 0,-31.44 22.64,-36.08 36.08,-36.08 h 105.84 c 31.44,0 36.08,22.64 36.08,36.08 z m 34.534,-29.735 c -2.658,8.863 -9.592,15.796 -18.454,18.454 v -52.72 c 14.558,4.367 22.82,19.708 18.454,34.266 z"
                     id="path898" />
                </g>
              </g>
              <g
                 id="g908">
                <g
                   id="g906">
                  <path
                     inkscape:connector-curvature="0"
                     d="m 271.076,185.79 h -89.12 c -4.418,0 -8,3.582 -8,8 0,4.418 3.582,8 8,8 h 89.12 c 4.418,0 8,-3.582 8,-8 0,-4.418 -3.582,-8 -8,-8 z"
                     id="path904" />
                </g>
              </g>
              <g
                 id="g914">
                <g
                   id="g912">
                  <path
                     inkscape:connector-curvature="0"
                     d="m 253.865,307.538 c -1.516,-1.719 -3.697,-2.705 -5.989,-2.708 h -0.08 -28.16 l 33.2,-27.12 c 3.402,-2.85 3.85,-7.918 1,-11.32 -2.85,-3.402 -7.918,-3.85 -11.32,-1 l -50.4,41.52 c -3.446,2.765 -3.999,7.8 -1.234,11.246 1.526,1.902 3.836,3.004 6.274,2.994 h 29.36 l -34.64,30.4 c -2.855,3.372 -2.435,8.42 0.937,11.275 2.755,2.332 6.73,2.531 9.703,0.485 l 50.64,-44.48 c 3.314,-2.923 3.631,-7.978 0.709,-11.292 z"
                     id="path910" />
                </g>
              </g>
              <g
                 id="g920">
                <g
                   id="g918">
                  <path
                     inkscape:connector-curvature="0"
                     d="m 138.516,390.19 v 0 c -11.797,0 -21.36,9.563 -21.36,21.36 0,11.797 9.563,21.36 21.36,21.36 11.797,0 21.36,-9.563 21.36,-21.36 0,-11.797 -9.563,-21.36 -21.36,-21.36 z m 0,26.72 c -2.96,0 -5.36,-2.4 -5.36,-5.36 0,-2.96 2.4,-5.36 5.36,-5.36 2.96,0 5.36,2.4 5.36,5.36 0,2.96 -2.4,5.36 -5.36,5.36 z"
                     id="path916" />
                </g>
              </g>
              <g
                 id="g926">
                <g
                   id="g924">
                  <path
                     inkscape:connector-curvature="0"
                     d="m 226.516,390.19 v 0 c -11.797,0 -21.36,9.563 -21.36,21.36 0,11.797 9.563,21.36 21.36,21.36 11.797,0 21.36,-9.563 21.36,-21.36 0,-11.797 -9.563,-21.36 -21.36,-21.36 z m 5.36,21.36 c 0,2.96 -2.4,5.36 -5.36,5.36 -2.96,0 -5.36,-2.4 -5.36,-5.36 0,-2.96 2.4,-5.36 5.36,-5.36 2.96,0 5.36,2.399 5.36,5.36 z"
                     id="path922" />
                </g>
              </g>
              <g
                 id="g932">
                <g
                   id="g930">
                  <path
                     inkscape:connector-curvature="0"
                     d="m 314.516,390.19 c -11.797,-0.044 -21.396,9.483 -21.44,21.28 0,0.027 0,0.053 0,0.08 0,11.797 9.563,21.36 21.36,21.36 11.797,0 21.36,-9.563 21.36,-21.36 0,-11.766 -9.515,-21.316 -21.28,-21.36 z m -0.08,26.72 c -2.96,0 -5.36,-2.4 -5.36,-5.36 0,-2.96 2.4,-5.36 5.36,-5.36 v 0 c 2.96,0 5.36,2.4 5.36,5.36 0,2.96 -2.4,5.36 -5.36,5.36 z"
                     id="path928" />
                </g>
              </g>
              <g
                 id="g938">
                <g
                   id="g936">
                  <path
                     inkscape:connector-curvature="0"
                     d="m 403.796,297.87 v 0 l -6.48,-11.68 c -26.08,-45.84 -78.4,-43.28 -82.8,-43.28 h -176 c -4.72,0 -56.96,-2.88 -83.2,43.04 l -6.4,11.6 c -14.597,2.581 -25.188,15.337 -25.04,30.16 0,4.418 3.582,8 8,8 4.418,0 8,-3.582 8,-8 0,-7.931 6.429,-14.36 14.36,-14.36 7.931,0 14.36,6.429 14.36,14.36 0,4.418 3.582,8 8,8 4.418,0 8,-3.582 8,-8 -0.013,-12.013 -7.098,-22.892 -18.08,-27.76 l 3.2,-5.76 c 11.081,-18.788 30.269,-31.354 51.92,-34 v 109.12 h -0.4 c -23.13,1.011 -41.06,20.581 -40.049,43.711 0.949,21.713 18.336,39.1 40.049,40.049 h 210.72 c 23.13,1.011 42.7,-16.92 43.711,-40.049 1.011,-23.13 -16.92,-42.7 -40.049,-43.711 -1.22,-0.053 -2.441,-0.053 -3.661,0 h -0.4 V 260.19 c 21.608,2.646 40.776,15.139 51.92,33.84 l 3.28,5.92 c -11.045,4.82 -18.2,15.709 -18.24,27.76 0,4.418 3.582,8 8,8 4.418,0 8,-3.582 8,-8 0,-7.931 6.429,-14.36 14.36,-14.36 7.931,0 14.36,6.429 14.36,14.36 0,4.418 3.582,8 8,8 4.418,0 8,-3.582 8,-8 -0.042,-14.83 -10.805,-27.453 -25.441,-29.84 z m -265.92,-38.96 h 177.68 v 110.4 h -177.68 z m 194.08,126.72 c 14.293,-0.795 26.524,10.148 27.319,24.441 0.795,14.293 -10.148,26.524 -24.441,27.319 -0.959,0.053 -1.92,0.053 -2.879,0 h -210.88 c -14.293,-0.795 -25.236,-13.026 -24.441,-27.319 0.733,-13.183 11.258,-23.708 24.441,-24.441 z"
                     id="path934" />
                </g>
              </g>
              <g
                 id="g940" />
              <g
                 id="g942" />
              <g
                 id="g944" />
              <g
                 id="g946" />
              <g
                 id="g948" />
              <g
                 id="g950" />
              <g
                 id="g952" />
              <g
                 id="g954" />
              <g
                 id="g956" />
              <g
                 id="g958" />
              <g
                 id="g960" />
              <g
                 id="g962" />
              <g
                 id="g964" />
              <g
                 id="g966" />
              <g
                 id="g968" />
            </g>
            <g
               transform="matrix(0.03197133,0,0,0.03197133,54.341836,119.57994)"
               id="g1147">
              <g
                 id="g1049">
                <g
                   id="g1047">
                  <path
                     id="path1045"
                     d="m 341.119,179.914 c -1.531,-2.834 -3.333,-5.548 -5.36,-8.068 -4.115,-5.114 -9.074,-9.379 -14.737,-12.674 -8.083,-4.705 -17.323,-7.191 -26.721,-7.191 h -76.604 c -29.327,0 -53.187,23.859 -53.187,53.186 v 99.445 c 0,7.193 5.853,13.045 13.046,13.045 h 22.626 v 7.596 c 0,4.404 3.57,7.975 7.975,7.975 4.405,0 7.975,-3.571 7.975,-7.975 v -15.571 c 0,-0.482 -0.05,-0.952 -0.132,-1.41 v -90.254 c 0,-4.404 -3.57,-7.975 -7.975,-7.975 -4.405,0 -7.975,3.571 -7.975,7.975 v 83.689 h -19.59 v -96.54 c 0,-20.532 16.704,-37.236 37.237,-37.236 h 76.604 c 6.583,0 13.048,1.738 18.698,5.026 3.97,2.31 7.447,5.301 10.332,8.888 1.421,1.765 2.683,3.666 3.756,5.651 2.912,5.388 4.451,11.499 4.451,17.671 0,4.404 3.57,7.975 7.975,7.975 4.405,0 7.975,-3.571 7.975,-7.975 0,-8.811 -2.202,-17.544 -6.369,-25.253 z"
                     inkscape:connector-curvature="0" />
                </g>
              </g>
              <g
                 id="g1055">
                <g
                   id="g1053">
                  <path
                     id="path1051"
                     d="m 339.514,226.769 c -4.405,0 -7.975,3.571 -7.975,7.975 v 66.964 h -19.852 v -83.689 c 0,-4.404 -3.57,-7.975 -7.975,-7.975 -4.405,0 -7.975,3.571 -7.975,7.975 v 91.664 c 0,0.477 0.049,0.942 0.13,1.396 v 128.258 h -79.734 v -82.802 c 0,-4.405 -3.57,-7.975 -7.975,-7.975 -4.405,0 -7.975,3.571 -7.975,7.975 v 90.777 c 0,4.404 3.57,7.975 7.975,7.975 h 95.684 c 4.405,0 7.975,-3.571 7.975,-7.975 V 317.658 h 22.626 c 7.193,0 13.046,-5.852 13.046,-13.045 v -69.869 c -10e-4,-4.404 -3.571,-7.975 -7.975,-7.975 z"
                     inkscape:connector-curvature="0" />
                </g>
              </g>
              <g
                 id="g1061">
                <g
                   id="g1059">
                  <path
                     id="path1057"
                     d="m 257.709,56.712 c -25.268,0 -45.824,20.557 -45.824,45.825 0,25.268 20.556,45.825 45.824,45.825 25.268,0 45.825,-20.557 45.825,-45.825 0,-25.268 -20.557,-45.825 -45.825,-45.825 z m 0,75.7 c -16.472,0 -29.874,-13.402 -29.874,-29.875 0,-16.473 13.402,-29.874 29.874,-29.874 16.473,0 29.874,13.401 29.874,29.874 -0.001,16.473 -13.402,29.875 -29.874,29.875 z"
                     inkscape:connector-curvature="0" />
                </g>
              </g>
            </g>
            <text
               xml:space="preserve"
               style="font-style:normal;font-variant:normal;font-weight:bold;font-stretch:normal;font-size:1.34733403px;line-height:1.25;font-family:sans-serif;-inkscape-font-specification:'sans-serif Bold';letter-spacing:0px;word-spacing:0px;fill:#000000;fill-opacity:1;stroke:none;stroke-width:0.0777308"
               x="50.367432"
               y="103.60397"
               id="text3803"><tspan
                 sodipodi:role="line"
                 id="tspan3801"
                 x="50.367432"
                 y="103.60397"
                 style="font-style:normal;font-variant:normal;font-weight:bold;font-stretch:normal;font-size:1.93879533px;font-family:sans-serif;-inkscape-font-specification:'sans-serif Bold';stroke-width:0.0777308">I will show you</tspan><tspan
                 sodipodi:role="line"
                 x="50.367432"
                 y="106.02747"
                 style="font-style:normal;font-variant:normal;font-weight:bold;font-stretch:normal;font-size:1.93879533px;font-family:sans-serif;-inkscape-font-specification:'sans-serif Bold';stroke-width:0.0777308"
                 id="tspan3805">the <tspan
   style="font-style:italic;font-variant:normal;font-weight:normal;font-stretch:normal;font-size:1.93879533px;font-family:sans-serif;-inkscape-font-specification:'sans-serif Italic';stroke-width:0.0777308"
   id="tspan3819">kitchen</tspan>.</tspan></text>
            <text
               xml:space="preserve"
               style="font-style:normal;font-variant:normal;font-weight:bold;font-stretch:normal;font-size:1.34733403px;line-height:1.25;font-family:sans-serif;-inkscape-font-specification:'sans-serif Bold';letter-spacing:0px;word-spacing:0px;fill:#000000;fill-opacity:1;stroke:none;stroke-width:0.0777308"
               x="35.225491"
               y="113.25362"
               id="text3813"><tspan
                 sodipodi:role="line"
                 x="35.225491"
                 y="113.25362"
                 style="font-size:1.93879533px;stroke-width:0.0777308"
                 id="tspan3815">Okay, guide me</tspan><tspan
                 sodipodi:role="line"
                 x="35.225491"
                 y="115.67711"
                 style="font-size:1.93879533px;stroke-width:0.0777308"
                 id="tspan3824">to <tspan
   style="font-style:italic;font-variant:normal;font-weight:normal;font-stretch:normal;font-size:1.93879533px;font-family:sans-serif;-inkscape-font-specification:'sans-serif Italic';stroke-width:0.0777308"
   id="tspan3817">kitchen</tspan> .</tspan></text>
          </g>
          <g
             id="g2226"
             transform="translate(3.3051324,0.04735625)">
            <g
               transform="matrix(0.03197133,0,0,0.03197133,35.214263,127.11763)"
               id="g1136">
              <g
                 id="g1063" />
              <g
                 id="g1065" />
              <g
                 id="g1067" />
              <g
                 id="g1069" />
              <g
                 id="g1071" />
              <g
                 id="g1073" />
              <g
                 id="g1075" />
              <g
                 id="g1077" />
              <g
                 id="g1079" />
              <g
                 id="g1081" />
              <g
                 id="g1083" />
              <g
                 id="g1085" />
              <g
                 id="g1087" />
              <g
                 id="g1089" />
              <g
                 id="g1091" />
              <g
                 transform="matrix(0.87964122,0,0,0.87964122,1591.8689,30.453079)"
                 id="g1019-0">
                <g
                   id="g890-6">
                  <g
                     id="g888-1">
                    <path
                       inkscape:connector-curvature="0"
                       d="m 181.956,102.43 c -17.275,0 -31.28,14.005 -31.28,31.28 0.044,17.257 14.023,31.236 31.28,31.28 17.275,0 31.28,-14.005 31.28,-31.28 0,-17.275 -14.005,-31.28 -31.28,-31.28 z m 0,46.48 c -8.439,0 -15.28,-6.841 -15.28,-15.28 0,-8.439 6.841,-15.28 15.28,-15.28 8.439,0 15.28,6.841 15.28,15.28 0,8.439 -6.841,15.28 -15.28,15.28 z"
                       id="path886-5" />
                  </g>
                </g>
                <g
                   id="g896-9">
                  <g
                     id="g894-4">
                    <path
                       inkscape:connector-curvature="0"
                       d="m 271.076,102.43 c -17.275,0 -31.28,14.005 -31.28,31.28 0.044,17.257 14.023,31.236 31.28,31.28 17.276,0 31.28,-14.005 31.28,-31.28 0,-17.275 -14.005,-31.28 -31.28,-31.28 z m 0,46.48 c -8.439,0 -15.28,-6.841 -15.28,-15.28 0,-8.439 6.841,-15.28 15.28,-15.28 8.439,0 15.28,6.841 15.28,15.28 0,8.439 -6.841,15.28 -15.28,15.28 z"
                       id="path892-9" />
                  </g>
                </g>
                <g
                   id="g902-0">
                  <g
                     id="g900-9">
                    <path
                       inkscape:connector-curvature="0"
                       d="m 366.525,138.427 c -3.332,-18.73 -18.424,-33.137 -37.289,-35.597 -5.2,-19.04 -20.08,-35.2 -49.84,-35.2 h -44.88 V 50.91 C 248.225,46.492 255.757,31.796 251.339,18.087 246.92,4.378 232.225,-3.154 218.516,1.264 c -13.709,4.418 -21.241,19.113 -16.823,32.823 2.574,7.988 8.835,14.248 16.823,16.823 v 16 h -44.96 c -21.04,0 -43.28,9.68 -50,35.2 -23.871,3.164 -40.657,25.08 -37.493,48.951 2.499,18.851 16.926,33.908 35.653,37.209 v 0.72 c 2.48,34.24 27.92,46.64 51.84,46.64 h 105.84 c 35.68,0 50,-23.2 51.84,-46.64 23.707,-4.218 39.507,-26.856 35.289,-50.563 z M 121.476,172.43 c -14.558,-4.366 -22.82,-19.708 -18.454,-34.266 2.658,-8.863 9.592,-15.796 18.454,-18.454 z m 94.88,-145.52 c -0.221,-5.563 4.11,-10.251 9.672,-10.472 5.562,-0.221 10.251,4.11 10.472,9.672 0.221,5.563 -4.11,10.251 -9.672,10.472 -0.104,0.004 -0.208,0.007 -0.312,0.008 -5.429,0.006 -9.904,-4.257 -10.16,-9.68 z m 99.12,156.8 c 0,13.52 -4.72,36.08 -36.08,36.08 h -105.84 c -13.52,0 -36.08,-4.72 -36.08,-36.08 v -64 c 0,-31.44 22.64,-36.08 36.08,-36.08 h 105.84 c 31.44,0 36.08,22.64 36.08,36.08 z m 34.534,-29.735 c -2.658,8.863 -9.592,15.796 -18.454,18.454 v -52.72 c 14.558,4.367 22.82,19.708 18.454,34.266 z"
                       id="path898-1" />
                  </g>
                </g>
                <g
                   id="g908-7">
                  <g
                     id="g906-7">
                    <path
                       inkscape:connector-curvature="0"
                       d="m 271.076,185.79 h -89.12 c -4.418,0 -8,3.582 -8,8 0,4.418 3.582,8 8,8 h 89.12 c 4.418,0 8,-3.582 8,-8 0,-4.418 -3.582,-8 -8,-8 z"
                       id="path904-1" />
                  </g>
                </g>
                <g
                   id="g914-1">
                  <g
                     id="g912-5">
                    <path
                       inkscape:connector-curvature="0"
                       d="m 253.865,307.538 c -1.516,-1.719 -3.697,-2.705 -5.989,-2.708 h -0.08 -28.16 l 33.2,-27.12 c 3.402,-2.85 3.85,-7.918 1,-11.32 -2.85,-3.402 -7.918,-3.85 -11.32,-1 l -50.4,41.52 c -3.446,2.765 -3.999,7.8 -1.234,11.246 1.526,1.902 3.836,3.004 6.274,2.994 h 29.36 l -34.64,30.4 c -2.855,3.372 -2.435,8.42 0.937,11.275 2.755,2.332 6.73,2.531 9.703,0.485 l 50.64,-44.48 c 3.314,-2.923 3.631,-7.978 0.709,-11.292 z"
                       id="path910-9" />
                  </g>
                </g>
                <g
                   id="g920-7">
                  <g
                     id="g918-7">
                    <path
                       inkscape:connector-curvature="0"
                       d="m 138.516,390.19 v 0 c -11.797,0 -21.36,9.563 -21.36,21.36 0,11.797 9.563,21.36 21.36,21.36 11.797,0 21.36,-9.563 21.36,-21.36 0,-11.797 -9.563,-21.36 -21.36,-21.36 z m 0,26.72 c -2.96,0 -5.36,-2.4 -5.36,-5.36 0,-2.96 2.4,-5.36 5.36,-5.36 2.96,0 5.36,2.4 5.36,5.36 0,2.96 -2.4,5.36 -5.36,5.36 z"
                       id="path916-6" />
                  </g>
                </g>
                <g
                   id="g926-7">
                  <g
                     id="g924-3">
                    <path
                       inkscape:connector-curvature="0"
                       d="m 226.516,390.19 v 0 c -11.797,0 -21.36,9.563 -21.36,21.36 0,11.797 9.563,21.36 21.36,21.36 11.797,0 21.36,-9.563 21.36,-21.36 0,-11.797 -9.563,-21.36 -21.36,-21.36 z m 5.36,21.36 c 0,2.96 -2.4,5.36 -5.36,5.36 -2.96,0 -5.36,-2.4 -5.36,-5.36 0,-2.96 2.4,-5.36 5.36,-5.36 2.96,0 5.36,2.399 5.36,5.36 z"
                       id="path922-6" />
                  </g>
                </g>
                <g
                   id="g932-5">
                  <g
                     id="g930-6">
                    <path
                       inkscape:connector-curvature="0"
                       d="m 314.516,390.19 c -11.797,-0.044 -21.396,9.483 -21.44,21.28 0,0.027 0,0.053 0,0.08 0,11.797 9.563,21.36 21.36,21.36 11.797,0 21.36,-9.563 21.36,-21.36 0,-11.766 -9.515,-21.316 -21.28,-21.36 z m -0.08,26.72 c -2.96,0 -5.36,-2.4 -5.36,-5.36 0,-2.96 2.4,-5.36 5.36,-5.36 v 0 c 2.96,0 5.36,2.4 5.36,5.36 0,2.96 -2.4,5.36 -5.36,5.36 z"
                       id="path928-3" />
                  </g>
                </g>
                <g
                   id="g938-9">
                  <g
                     id="g936-4">
                    <path
                       inkscape:connector-curvature="0"
                       d="m 403.796,297.87 v 0 l -6.48,-11.68 c -26.08,-45.84 -78.4,-43.28 -82.8,-43.28 h -176 c -4.72,0 -56.96,-2.88 -83.2,43.04 l -6.4,11.6 c -14.597,2.581 -25.188,15.337 -25.04,30.16 0,4.418 3.582,8 8,8 4.418,0 8,-3.582 8,-8 0,-7.931 6.429,-14.36 14.36,-14.36 7.931,0 14.36,6.429 14.36,14.36 0,4.418 3.582,8 8,8 4.418,0 8,-3.582 8,-8 -0.013,-12.013 -7.098,-22.892 -18.08,-27.76 l 3.2,-5.76 c 11.081,-18.788 30.269,-31.354 51.92,-34 v 109.12 h -0.4 c -23.13,1.011 -41.06,20.581 -40.049,43.711 0.949,21.713 18.336,39.1 40.049,40.049 h 210.72 c 23.13,1.011 42.7,-16.92 43.711,-40.049 1.011,-23.13 -16.92,-42.7 -40.049,-43.711 -1.22,-0.053 -2.441,-0.053 -3.661,0 h -0.4 V 260.19 c 21.608,2.646 40.776,15.139 51.92,33.84 l 3.28,5.92 c -11.045,4.82 -18.2,15.709 -18.24,27.76 0,4.418 3.582,8 8,8 4.418,0 8,-3.582 8,-8 0,-7.931 6.429,-14.36 14.36,-14.36 7.931,0 14.36,6.429 14.36,14.36 0,4.418 3.582,8 8,8 4.418,0 8,-3.582 8,-8 -0.042,-14.83 -10.805,-27.453 -25.441,-29.84 z m -265.92,-38.96 h 177.68 v 110.4 h -177.68 z m 194.08,126.72 c 14.293,-0.795 26.524,10.148 27.319,24.441 0.795,14.293 -10.148,26.524 -24.441,27.319 -0.959,0.053 -1.92,0.053 -2.879,0 h -210.88 c -14.293,-0.795 -25.236,-13.026 -24.441,-27.319 0.733,-13.183 11.258,-23.708 24.441,-24.441 z"
                       id="path934-8" />
                  </g>
                </g>
                <g
                   id="g940-1" />
                <g
                   id="g942-2" />
                <g
                   id="g944-9" />
                <g
                   id="g946-3" />
                <g
                   id="g948-9" />
                <g
                   id="g950-0" />
                <g
                   id="g952-8" />
                <g
                   id="g954-8" />
                <g
                   id="g956-5" />
                <g
                   id="g958-0" />
                <g
                   id="g960-9" />
                <g
                   id="g962-6" />
                <g
                   id="g964-3" />
                <g
                   id="g966-8" />
                <g
                   id="g968-5" />
              </g>
              <g
                 transform="translate(2546.0733,-26.259281)"
                 id="g1147-6">
                <g
                   id="g1049-1">
                  <g
                     id="g1047-1">
                    <path
                       id="path1045-5"
                       d="m 341.119,179.914 c -1.531,-2.834 -3.333,-5.548 -5.36,-8.068 -4.115,-5.114 -9.074,-9.379 -14.737,-12.674 -8.083,-4.705 -17.323,-7.191 -26.721,-7.191 h -76.604 c -29.327,0 -53.187,23.859 -53.187,53.186 v 99.445 c 0,7.193 5.853,13.045 13.046,13.045 h 22.626 v 7.596 c 0,4.404 3.57,7.975 7.975,7.975 4.405,0 7.975,-3.571 7.975,-7.975 v -15.571 c 0,-0.482 -0.05,-0.952 -0.132,-1.41 v -90.254 c 0,-4.404 -3.57,-7.975 -7.975,-7.975 -4.405,0 -7.975,3.571 -7.975,7.975 v 83.689 h -19.59 v -96.54 c 0,-20.532 16.704,-37.236 37.237,-37.236 h 76.604 c 6.583,0 13.048,1.738 18.698,5.026 3.97,2.31 7.447,5.301 10.332,8.888 1.421,1.765 2.683,3.666 3.756,5.651 2.912,5.388 4.451,11.499 4.451,17.671 0,4.404 3.57,7.975 7.975,7.975 4.405,0 7.975,-3.571 7.975,-7.975 0,-8.811 -2.202,-17.544 -6.369,-25.253 z"
                       inkscape:connector-curvature="0" />
                  </g>
                </g>
                <g
                   id="g1055-9">
                  <g
                     id="g1053-8">
                    <path
                       id="path1051-4"
                       d="m 339.514,226.769 c -4.405,0 -7.975,3.571 -7.975,7.975 v 66.964 h -19.852 v -83.689 c 0,-4.404 -3.57,-7.975 -7.975,-7.975 -4.405,0 -7.975,3.571 -7.975,7.975 v 91.664 c 0,0.477 0.049,0.942 0.13,1.396 v 128.258 h -79.734 v -82.802 c 0,-4.405 -3.57,-7.975 -7.975,-7.975 -4.405,0 -7.975,3.571 -7.975,7.975 v 90.777 c 0,4.404 3.57,7.975 7.975,7.975 h 95.684 c 4.405,0 7.975,-3.571 7.975,-7.975 V 317.658 h 22.626 c 7.193,0 13.046,-5.852 13.046,-13.045 v -69.869 c -10e-4,-4.404 -3.571,-7.975 -7.975,-7.975 z"
                       inkscape:connector-curvature="0" />
                  </g>
                </g>
                <g
                   id="g1061-8">
                  <g
                     id="g1059-1">
                    <path
                       id="path1057-0"
                       d="m 257.709,56.712 c -25.268,0 -45.824,20.557 -45.824,45.825 0,25.268 20.556,45.825 45.824,45.825 25.268,0 45.825,-20.557 45.825,-45.825 0,-25.268 -20.557,-45.825 -45.825,-45.825 z m 0,75.7 c -16.472,0 -29.874,-13.402 -29.874,-29.875 0,-16.473 13.402,-29.874 29.874,-29.874 16.473,0 29.874,13.401 29.874,29.874 -0.001,16.473 -13.402,29.875 -29.874,29.875 z"
                       inkscape:connector-curvature="0" />
                  </g>
                </g>
              </g>
            </g>
            <path
               inkscape:connector-curvature="0"
               id="path1504"
               d="M 97.546008,134.46273 H 120.19718"
               style="fill:none;stroke:#000000;stroke-width:0.52820724;stroke-linecap:butt;stroke-linejoin:miter;stroke-miterlimit:4;stroke-dasharray:none;stroke-opacity:1;marker-end:url(#Arrow1Lend)"
               sodipodi:nodetypes="cc" />
            <text
               xml:space="preserve"
               style="font-style:normal;font-variant:normal;font-weight:bold;font-stretch:normal;font-size:2.80048227px;line-height:1;font-family:sans-serif;-inkscape-font-specification:'sans-serif Bold';letter-spacing:0px;word-spacing:0px;fill:#000000;fill-opacity:1;stroke:none;stroke-width:0.16156629"
               x="105.5006"
               y="134.18523"
               id="text1364"><tspan
                 sodipodi:role="line"
                 id="tspan1362"
                 x="105.5006"
                 y="134.18523"
                 style="font-style:italic;font-variant:normal;font-weight:normal;font-stretch:normal;font-size:2.80048227px;line-height:1;font-family:sans-serif;-inkscape-font-specification:'sans-serif Italic';text-align:center;text-anchor:middle;stroke-width:0.16156629">Robot</tspan><tspan
                 sodipodi:role="line"
                 x="105.5006"
                 y="136.9857"
                 style="font-style:italic;font-variant:normal;font-weight:normal;font-stretch:normal;font-size:2.80048227px;line-height:1;font-family:sans-serif;-inkscape-font-specification:'sans-serif Italic';text-align:center;text-anchor:middle;stroke-width:0.16156629"
                 id="tspan1666">Following</tspan></text>
          </g>
          <g
             id="layer1-4"
             inkscape:label="Layer 1"
             transform="matrix(0.29378622,0,0,0.29378622,140.17709,95.473805)">
            <path
               sodipodi:nodetypes="cccccccc"
               inkscape:connector-curvature="0"
               id="path880-3"
               d="m 140.32551,1.2535831 c -18.93404,-1.056e-4 -34.28321,7.2104031 -34.28343,16.1051019 0.016,5.524357 6.05843,10.659315 16.00788,13.604143 l 20.9698,22.730066 -6.62993,-20.345645 c 1.30603,0.0742 2.62009,0.113348 3.93568,0.117093 18.93409,-3.5e-5 34.28308,-7.210754 34.28279,-16.105589 C 174.60809,8.4641562 159.25924,1.2536852 140.32551,1.2536478 Z"
               style="opacity:1;fill:#000000;fill-opacity:0.04278074;stroke:#000000;stroke-width:1.34962201;stroke-miterlimit:4;stroke-dasharray:none;stroke-opacity:1" />
            <g
               transform="matrix(0.26458333,0,0,0.26458333,-3.5885136,15.451045)"
               id="g3595-4">
              <g
                 id="g3496-7">
                <g
                   id="g3494-6" />
              </g>
              <g
                 id="g3522-3" />
              <g
                 id="g3524-1" />
              <g
                 id="g3526-7" />
              <g
                 id="g3528-5" />
              <g
                 id="g3530-9" />
              <g
                 id="g3532-6" />
              <g
                 id="g3534-2" />
              <g
                 id="g3536-1" />
              <g
                 id="g3538-7" />
              <g
                 id="g3540-8" />
              <g
                 id="g3542-5" />
              <g
                 id="g3544-7" />
              <g
                 id="g3546-4" />
              <g
                 id="g3548-1" />
              <g
                 id="g3550-8" />
              <g
                 transform="matrix(3.7795276,0,0,3.7795276,57.217855,-33.202768)"
                 inkscape:label="Layer 1"
                 id="layer1-5-5">
                <path
                   inkscape:connector-curvature="0"
                   id="rect871-6"
                   d="m 49.905391,25.476702 c -3.68114,0 -6.6447,2.362874 -6.6447,5.297866 v 15.993398 c 0,2.935025 2.96356,5.297866 6.6447,5.297866 h 24.58675 l -2.14531,14.494213 22.04206,-14.494213 h 9.551409 c 3.68113,0 6.6447,-2.362841 6.6447,-5.297866 V 30.774568 c 0,-2.934992 -2.96357,-5.297866 -6.6447,-5.297866 z"
                   style="opacity:1;fill:#000000;fill-opacity:0.04278074;stroke:#000000;stroke-width:1.39470446;stroke-miterlimit:4;stroke-dasharray:none;stroke-opacity:1" />
                <g
                   id="g1019-5"
                   transform="matrix(0.09572723,0,0,0.09572723,28.037002,104.5194)">
                  <g
                     id="g890-3">
                    <g
                       id="g888-8">
                      <path
                         id="path886-8"
                         d="m 181.956,102.43 c -17.275,0 -31.28,14.005 -31.28,31.28 0.044,17.257 14.023,31.236 31.28,31.28 17.275,0 31.28,-14.005 31.28,-31.28 0,-17.275 -14.005,-31.28 -31.28,-31.28 z m 0,46.48 c -8.439,0 -15.28,-6.841 -15.28,-15.28 0,-8.439 6.841,-15.28 15.28,-15.28 8.439,0 15.28,6.841 15.28,15.28 0,8.439 -6.841,15.28 -15.28,15.28 z"
                         inkscape:connector-curvature="0" />
                    </g>
                  </g>
                  <g
                     id="g896-3">
                    <g
                       id="g894-1">
                      <path
                         id="path892-8"
                         d="m 271.076,102.43 c -17.275,0 -31.28,14.005 -31.28,31.28 0.044,17.257 14.023,31.236 31.28,31.28 17.276,0 31.28,-14.005 31.28,-31.28 0,-17.275 -14.005,-31.28 -31.28,-31.28 z m 0,46.48 c -8.439,0 -15.28,-6.841 -15.28,-15.28 0,-8.439 6.841,-15.28 15.28,-15.28 8.439,0 15.28,6.841 15.28,15.28 0,8.439 -6.841,15.28 -15.28,15.28 z"
                         inkscape:connector-curvature="0" />
                    </g>
                  </g>
                  <g
                     id="g902-9">
                    <g
                       id="g900-6">
                      <path
                         id="path898-4"
                         d="m 366.525,138.427 c -3.332,-18.73 -18.424,-33.137 -37.289,-35.597 -5.2,-19.04 -20.08,-35.2 -49.84,-35.2 h -44.88 V 50.91 C 248.225,46.492 255.757,31.796 251.339,18.087 246.92,4.378 232.225,-3.154 218.516,1.264 c -13.709,4.418 -21.241,19.113 -16.823,32.823 2.574,7.988 8.835,14.248 16.823,16.823 v 16 h -44.96 c -21.04,0 -43.28,9.68 -50,35.2 -23.871,3.164 -40.657,25.08 -37.493,48.951 2.499,18.851 16.926,33.908 35.653,37.209 v 0.72 c 2.48,34.24 27.92,46.64 51.84,46.64 h 105.84 c 35.68,0 50,-23.2 51.84,-46.64 23.707,-4.218 39.507,-26.856 35.289,-50.563 z M 121.476,172.43 c -14.558,-4.366 -22.82,-19.708 -18.454,-34.266 2.658,-8.863 9.592,-15.796 18.454,-18.454 z m 94.88,-145.52 c -0.221,-5.563 4.11,-10.251 9.672,-10.472 5.562,-0.221 10.251,4.11 10.472,9.672 0.221,5.563 -4.11,10.251 -9.672,10.472 -0.104,0.004 -0.208,0.007 -0.312,0.008 -5.429,0.006 -9.904,-4.257 -10.16,-9.68 z m 99.12,156.8 c 0,13.52 -4.72,36.08 -36.08,36.08 h -105.84 c -13.52,0 -36.08,-4.72 -36.08,-36.08 v -64 c 0,-31.44 22.64,-36.08 36.08,-36.08 h 105.84 c 31.44,0 36.08,22.64 36.08,36.08 z m 34.534,-29.735 c -2.658,8.863 -9.592,15.796 -18.454,18.454 v -52.72 c 14.558,4.367 22.82,19.708 18.454,34.266 z"
                         inkscape:connector-curvature="0" />
                    </g>
                  </g>
                  <g
                     id="g908-3">
                    <g
                       id="g906-3">
                      <path
                         id="path904-3"
                         d="m 271.076,185.79 h -89.12 c -4.418,0 -8,3.582 -8,8 0,4.418 3.582,8 8,8 h 89.12 c 4.418,0 8,-3.582 8,-8 0,-4.418 -3.582,-8 -8,-8 z"
                         inkscape:connector-curvature="0" />
                    </g>
                  </g>
                  <g
                     id="g914-8">
                    <g
                       id="g912-6">
                      <path
                         id="path910-0"
                         d="m 253.865,307.538 c -1.516,-1.719 -3.697,-2.705 -5.989,-2.708 h -0.08 -28.16 l 33.2,-27.12 c 3.402,-2.85 3.85,-7.918 1,-11.32 -2.85,-3.402 -7.918,-3.85 -11.32,-1 l -50.4,41.52 c -3.446,2.765 -3.999,7.8 -1.234,11.246 1.526,1.902 3.836,3.004 6.274,2.994 h 29.36 l -34.64,30.4 c -2.855,3.372 -2.435,8.42 0.937,11.275 2.755,2.332 6.73,2.531 9.703,0.485 l 50.64,-44.48 c 3.314,-2.923 3.631,-7.978 0.709,-11.292 z"
                         inkscape:connector-curvature="0" />
                    </g>
                  </g>
                  <g
                     id="g920-4">
                    <g
                       id="g918-8">
                      <path
                         id="path916-8"
                         d="m 138.516,390.19 v 0 c -11.797,0 -21.36,9.563 -21.36,21.36 0,11.797 9.563,21.36 21.36,21.36 11.797,0 21.36,-9.563 21.36,-21.36 0,-11.797 -9.563,-21.36 -21.36,-21.36 z m 0,26.72 c -2.96,0 -5.36,-2.4 -5.36,-5.36 0,-2.96 2.4,-5.36 5.36,-5.36 2.96,0 5.36,2.4 5.36,5.36 0,2.96 -2.4,5.36 -5.36,5.36 z"
                         inkscape:connector-curvature="0" />
                    </g>
                  </g>
                  <g
                     id="g926-8">
                    <g
                       id="g924-9">
                      <path
                         id="path922-7"
                         d="m 226.516,390.19 v 0 c -11.797,0 -21.36,9.563 -21.36,21.36 0,11.797 9.563,21.36 21.36,21.36 11.797,0 21.36,-9.563 21.36,-21.36 0,-11.797 -9.563,-21.36 -21.36,-21.36 z m 5.36,21.36 c 0,2.96 -2.4,5.36 -5.36,5.36 -2.96,0 -5.36,-2.4 -5.36,-5.36 0,-2.96 2.4,-5.36 5.36,-5.36 2.96,0 5.36,2.399 5.36,5.36 z"
                         inkscape:connector-curvature="0" />
                    </g>
                  </g>
                  <g
                     id="g932-7">
                    <g
                       id="g930-64">
                      <path
                         id="path928-30"
                         d="m 314.516,390.19 c -11.797,-0.044 -21.396,9.483 -21.44,21.28 0,0.027 0,0.053 0,0.08 0,11.797 9.563,21.36 21.36,21.36 11.797,0 21.36,-9.563 21.36,-21.36 0,-11.766 -9.515,-21.316 -21.28,-21.36 z m -0.08,26.72 c -2.96,0 -5.36,-2.4 -5.36,-5.36 0,-2.96 2.4,-5.36 5.36,-5.36 v 0 c 2.96,0 5.36,2.4 5.36,5.36 0,2.96 -2.4,5.36 -5.36,5.36 z"
                         inkscape:connector-curvature="0" />
                    </g>
                  </g>
                  <g
                     id="g938-3">
                    <g
                       id="g936-0">
                      <path
                         id="path934-9"
                         d="m 403.796,297.87 v 0 l -6.48,-11.68 c -26.08,-45.84 -78.4,-43.28 -82.8,-43.28 h -176 c -4.72,0 -56.96,-2.88 -83.2,43.04 l -6.4,11.6 c -14.597,2.581 -25.188,15.337 -25.04,30.16 0,4.418 3.582,8 8,8 4.418,0 8,-3.582 8,-8 0,-7.931 6.429,-14.36 14.36,-14.36 7.931,0 14.36,6.429 14.36,14.36 0,4.418 3.582,8 8,8 4.418,0 8,-3.582 8,-8 -0.013,-12.013 -7.098,-22.892 -18.08,-27.76 l 3.2,-5.76 c 11.081,-18.788 30.269,-31.354 51.92,-34 v 109.12 h -0.4 c -23.13,1.011 -41.06,20.581 -40.049,43.711 0.949,21.713 18.336,39.1 40.049,40.049 h 210.72 c 23.13,1.011 42.7,-16.92 43.711,-40.049 1.011,-23.13 -16.92,-42.7 -40.049,-43.711 -1.22,-0.053 -2.441,-0.053 -3.661,0 h -0.4 V 260.19 c 21.608,2.646 40.776,15.139 51.92,33.84 l 3.28,5.92 c -11.045,4.82 -18.2,15.709 -18.24,27.76 0,4.418 3.582,8 8,8 4.418,0 8,-3.582 8,-8 0,-7.931 6.429,-14.36 14.36,-14.36 7.931,0 14.36,6.429 14.36,14.36 0,4.418 3.582,8 8,8 4.418,0 8,-3.582 8,-8 -0.042,-14.83 -10.805,-27.453 -25.441,-29.84 z m -265.92,-38.96 h 177.68 v 110.4 h -177.68 z m 194.08,126.72 c 14.293,-0.795 26.524,10.148 27.319,24.441 0.795,14.293 -10.148,26.524 -24.441,27.319 -0.959,0.053 -1.92,0.053 -2.879,0 h -210.88 c -14.293,-0.795 -25.236,-13.026 -24.441,-27.319 0.733,-13.183 11.258,-23.708 24.441,-24.441 z"
                         inkscape:connector-curvature="0" />
                    </g>
                  </g>
                  <g
                     id="g940-2" />
                  <g
                     id="g942-5" />
                  <g
                     id="g944-4" />
                  <g
                     id="g946-0" />
                  <g
                     id="g948-5" />
                  <g
                     id="g950-9" />
                  <g
                     id="g952-4" />
                  <g
                     id="g954-6" />
                  <g
                     id="g956-9" />
                  <g
                     id="g958-2" />
                  <g
                     id="g960-2" />
                  <g
                     id="g962-4" />
                  <g
                     id="g964-7" />
                  <g
                     id="g966-7" />
                  <g
                     id="g968-54" />
                </g>
                <g
                   id="g1136-8"
                   transform="matrix(0.10882533,0,0,0.10882533,74.440835,108.57801)">
                  <g
                     id="g1147-1"
                     transform="translate(345.87369,-94.006694)">
                    <g
                       id="g1049-2">
                      <g
                         id="g1047-8">
                        <path
                           inkscape:connector-curvature="0"
                           d="m 341.119,179.914 c -1.531,-2.834 -3.333,-5.548 -5.36,-8.068 -4.115,-5.114 -9.074,-9.379 -14.737,-12.674 -8.083,-4.705 -17.323,-7.191 -26.721,-7.191 h -76.604 c -29.327,0 -53.187,23.859 -53.187,53.186 v 99.445 c 0,7.193 5.853,13.045 13.046,13.045 h 22.626 v 7.596 c 0,4.404 3.57,7.975 7.975,7.975 4.405,0 7.975,-3.571 7.975,-7.975 v -15.571 c 0,-0.482 -0.05,-0.952 -0.132,-1.41 v -90.254 c 0,-4.404 -3.57,-7.975 -7.975,-7.975 -4.405,0 -7.975,3.571 -7.975,7.975 v 83.689 h -19.59 v -96.54 c 0,-20.532 16.704,-37.236 37.237,-37.236 h 76.604 c 6.583,0 13.048,1.738 18.698,5.026 3.97,2.31 7.447,5.301 10.332,8.888 1.421,1.765 2.683,3.666 3.756,5.651 2.912,5.388 4.451,11.499 4.451,17.671 0,4.404 3.57,7.975 7.975,7.975 4.405,0 7.975,-3.571 7.975,-7.975 0,-8.811 -2.202,-17.544 -6.369,-25.253 z"
                           id="path1045-9" />
                      </g>
                    </g>
                    <g
                       id="g1055-3">
                      <g
                         id="g1053-6">
                        <path
                           inkscape:connector-curvature="0"
                           d="m 339.514,226.769 c -4.405,0 -7.975,3.571 -7.975,7.975 v 66.964 h -19.852 v -83.689 c 0,-4.404 -3.57,-7.975 -7.975,-7.975 -4.405,0 -7.975,3.571 -7.975,7.975 v 91.664 c 0,0.477 0.049,0.942 0.13,1.396 v 128.258 h -79.734 v -82.802 c 0,-4.405 -3.57,-7.975 -7.975,-7.975 -4.405,0 -7.975,3.571 -7.975,7.975 v 90.777 c 0,4.404 3.57,7.975 7.975,7.975 h 95.684 c 4.405,0 7.975,-3.571 7.975,-7.975 V 317.658 h 22.626 c 7.193,0 13.046,-5.852 13.046,-13.045 v -69.869 c -10e-4,-4.404 -3.571,-7.975 -7.975,-7.975 z"
                           id="path1051-8" />
                      </g>
                    </g>
                    <g
                       id="g1061-0">
                      <g
                         id="g1059-2">
                        <path
                           inkscape:connector-curvature="0"
                           d="m 257.709,56.712 c -25.268,0 -45.824,20.557 -45.824,45.825 0,25.268 20.556,45.825 45.824,45.825 25.268,0 45.825,-20.557 45.825,-45.825 0,-25.268 -20.557,-45.825 -45.825,-45.825 z m 0,75.7 c -16.472,0 -29.874,-13.402 -29.874,-29.875 0,-16.473 13.402,-29.874 29.874,-29.874 16.473,0 29.874,13.401 29.874,29.874 -0.001,16.473 -13.402,29.875 -29.874,29.875 z"
                           id="path1057-1" />
                      </g>
                    </g>
                  </g>
                  <g
                     id="g1063-0" />
                  <g
                     id="g1065-5" />
                  <g
                     id="g1067-1" />
                  <g
                     id="g1069-1" />
                  <g
                     id="g1071-0" />
                  <g
                     id="g1073-8" />
                  <g
                     id="g1075-5" />
                  <g
                     id="g1077-0" />
                  <g
                     id="g1079-6" />
                  <g
                     id="g1081-4" />
                  <g
                     id="g1083-6" />
                  <g
                     id="g1085-2" />
                  <g
                     id="g1087-5" />
                  <g
                     id="g1089-8" />
                  <g
                     id="g1091-6" />
                </g>
                <text
                   xml:space="preserve"
                   style="font-style:normal;font-variant:normal;font-weight:bold;font-stretch:normal;font-size:9.8777771px;line-height:1.25;font-family:sans-serif;-inkscape-font-specification:'sans-serif Bold';letter-spacing:0px;word-spacing:0px;fill:#000000;fill-opacity:1;stroke:none;stroke-width:0.26458332"
                   x="103.16604"
                   y="24.117813"
                   id="text1170-2"><tspan
                     sodipodi:role="line"
                     id="tspan1168-8"
                     x="103.16604"
                     y="32.85733"
                     style="stroke-width:0.26458332" /></text>
                <flowRoot
                   xml:space="preserve"
                   id="flowRoot1180-4"
                   style="font-style:normal;font-variant:normal;font-weight:bold;font-stretch:normal;font-size:24px;line-height:1.25;font-family:sans-serif;-inkscape-font-specification:'sans-serif Bold';letter-spacing:0px;word-spacing:0px;fill:#000000;fill-opacity:1;stroke:none"><flowRegion
                     id="flowRegion1182-7"
                     style="font-size:24px"><rect
                       id="rect1184-2"
                       width="211.12189"
                       height="85.862968"
                       x="119.198"
                       y="223.48392"
                       style="font-size:24px" /></flowRegion><flowPara
                     id="flowPara1186-4" /></flowRoot>                <flowRoot
                   xml:space="preserve"
                   id="flowRoot1190-0"
                   style="font-style:normal;font-variant:normal;font-weight:bold;font-stretch:normal;font-size:24px;line-height:1.25;font-family:sans-serif;-inkscape-font-specification:'sans-serif Bold';letter-spacing:0px;word-spacing:0px;fill:#000000;fill-opacity:1;stroke:none"><flowRegion
                     id="flowRegion1192-6"
                     style="font-size:24px"><rect
                       id="rect1194-2"
                       width="205.32176"
                       height="114.20117"
                       x="126.00827"
                       y="204.23709"
                       style="font-size:24px" /></flowRegion><flowPara
                     id="flowPara1196-9" /></flowRoot>                <text
                   xml:space="preserve"
                   style="font-style:normal;font-variant:normal;font-weight:bold;font-stretch:normal;font-size:9.8777771px;line-height:1.25;font-family:sans-serif;-inkscape-font-specification:'sans-serif Bold';letter-spacing:0px;word-spacing:0px;fill:#000000;fill-opacity:1;stroke:none;stroke-width:0.26458332"
                   x="40.624966"
                   y="63.940971"
                   id="text1200-9"><tspan
                     sodipodi:role="line"
                     id="tspan1198-0"
                     x="40.624966"
                     y="72.680489"
                     style="stroke-width:0.26458332" /></text>
                <flowRoot
                   xml:space="preserve"
                   id="flowRoot1202-8"
                   style="font-style:normal;font-variant:normal;font-weight:bold;font-stretch:normal;font-size:37.33333206px;line-height:1.25;font-family:sans-serif;-inkscape-font-specification:'sans-serif Bold';letter-spacing:0px;word-spacing:0px;fill:#000000;fill-opacity:1;stroke:none"><flowRegion
                     id="flowRegion1204-1"><rect
                       id="rect1206-3"
                       width="288.39856"
                       height="118.69292"
                       x="122.22845"
                       y="221.96869" /></flowRegion><flowPara
                     id="flowPara1208-1" /></flowRoot>                <flowRoot
                   xml:space="preserve"
                   id="flowRoot1226-1"
                   style="font-style:normal;font-variant:normal;font-weight:bold;font-stretch:normal;font-size:21.33333397px;line-height:1.25;font-family:sans-serif;-inkscape-font-specification:'sans-serif Bold';letter-spacing:0px;word-spacing:0px;fill:#000000;fill-opacity:1;stroke:none"><flowRegion
                     id="flowRegion1228-0"
                     style="font-size:21.33333397px"><rect
                       id="rect1230-3"
                       width="221.72849"
                       height="98.489876"
                       x="113.64216"
                       y="216.91792"
                       style="font-size:21.33333397px" /></flowRegion><flowPara
                     id="flowPara1232-4" /></flowRoot>                <text
                   id="text3803-0"
                   y="12.409466"
                   x="105.75878"
                   style="font-style:normal;font-variant:normal;font-weight:bold;font-stretch:normal;font-size:4.58611107px;line-height:1.25;font-family:sans-serif;-inkscape-font-specification:'sans-serif Bold';letter-spacing:0px;word-spacing:0px;fill:#000000;fill-opacity:1;stroke:none;stroke-width:0.26458332"
                   xml:space="preserve"><tspan
                     id="tspan3805-3"
                     style="font-style:normal;font-variant:normal;font-weight:bold;font-stretch:normal;font-size:6.59934092px;font-family:sans-serif;-inkscape-font-specification:'sans-serif Bold';stroke-width:0.26458332"
                     y="12.409466"
                     x="105.75878"
                     sodipodi:role="line">Here we are.</tspan></text>
                <text
                   id="text3813-9"
                   y="35.860207"
                   x="45.043514"
                   style="font-style:normal;font-variant:normal;font-weight:bold;font-stretch:normal;font-size:4.58611107px;line-height:1.25;font-family:sans-serif;-inkscape-font-specification:'sans-serif Bold';letter-spacing:0px;word-spacing:0px;fill:#000000;fill-opacity:1;stroke:none;stroke-width:0.26458332"
                   xml:space="preserve"><tspan
                     id="tspan3824-1"
                     style="font-size:6.59934092px;stroke-width:0.26458332"
                     y="35.860207"
                     x="45.043514"
                     sodipodi:role="line">Okay, I will now</tspan><tspan
                     id="tspan4225"
                     style="font-size:6.59934092px;stroke-width:0.26458332"
                     y="44.109383"
                     x="45.043514"
                     sodipodi:role="line">learn this region!</tspan></text>
                <g
                   transform="translate(0,-6.3500003)"
                   id="g4318">
                  <image
                     y="76.371895"
                     x="74.698524"
                     id="image4288"
                     xlink:href="data:image/png;base64,iVBORw0KGgoAAAANSUhEUgAAAsoAAAMgCAYAAAA6PkQQAAAABHNCSVQICAgIfAhkiAAAAAlwSFlz AAAXEgAAFxIBZ5/SUgAAABl0RVh0U29mdHdhcmUAd3d3Lmlua3NjYXBlLm9yZ5vuPBoAACAASURB VHic7N13uF1lnff/90knBQgdRAlIkSpFBpEelCIOCA7WQQWVUVRQUXDK71Gv8XkGHByBx4I6zCgD KKDgI1W6FMswWEAEFCUoIJ0gPaT8/rgTCWEl2fvstfb3Xvd6v67rexGSk5PPWWfvtT/n3quMkJdx wEbAK4BNgI0XzlRgGrAyMAWYGBVQkjIwF3gceAyYBdwB3ARcA9wMzA9LJkkFGQn+98cAWwF7ADOB XYEVQxNJUrs9ApwLfBu4CkuzJI1aVFHeEngn8HZgnaAMklS63wJfAL4JPBWcRZJaZ5hFeTLwHuAw YOsh/ruS1HX3AP8A/BewIDiLJLXGMIrySsAHgY8Aqw/h35MkVfsR8C7SMc2SpOVosihPAj4BfIx0 Ep4kKd4TwJHAf0YHkaTcjW3o884Evg8cTCrMkqQ8TAAOAFYBLsVDMSRpqepeUV4b+CJwUM2fV5JU v3NJJ1U/Gx1EknJUZ1GeCZwBrFXj55QkNetqYH/SdZklSYsZU8PnGAt8GrgMS7Iktc3uwBXAasE5 JCk7g64orwScR7phiCSpvW4G9gLuiw4iSbkYpCivBVyM10SWpFLcCbwO+F10EEnKwWiL8vqks6U3 rDGLJCnen4C9SSvMktRpoynKGwLX4vHIklSqh4B9gBujg0hSpH5P5lsDuAhLsiSVbDXS1TBeG5xD kkL1U5RXBC4BNmooiyQpH1OBC4A3RgeRpCi93plvHGkleccGs0iS8jIOeBPwW+BXwVkkaeh6Lcqf BQ5pMogkKUtjSWX5UeCnwVkkaah6KcozgVOo5+YkkqT2GSGd3Pc0cH1wFkkamuUV5XWAy0nHqkmS umuEdI3lSaQ7+UlS8ZZXlL8JbDeMIJKkVtiZ5284tSA4iyQ1alnXUd6bdJULSZKW9C3gXcBz0UEk qSlLK8orkM5w3mCIWSRJ7XIhcDDp2GVJKs7STtA7BkuyJGnZ9iNdOnRadBBJakLVivKKwF3AykPO IklqpxuBfYEHo4NIUp2qVpSPxJIsSerddsAPgXWjg0hSnZZcUZ4C3AmsHpBFktRud5EuIffb6CCS VIclV5TfgyVZkjQ665FWlreIDiJJdViyKB8WkkKSVIq1gWuAHaODSNKgFi/KWwCvjAoiSSrGdOAy 0mEYktRaixfld0eFkCQVZwpwPvCm6CCSNFqLTuYbA9xNestMkqS6zCUd1vdf0UEkqV+LVpS3xpIs SarfOOCbwEejg0hSvxYV5T1CU0iSSjYC/BtwXHQQSeqHRVmSNCzHAidTfVdYScrOCOltsYdJt66W JKlp/0U6bnludBBJWpYxwCZYkiVJw3MI8B1gYnQQSVqWRUVZkqRhOgC4CJgaHUSSlsaiLEmKMhO4 AlglOogkVbEoS5Ii/RVwObBGdBBJWtIYYIPoEJKkTtsGuAZ4aXQQSVrcGGDl6BCSpM7bBLgO2Dg6 iCQtMgaYFh1CkiTgZcC1pLvFSlI4i7IkKSdrAFcBO0UHkSSLsiQpNysDlwL7RAeR1G1jgAnRISRJ WsJk4P8Bb4oOIqm7xkQHkCRpKSYAZwHvjQ4iqZssypKknI0FvgYcHR1EUvdYlCVJuRsBTgCOiw4i qVtGgAXRISRJ6tGXgQ8D86ODSCqfRVmS1DZnAO8G5gbnkFQ4i7IkqY3OB94MPBMdRFK5LMqSpLa6 GtgfeDw4h6RCWZQlSW12A7Av8HB0EEnlKbkobwI8GB1CUidMBu6ODtFhNwF7A/dFB5FUlpKL8lrA /dEhJHXCFOCJ6BAddyfwOuB30UEklcPrKEuSSrA+cC2wZXQQSeWwKEuSSrE26QS/HYJzSCqERVmS VJJVgMuBPaODSGo/i7IkqTRTgQuBN0YHkdRuFmVJUokmAucA74oOIqm9LMqSpFKNA/4DODw6iKR2 sihLkko2BjgFOCY6iKT2sShLkko3AhwPHBcdRFK7WJQlSV1xLPAVfO2T1CN3FpKkLnk/cDowPjqI pPxZlCVJXfM24DxgheggkvJmUZYkddF+wCXAitFBJOXLoixJ6qpdgSuB1aODSMqTRVmS1GXbAT8E 1o0OIik/FmVJUtdtClwLbBgdRFJeLMqSJMEMUlneKjiHpIxYlCVJStYCrgZ2DM4hKRMWZUmSnjcd uAx4XXQQSfEsypIkvdAU4HzgoOggkmJZlCVJerGJwNnAodFBJMWxKEuSVG0scCrwkeggkmJYlCVJ WroR4AvAcdFBJA2fRVmSpOU7FjiZVJwldYRFWZKk3nwY+AYwLjiHpCGxKEuS1Lt3AueQTvaTVDiL siRJ/XkjcBEwNTqIpGZZlCVJ6t9M4HJgleggkppjUZYkaXR2IJXlNaKDSGqGRVmSpNHbBrgGeGl0 EEn1syhLkjSYTYDrgI2jg0iql0VZkqTBvYy0srx1dBBJ9bEoS5JUjzWBq4CdooNIqodFWZKk+qwM XArsHR1E0uAsypKkZbk6OkALTQa+DxwcHUTSYCzKkqRlORj4XnSIFpoAfAt4T3QQSaNnUZYkLcuz wFuAs6KDtNBY4OvA0dFBJI2ORVmStDxzgHeQSp/6MwKcABwXHURS/yzKkqRezAP+DvhcdJCWOhb4 Ir7uSq3iE1aS1KsFpML3yeggLfVB4DRgXHQQSb2xKEuS+nU88AFgfnSQFnoHcC4wKTqIpOWzKEuS RuMU4BDgueggLfTXwEXAtOggkpbNoixJGq0zgYOAp6ODtNAewBXAqtFBJC2dRVmSNIgLgH2BP0cH aaHtgWuAdaKDSKpmUZYkDeqHwEzgoeggLbQZcB3w8uggkl7MoixJqsONwK7A3dFBWmh94Fpgy+gg kl7IoixJqsutwC7AHdFBWmht4Gpgh+AckhZjUZYk1WkWqSzfFJyjjVYBLgf2jA4iKbEoS5Lqdh+w O/Dj4BxtNBW4EHhjdBBJFmVJUjMeBV4HXBYdpIUmAucA74wOInWdRVmS1JQnSTfXODc6SAuNA/4D ODw6iNRlFmVJUpOeBd4MfCM4RxuNJd0B8ZjoIFJXWZQlSU2bBxwGnBgdpIVGgOOB46KDSF21oNBZ s86NJEnLMIX4fV5TM63G7QRwbAZfU1vnK7jAJQ2VTzhJ0jAdDxxFKn7qz/uB04Hx0UGkrrAoS5KG 7WTg3cDc4Bxt9DbgPGCF6CBSF1iUJUkRTgMOJp3sp/7sB1wMrBgdRCqdRVmSFOV7wIHAU9FBWmg3 4EpgteggUsksypKkSBcD+wCPRQdpoe2Aa4B1o4NIpbIoS5KiXQvMBB6MDtJCm5K234bRQaQSWZQl STn4GbAr8MfoIC00g1SWtwrOIRXHoixJysVtwC7Ab6KDtNBawNXAjsE5pKJYlCVJObmLtLL8i+gg LTQduAx4XXQQqRQWZUlSbu4H9gCujw7SQlOA84GDooNIJbAoS5JyNBvYC/hBdJAWmgicDRwaHURq O4uyJClXTwH7A9+JDtJCY4FTgY9EB5HazKIsScrZHOCtpNKn/owAXwCOiw4itZVFWZKUu3nA+4DP RwdpqWOBk0nFWVIfLMqSpDZYAHwc+GR0kJb6MPANYFxwDqlVLMqSpDY5HvgQMD86SAu9EziHdLKf pB5YlCVJbfMl4F3A3OggLfRG4EJganQQqQ0sypKkNjodeBPwTHSQFtoTuAhYKTqIlDuLsiSprb4P vB54PDpIC+0CXAmsER1EyplFWZLUZleRVkgfjg7SQtsC1wAvjQ4i5cqiLElquxuA3YB7o4O00CbA dcDG0UGkHFmUJUkluAXYGfhddJAWehlpZXnr6CBSbizKkqRS3Ek69vZX0UFaaE3SYSw7RQeRcmJR liSV5E+kwzB+Gh2khVYGLgX2jg4i5cKiLEkqzSPAa4ErooO00GTS1UT+JjqIlAOLsiSpRE8A+wMX RwdpoQnAt4H3RAeRolmUJUmleop0J7qzo4O00Fjg68DR0UGkSBZlSVLJ5gBvJ5U+9WcEOAE4LjqI FMWiLEkq3Tzg74B/jQ7SUscCX8TOoA7yQS9J6oIFwDHAJ6ODtNQHgW8C46KDSMNkUZYkdcnxwAeA +dFBWuhvge8Ck6KDSMNiUZYkdc0pwCHAc9FBWmh/4CJgWnQQaRgsypKkLjoTOAh4OjpIC+1Bukb1 qtFBpKZZlCVJXXUBsC/w5+ggLbQ9cA2wTnQQqUkWZUlSl/0QmAk8FB2khTYDrgNeHh1EaopFWZLU dTcCuwL3RAdpofWBa4EtooNITbAoS5IEtwI7A3dEB2mhtUkr8ztEB5HqZlGWJCmZBewC3BSco41W AS4H9owOItXJoixJ0vPuA3YHfhyco42mAhcCb4wOItXFoixJ0gs9CrwOuCw6SAtNBM4C3hIdRKqD RVmSpBd7Evhr4NzoIC00ATgDeF90EGlQFmVJkqo9C7wZ+EZwjjYaC3wVOCY6iDQIi7IkSUs3DzgM ODE6SAuNAMcDx0UHkQaxoNBZs86NJEnLMIX4fV5TM63G7dR2xxL//WjrfAUX59RCPmglSerN8cBR pOKn/rwfOB0YHx1E6odFWZKk3p0MvBuYG5yjjd5GOjlyheggUq8sypIk9ec04GDSyX7qzxuAi4EV o4NIvbAoS5LUv+8BBwFPRQdpod2AK4HVooNIy2NRliRpdC4C9gEeiw7SQtsB1wDrRgeRlsWiLEnS 6F0LzAQejA7SQpuStt+G0UGkpbEoS5I0mJ8BuwJ/jA7SQjNIZXmr4BxSpRHKvczNWsD90SEkdcIU 4InoEA05D6/w0KvJpMLstaf79yiwH/Dj6CDS4izKkjS4kouyNCxPAgcCl0UHkRbx0AtJkpSDKcD5 pKuJSFmwKEuSpFxMBM4GDo0OIoFFWZIk5WUscCrwkeggkkVZkiTlZgT4AnBcdBB1m0VZkiTl6ljg JFJxlobOoixJknJ2JHAKdhYF8EEnSZJydzjwdVxZ1pBZlCVJUhscBvxrdAh1i0VZkiS1xdF46TgN kUVZkiS1yZeAraNDqBssypIkqU1WAE4DxkcHUfksypIkqW22BD4WHULlGwEWRIdoyFrA/dEhJHXC FOCJ6BBSxzwFbICv9WqQK8qSJKmNJgOfiA6hslmUJUlSW70fWC06hMplUZYkSW01BXhHdAiVy6Is SZLa7F3RAVQui7IkSWqzbYCNo0OoTBZlSZLUdntGB1CZLMqSJKntLMpqhEVZkiS13bbRAVQmi7Ik SWq79Ui3tpZqZVGWJEltNwbYMDqEymNRliRJJVglOoDKY1GWJEklmBYdQOWxKEvS4OZHB5DE1OgA Ko9FWZIG9zQwNzqE1HEj0QFUHouyJNXjyegAkqR6WZQlqR73RweQJNXLoixJ9fhNdABJUr0sypJU j9uiA0iS6mVRlqR6/CQ6gCSpXhZlSarH1XiZOEkqikVZkurxMHBjdAhJUn0sypJUnzOjA0iS6mNR lqT6nAk8Fx1CklQPi7Ik1ecB4NvRISRJ9bAoS1K9/gVP6pOkIliUJalet+KxypJUBIuyJNXv48Ds 6BCSpMFYlCWpfvcDfx8dQpI0GIuyJDXjFOC70SEkSaNnUZak5rwX+G10CEnS6FiUJak5s4E9gT9G B5Ek9c+iLEnN+iPwBtI1liVJLWJRlqTm3QTsCNwRHUSS1DuLsiQNx++BXYCrg3NIknpkUZak4bkP eC3wz8Dc4CySpOWwKEvScM0D/hewHXB9cBZJ0jJYlCUpxk2kQzHeDPwiOIskqYJFWZLiLADOAbYF 9gXOAp4JTSRJ+otx0QEkSSwALlk4KwF7AXsAuwEb475akkK485WkvDxGWmU+Z+H/jwc2AGYAK5KK tO8GahAfAzaJDiG1gUVZkvL2HHD7wpHq8FYsylJPXJWQJEmSKliUJUmSpAoWZUmSJKmCRVmSJEmq YFGWJEmSKliUJUmSpAoWZUmSJKmCRVmSJEmqYFGWJEmSKliUJUmSpAoWZUmSJKmCRVmSJEmqYFGW JEmSKliUJUmSpAoWZUmSJKmCRVmSJEmqYFGWJEmSKliUJUmSpAoWZUmSJKmCRVmSJEmqYFGWJEmS KliUJUmSpAoWZUmSJKmCRVmSJEmqYFGWJEmSKliUJUmSpAoWZUmSJKmCRVmSJEmqYFGWJEmSKliU JUmSpAoWZUmSJKmCRVmSJEmqYFGWJEmSKliUJUmSpAoWZUmSJKmCRVmSJEmqYFGWJEmSKliUJUmS pAoWZUmSJKmCRVmSJEmqYFGWJEmSKliUJUmSpAoWZUmSJKmCRVmSJEmqYFGWJEmSKliUJUmSpAoW ZUmSJKmCRVmSJEmqYFGWJEmSKliUJUmSpAoWZUmSJKmCRVmSJEmqYFGWJEmSKliUJUmSpAoWZUmS JKmCRVmSJEmqYFGWJEmSKliUJUmSpAoWZUmSJKmCRVmSJEmqYFGWJEmSKliUJUmSpAoWZUmSJKmC RVmSJEmqYFGWJEmSKliUJUmSpAoWZUmSJKmCRVmSJEmqYFGWJEmSKliUJUmSpAoWZUmSJKmCRVmS JEmqYFGWJEmSKliUJUmSpAoWZUmSJKmCRVmSJEmqYFGWJEmSKliUJUmSpAoWZUmSJKmCRVmSJEmq YFGWJEmSKliUJUmSpAoWZUmSJKmCRVmSJEmqYFGWJEmSKliUJUmSpAoWZUmSJKmCRVmSJEmqYFGW JEmSKliUJUmSpAoWZUmSJKmCRVmSJEmqYFGWJEmSKliUJUmSpAoWZUmSJKmCRVmSJEmqYFGWJEmS KliUJUmSpAoWZUmSJKmCRVmSJEmqYFGWJEmSKliUJUmSpAoWZUmSJKmCRVmSJEmqYFGWJEmSKliU JUmSpAoWZUmSJKmCRVmSJEmqYFGWJEmSKliUJUmSpAoWZUmSJKmCRVmSJEmqYFGWJEmSKliUJUmS pAoWZUmSJKmCRVmSJEmqYFGWJEmSKliUJUmSpAoWZUmSJKmCRVmSJEmqYFGWJEmSKliUJUmSpAoW ZUmSJKmCRVmSJEmqYFGWJEmSKliUJUmSpAoWZUmSJKmCRVmSJEmqYFGWJEmSKliUJUmSpAoWZUmS JKmCRVmSJEmqYFGWJEmSKliUJUmSpAoWZUmSJKmCRVmSJEmqYFGWJEmSKliUJUmSpAoWZUmSJKmC RVmSJEmqYFGWJEmSKliUJUmSpAoWZUmSJKmCRVmSJEmqYFGWJEmSKliUJUmSpAoWZUmSJKmCRVmS JEmqYFGWJEmSKliUJUmSpAoWZUmSJKmCRVmSJEmqYFGWJEmSKliUJUmSpAoWZUmSJKmCRVmSJEmq YFGWJEmSKliUJUmSpAoWZUmSJKmCRVmSJEmqMC46gCRJWqrxwKrANGDFhb83CVhh4a+nkV7LR4CV l/i7TwJzFv56NrAAmLvw70jqgUVZkqThWg2YAbwUWItUhBef1RabFas/haRhsChLklSvScA6wAYV syGwUlw0Sf2wKEuSNDrjgY2BzYDNge0WztqRoSTVx6IsSdLyrQtsDWwJvHLhfzfG11GpaD7BJUl6 obHAK4CdgJ0XzvqhiSSFsChLkrpuKmm1eFEx3gmYHppIUhYsypKkrplAKsP7Aq8jHUYxNjSRpCxZ lCVJXbAmsDfwBmAvvPKEpB5YlCVJJRoHvJpUjF8LbEu6KYfKNTU6gMozQrpTT4nWAu6PDiFJGppJ pMMp3kwqyBanbpkPXAOcBXwXeDA2jkpgUZYktdlYYA/gncABeCc7JfOAnwDnAN8CHoiNo7ayKEuS 2mYssCNwMPA2YPXYOMrc4qX5TFxpVh8sypKktng1cBhwELBqcBa107PApcA3ge8Dz8XGURssKHTW rHMjSZJCrAQcDvyc+NcVp6x5BPgqsAXSUriiLEnK0Xakgvy3wOTgLCrfjcDXgNOBp4KzKCMWZUlS LqaTjjv+EOkmINKwzQbOBr4M/DI4izIR/dZHU+OhF5LUDtsCZ5COH41+7XCcRXMt6Xj4MajToh+I TY1FWZLyNUK6Ecj5pOvfRr9mOM7S5nfAUcAU1EnRD8CmxqIsSfmZQLrm8a+If51wnH5mNnAS8BLU KdEPvKbGoixJ+ViJtCp3N/GvD44zyDwLnAZsjjoh+gHX1FiUJSneusAXgSeJf11wnDpnPunQoR1Q 0aIfaE2NRVmS4qwOHEe61Fb064HjND2XAa9CxfHycJKkOq0KfBj4GDAtOIs0bJcDx5BukKNCRP8U 1tS4oixJwzMNOJZ0wlP0/t9xImce6VrMm6AiRD+gmhqLsiQ1byqpID9C/H7fcXKaRYV5I9RaXkRb kjQa44AjgDtJxyJPj40jZWcM6U6TtwAnA6vExtFoWJQlSf2aCdwIfAlYLTiLlLvxpOP27yC9+zIh No76YVGWJPVqQ9JbyVcAWwVnkdpmOundl5uA1wdnUY8sypKk5ZkCfJp0N72DY6NIrbcJcCHpknKb BWfRcliUJUlLM4Z0u+k7gE8BE2PjSEV5LfAL0m2xVwrOoqWwKEuSqmwH3AB8k3Rdekn1Gw8cCfwG eEdwFlWwKEuSFrcC6TCLHwPbxkaROmMN4HTgYmC94CxajEVZkrTIrqQ7in2KtNIlabj2AX5NujrG 2OAswqIsSYKVga8CV+PdxKRok0lXx7gB39UJZ1GWpG77a9LVLA4HRoKzSHreNsBPSKXZE2mDWJQl qZvWAb4HfB94SXAWSdXGkw7D+DmwU3CWTrIoS1L3HEi66cEB0UEk9WRT4BrSpeS8s98QWZQlqTtW IL3QngusGpxFUn/GkC4ldx2wcXCWzrAoS1I3vIp0c4Mjo4NIGsj2pOfyUdFBusCiLEllG0N6Qb0e V6GkUqwAnAh8F98dapRFWZLK9TLgStILqsc1SuU5iHTVmn2jg5TKoixJZXoL6YS93aKDSGrUWsAF wOfwRkG1syhLUlnGka67+m1gpeAskoZjDPAJ0jtIawdnKYpFWZLKsTrwA9J1VyV1z86kE/32iA5S CouyJJVhJ9IL5MzoIJJCrQFcij8w18KiLEntdzjpLdd1ooNIysKiQ7DOACYHZ2k1i7Iktdck4FTg q3hVC0kv9nbgR8DLo4O0lUVZktrpZaRb2h4WHURS1l4J/Ax4Y3SQNrIoS1L7vBr4H9IduiRpeVYk 3br+08E5WseiLEnt8ibS8cirRweR1CojwKeAr5GOYVYPLMqS1B5HAWeTbl8rSaPxPtINSqZFB2kD i7Ik5W8s8GXSrajdb0sa1N7AdcC60UFy5w5XkvI2Ffh/wAeig0gqylbAT4Cto4PkbARYEB2iIWsB 90eHkKQBrAtcSHpBk54AHgIeXvj/c4AnF/uz50iv6XOB8Qt/f/rC/04Apiz89TRg1YUjzQb+Brgi OkiOLMqSlKdXkkryS6KDqFHzgXuBWcCdC+dPwIOkQrz4PFvzvz2G5wvz4rM2sB4wA1ifdCnCiTX/ 28rLc8B7gdOig+TGoixJ+dkBuJjnVwPVfg8CNy2cW0nFeBZwF2llOGcjpLs+rr9wNgK2JL3Tsf7C P1f7LQCOBL4YHSQnFmVJystuwPl4RnpbzQN+BfwSuHmx/94XGapB04AtSKV5K1KB3pbnD/NQ+/w9 6fbXwqIsSTnZh3RTAC//1h5PkMrwdcD1C//7aGiieGOBVwA7ATsDu5AO41B7HA98MjpEDizKkpSH A4Fv4bGguXsUuIx0+/DrSKvH80ITtcMMni/Oe5MO2VDeTgI+Srk9sWcLCp0169xIktSgt5KOU43e bzrVcwvprejX8vzVJDSYDYDDSYcZPU3899ipntPwLn7h34SmxqIsqQ3eR1qRjN5nOs/Pn4FvA+/C 15JhmAzsRzqJ7A/Ef/+dF84ZdLwsR38Dmhp3bpJydyTp8mDR+0snXY/4LOAgPEY80gjpEI2TSJfN i35cOGnOI12Lu5OiN35TY1GWlLPDsCRHz9Okt/7fiVcZydEY0jHNJ5GuLR39eOn6nEtHV5ajN3xT Y1GWlKtD8HCLyPkRcCiW4zYZSzoJ8BzSjVeiH0NdnW+SfoDplOiN3tRYlCXl6ECev9WwM7yZDXyV dMdDtdt00omANxP/uOrinErHbjITvcGbGouypNzsBTxD/P6xS/M/pFI1uYfvj9pnO9IPQE8S/1jr 0pzYyzenFNEbu6mxKEvKyUzgKeL3jV2YZ0irXpv39J1RCVYD/hfp/gnRj7+uzKd7+caUIHpDNzUW ZUm5eDXpkmPR+8XS5zHSiV/r9vZtUYEmkE7OvIX4x2MX5tjevi3tFr2RmxqLsqQcvBJ4hPh9Ysnz e+AoYEqP3xOVb4R0g5jziX98ljzzgSN6/J60VvRGbmosypKibYBvBTc5t5Luaji212+IOmkH4BLi H6+lzjzgb3r+brRQ9AZuaizKkiKtAtxG/L6wxJlFOkGvk9d01ajtCFxG/OO3xHkaeE3v34p2id64 TY1FWVKU8cDlxO8HS5s/kA6xmNj7t0J6kZ2Bq4h/PJc2DwIb9fF9aI3oDdvUWJQlRRgBTid+H1jS 3Ad8CAuy6rUvcCPxj++S5jbSu2lFid6oTY1FWVKEfyZ+/1fKzCFdxWKlvr4DUu9GSFfJ8BbZ9c01 FPZDbfQGbWosypKG7VDi932lzGXApv1tfmnUppCuC/w08Y/9EuYsCrp7X/TGbGosypKGaXfgWeL3 fW2fW0lviUsRXgacRvzzoIT5bJ/bPlvRG7KpsShLGpbNgdnE7/faPLOBD+KVLJSHPfGqNXXMYf1u +BxFb8SmxqIsaRimkVZBo/d5bZ4LgJf2u+Glho0n3XnOd4pGP3NIVxlpteiN2NRYlCU1bQQ4l/j9 XVvnPtKJVFLOtgR+Qvzzpa1zL7B231s9I9EbsKmxKEtq2qeI39e1dc4GVut/k0shxpBucvM48c+d Ns51pBX6VoreeE2NRVlSk/Yl3bo1el/XtplFOv5TaqP18WZCo50TRrG9sxC94Zoai7KkpswAHiJ+ P9e2ORuY3v/mlrIyQrpD5DPEP6faNm8ZxfYOF73RmhqLsqQmrIB38+p3ifqpiAAAIABJREFUHgMO Gc3GljK2OfBL4p9fbZongC1Gs7EjRW+0psaiLKkJ/0n8/q1N82Pg5aPa0lL+JpHuHjmf+OdaW+Y3 wMqj2dhRojdYU2NRllS3DxG/b2vLzAH+ERg7qi0ttcsbgPuJf961Zb5Hi+7cF72xmhqLsqQ6bY63 t+11HgBmjm4zS621BnAl8c+/tsyHRreZhy96QzU1FmVJdZmExyL2OtcB64xuM0utNw44jvjnYRvm aWCr0W3m4YreUE2NRVlSXf4v8fu0NsxXgQmj3MZSSd4OPEn8czL3+RXpBOmsRW+kpsaiLKkOe+OJ Osubp4HDRruBpUK9Evgd8c/P3OffRruBhyV6AzU1FmVJg1qDdJvl6P1ZznMnsPVoN7BUuFWAS4h/ nuY880kLEtmK3kBNjUVZ0iBGgO8Tvy/LeX6K+1ppecYCXyT++Zrz3E/G+5LojdPUZLvBJbWCl4Jb 9pwHTB711pW65yi87f2y5iIyvWRc9IZpaizKkkZrM+Ap4vdjuc5JwJhRb12puw7Cfcuy5v2j37TN id4oTY1FWdJojAVuIH4fluPMBT48+k0rCdgBb06ytHmSDO/kGb1RmhqLsqTROJr4/VeO8xSw/wDb VdLzNgR+S/zzOsf5wQDbtRHRG6SpsShL6tcM4HHi91+5zRPAnqPfrJIqrIk3MlravHOA7Vq76I3R 1FiUJfXrUuL3XbnNo8COg2xUSUs1HfgJ8c/z3OZhMupx0RujqclmA0tqhUOJ32/lNvfjNZKlpq1E uvV79PM9tzlzkI1ap+gN0dRYlCX1ai3SCkb0fiun+ROwxSAbVVLPJpOOzY1+3uc2BwyyUesSvRGa GouypF6dRfw+K6e5kwzPPJcKNwlvcrTk/AGYNshGrUP0RmhqLMqSerEf8furnOZuYIOBtqik0ZoA XED8fiCn+eJAW7QG0RugqbEoS1qeaaRiGL2/ymXuAzYZaItKGtQKwFXE7w9ymXnAawbaogMYF/UP S1IG/gl4SXSITMwG9gVujw6inr0M2BJ4BbA+6aSwKcB40o0bHiP9IHg7cCtwCzA/JKn68TTwBuAS YOfgLDkYQ1pVfhVBj9/onxSaGleUJS3LBsAzxO+rcpjHgO0H25wagnHA64F/B35H/9/nh4FzgfeQ SrXythLwP8TvH3KZwwbbnKMX/YU3NRZlSctyHvH7qRzmSWC3AbelmrU2cDzp0Ji6vu9Pky6/td0Q vw71b3XSOwHR+4kc5n6CfsCL/sKbGouypKWZSfw+KoeZA+w94LZUc1YHvkQqtU0+Di4GthnS16T+ vQS4i/j9RQ5z3IDbclSiv+imxqIsqcpYvG3sonn/gNtSzRgB/o7hXtt7LnASsOIQvj71bzPSXTKj 9xnR8yyw0YDbsm/RX3RTY1GWVOUI4vdPOcxnB92QasRqwIXEPS7uwluW52p3UlGM3ndEz3kDbse+ RX/BTY1FWdKSpgMPEr9/ip6zSKuWysv25HG5wmeBwxv+WjU6hxH/+Mhh9hp0Q/Yj+ottaizKkpZ0 IvH7pui5Bpg46IZU7WaSrj4S/fhYfEKOB9VyfZb4x0b03MIQL3Ec/cU2NRZlSYvbmHTyWvS+KXJu A1YZdEOqdvuS71vqn2vw69bojABnEP/YiJ6hnWMR/YU2NRZlSYs7k/j9UuTMJv2woLzsADxB/ONj WfPxxr56jdYk4L+Jf2xEzt0Lt0Pjor/QpsaiLGmRzUm3QY3eL0XNfOCggbei6rYu7Thmfj6wf0Pb QKP3UuAB4h8fkfORgbdiD6K/yKbGoixpke8Sv0+KnM8MvglVs3Gk48WjHxu9ziPAjCY2hAayB/Ac 8Y+PqHkAmDrwVlyO6C+yqbEoSwLYlrQiFr1PippLSdeOVl7+kfjHRr9zFV4tJUefIP6xETnHDL4J ly36C2xqLMqSAC4gfn8UNbOAVQfegqrby8j/uOSlzTsa2B4azAjpko/Rj42oeYiGb5QT/QU2NRZl SdvT3dXkp0mr6cpPmw8F+hMwuf5NogFNBX5F/OMjav6/wTfh0kV/cU2NRVnSZcTvi6LmfTVsP9Vv M9p/YulQTqBS3zYDniL+8RExs2nw0pfRX1xTY1GWum1n4vdDUTP0W7yqZ6cT//gYdO4GJtS9YVSL DxH/+Iiaz9aw/SpFf2FNjUVZ6rarid8PRcw9wGqDbz41YBXgGeIfI3XMgTVvG9VjhO6el/E4DZyT MabuTyhJGdge2C06RIAFwHtJJ7coP2+lnNuHHxIdQJUWAIcC90UHCTAVOKKJTxz9E0BT44qy1F3n EL8PipgT6th4asxVxD9G6ppnGcL1azVqe9PNE5nvB1aoYfu9QPQX1dRYlKVuWh+YS/w+aNhzM0O6 natGZTLlHHaxaPapdQupbicT/xiJmFpPZPbQC0ml+Sjdu8HGHODtpCKmPO1IOYddLDIzOoCW6Vjg N9EhAnyMGvutRVlSSaaTjs/rmuNIK8rK1zbRARqwdXQALdPTpNXVBdFBhuwVwH51fTKLsqSSHEH3 jpu8HfiX6BBark2iAzSgxK+pNNcAX48OEeDoOj9Z9LEkTY3HKEvdMhG4l/h9zzBnHul60crfVcQ/ Xuqe+XhcfBusCPyR+MfLsGeHOjaeK8qSSvEOYO3oEEP2ZeC66BDqyfToAA0YAVaKDqHl+jPwgegQ AT5a1yeKbvxNjSvKUneMkI7Rjd7vDHP+AEyrY+NpKH5H/GOmidmwzo2kRnXtspnPATMG3WiuKEsq we7AFtEhhuwI0p2o1A61X9s1E1OiA6hnRwKPRYcYonHA+wf9JBZlSSWo9bqZLXAR6Ta1UrSR6ADq 2Z+Af44OMWTvBsYP8gksypLablXgwOgQQzQXOCY6hKRWOpl0pZyuWBP460E+gUVZUtu9k26def9/ gVuiQ0hqpeeAj0eHGLKB3nG0KEtqu/dEBxiiR4DPRoeQ1GoXAJdEhxiivYD1RvuXLcqS2mxnYPPo EEP0j6SyLEmD+BhpdbkLxgCHDfKXJamtunQS3y3Av0eHkFSEW4GvRIcYosOAsaP5ixZlSW21MnBw dIghOpp0Ip8k1eEzdOdycesC+47mL1qUJbXV31LutWmXdD3wg+gQkoryCHBidIghGtU7kBZlSW3V pZP4/ik6gKQifYHunPfwemDtfv+SRVlSG70C2Do6xJBcAVwdHUJSkR4DTogOMSTjGMXhehZlSW30 1ugAQ/SZ6ACSinYycH90iCF5S79/waIsqY26chLfRcC10SEkFe1J4HPRIYZkR/q8prJFWVLbbAVs Fh1iSFxNljQMXwbujg4xBCPA3/TzFyzKktqm77fOWupi4L+jQ0jqhGfozhUw+noNsShLapuuHHbx +egAkjrla8Ds6BBDsD2wYa8fbFGW1CbbAhtFhxiCm4Aro0NI6pTHga9HhxiSng+/sChLapOuHHbx r8CC6BCSOuckYE50iCHo+bXEoiypTd4UHWAI7gHOjg4hqZPuAc6KDjEEWwOb9vKBFmVJbbEd8PLo EEPQlRUdSXn6PN14R+vAXj7IoiypLfaLDjAEXTpGUFKefglcFh1iCPbt5YMsypLaYp/oAENwGt04 61xS3r4UHWAIdgRWWd4HWZQltcF04K+iQwzBqdEBJIl0V9B7okM0bCyw5/I+yKIsqQ32Ju3USnYD 8PPoEJIEzAW+ER1iCJZ7+IVFWVIb9HQsWct5bLKknJwKzI8O0bB9Sbe1XiqLsqTcjZBWlEv2BPDt 6BCStJg7gcujQzRsLeCVy/oAi7Kk3G0LrBkdomHfIl3xQpJy0oV3upZ5orhFWVLuPOxCkmJ8H3gg OkTDlvkaY1GWlLvSLwv3a9KJfJKUmznAmdEhGvYaYKWl/aFFWVLOVgJeHR2iYV24Xayk9ip9HzUO mLm0P7QoS8rZayj/snDnRAeQpGX4KTArOkTDdlnaH1iUJeVsp+gADfsFcGt0CElahgWU/wP9Ul9r LMqSclZ6UT47OoAk9aD0fdU2wOSqP7AoS8rVeMq/bXXpqzSSyvA/wB3RIRq01Ncbi7KkXG3NUn7C L0TpLzySylL6D/Y7V/2mRVlSrko/7OI70QEkqQ+lF+XXVP2mRVlSrip/ui/IhdEBJKkPvwDujQ7R oJ2ouMqSRVlSrip/ui/E3cAt0SEkqQ8LgB9Eh2jQisDmS/6mRVlSjjYA1o4O0aCLSS86ktQml0QH aNiLDvmzKEvKUcmryVD+i42kMl0KzI0O0aAXvfZYlCXlaJvoAA16DrgiOoQkjcJs0p36SvWi1x6L sqQcbRUdoEHXA49Fh5CkUbo4OkCDNgEmLf4bFmVJOdoyOkCDSn6RkVS+kvdh44BXLP4bFmVJuVkL WDM6RIOujA4gSQP4OfBIdIgGveAdTYuypNyUfNjFU8Avo0NI0gAWAD+JDtGgF7yjaVGWlJuSi/JP SSfzSVKbXR8doEGuKEvKWsnHJ5f84iKpO66LDtAgi7KkrJW8omxRllSCG4A50SEashawxqL/sShL ysk4YNPoEA2ZT9nXH5XUHU8DP4sO0aC/vLNpUZaUk1cAE6NDNOQW4NHoEJJUk5LfIfvLO5sWZUk5 2SQ6QINKPktcUvf8KDpAg/5yLWWLsqScrB8doEE/jw4gSTX6RXSABs1Y9AuLsqSczIgO0KCbogNI Uo3uBP4cHaIhf1m0sShLykmpK8oLSMcoS1IpSt6vrcfCjmxRlpSTGdEBGnIXMDs6hCTVrNR3yiYA 60C6FJMk5WK96AANKfXFZLQ2BrYgnby5HrAKMBUYHxmqYatEB2jIKcDj0SEaNB94jHSIwd3AbcCt wM0L/6zrbo4O0KAZwN0WZUm5WBOYEh2iIV0vyhOBNwAHAnuwcKVGRdghOkCQR4EfAucD3yWV6S4q uSivD1znoReScjEjOkCDSn4xWZYZwMnAn4DvAO/AkqwyTAfeCJxKenyfAWwTmijGTaRjlUu0PniM sqR8zIgO0KBfRwcYsnWBbwC/AT5MKhVSqVYA3g7cCFzIYjer6IDZwL3RIRoyAyzKkvJR6hUvAGZF BxiSccDRpGM430XZxxxLSxoBXk8qzJ8nHXffBbOiAzTEFWVJWSn1RL4HgCeiQwzBusCVwAl0pyBI VcYBHwN+BmwdnGUYfh8doCEzwKIsKR9rRgdoyKzoAEOwG+nOg7tEB5EyshHwY9K7KyWbFR2gIWuC RVlSPlaLDtCQO6MDNGx/4GLK/f5Jg5gE/Cfw6eAcTZoVHaAhKwCTLcqSclFq0Sq5KB8MnEt6QZFU bQT41MIpUcn7uFUtypJysWp0gIbMig7QkJnAfwFjo4NILfFp4KjoEA0ouSivZlGWlIMRyr1z2azo AA3YEDiPdCMRSb37N2DP6BA1uxuYGx2iIa4oS8rCSqQzxUt0d3SAmk0EzgJWjA4itdAY4EzKuvHO XNJNV0rkirKkLJR6fDLAg9EBavYZYNvoEFKLrQF8NTpEzR6ODtAQV5QlZaHUorwAeDQ6RI02I10f VtJg3gAcEB2iRg9FB2iIK8qSslDqiXyPAc9Fh6jRSXi3PakuJwITokPUxBVlSWpQqSvKJa2y7AC8 NjqEVJAZwCHRIWpS0r5ucRZlSVlYOTpAQx6JDlCjf4wOIBXok5RxicVSV5RXsShLysGk6AANKeVE vnWA10eHkAq0IbBHdIgalFqUJ1qUJeWg1OvxlvLicQhlrHpJOSrh8ItSD72wKEvKQqkniP05OkBN Do4OIBXsQNq/D3wsOkBDLMqSslDqivIz0QFqsDKwdXQIqWDTgO2jQwzo2egADZlgUZaUg1IukbSk OdEBarA7HnYhNW1mdIABlbCvq+KKsqQslLqiXMKLxzbRAaQOaPu7Nq4oS1KDXFHO1ybRAaQOaPvz rNSi7IqypCyUuqJcwovHy6MDSB2wYXSAAZWwKFDFFWVJWXBFOV/TowNIHTCJdl9PvoRFgSquKEvK givK+ZoWHUDqiBWjAwyghH1dFYuypCyUui+aFx2gBm2/vqvUFm1eMChhX1dlbKkvTpLa5bnoAA0p 4ZCSJ6MDSB3xeHSAAZSwr6syx6IsKQelvm1XwovHE9EBpI5o83Otzavhy/KsRVlSDko46a1KCS8e 90YHkDrgAWBudIgBlLCvq+KKsqQslFqUS1hR/k10AKkDbo8OMKAS9nVVXFGWlAUPvcjXbdEBpA5o +/Os1BVli7KkLJS6olzCi8ePogNIHdD251kJ+7oqHnohKQuuKOfrZ8Cj0SGkwl0VHWBAJezrqrii LCkLpa4oT44OUIN5wOXRIaSC/Rq4KzrEgFaIDtAQV5QlZaHUorxKdICanB4dQCpYCc+v1aIDNMQV ZUlZKLUorxodoCYXAw9Gh5AKNB84IzpEDUrZ1y3JoiwpC22+0P6ylLLK8hzwxegQUoHOAf4QHaIG pbx7tqSnLMqScvBwdICGlLTKchLwWHQIqSALgP8THaImq0cHaMiDFmVJOXgoOkBDSllRhlSST4gO IRXkW8BN0SFqUtKiwOIesihLykGpRXkiMDU6RI0+R/tvjCDl4HHgE9EhalTSosDiHrYoS8pBqYde QFkvIHOAI0gnIEkavWOBe6ND1KjUFWWLsqQslFyU14gOULOrgP8dHUJqse8CX4kOUbNSj1G2KEvK wjOUe+WL9aIDNOAzwKXRIaQWuh14b3SImk2j3KteeIyypGyUuqo8IzpAA+YBBwI/jg4itci9wD7A 7OggNdsgOkCDLMqSslHqCX0zogM05CngAOCX0UGkFvgTsDcwKzhHE2ZEB2iQh15IykapK8rrRwdo 0IPAzsBl0UGkjP0e2BX4VXSQhpS6j5sPPGpRlpSLUleUS30RWeQJYH/glOggUoYuBnYA7ogO0qAZ 0QEaMhuYZ1GWlIt7ogM0ZAYwEh2iYc8AHwDeAjwSnEXKwbOkS8DtR7mLAIuUuhhwN4BFWVIuZkUH aMgkYM3oEENyNrARcDJea1nddRWwDekGPQuCswxDqUX5TrAoS8rHndEBGrRRdIAhegQ4CtgO+A4W ZnXHD4G9gJnArcFZhmUM5V71YhZYlCXlY1Z0gAZtFR0gwC+Ag4FNgX8B/hAbR2rEI8CXScch7073 Tmx9OTAlOkRD7gQYF51CkhaaRXqbssTjebeMDhDoN8A/AP9EWmXeg1QotgBeGhdLGpUHgVuAa4Ar SdcSnxOaKFbJ+7ZZYFGWlI+ngQco83jeLq4oL2k+cMPC+dzC35tCWpGaunBWiok2FF8FpkeHaMAx lP1u0BML53HgLuDR2DjZKXnf5oqypOzcSZlFeUvSSnkXTuzpx5PATdEhhuSk6AANuYx0mI26qfgV ZY9RlpSTWdEBGjKVcs8Ml9Rdpa4oPwz8GSzKkvJS8pUvSn1BkdRNUyj8ihdgUZaUl1nRARpkUZZU ki0ot0f+ZdGm1C9QUjv9LjpAg14VHUCSalTyPu33i35hUZaUk5JP7HoNZV76TlI37RwdoEE3L/qF RVlSTh4E7o8O0ZBVgU2iQ0hSTXaKDtCgvyzaWJQl5abkVeWSX1gkdce6lHvDoOeA2xb9j0VZUm4s ypKUt12iAzToNha726JFWVJubl7+h7SWRVlSCUrel71gscaiLCk3Ja8obwSsER1CkgbUiRP5wKIs KT+/BuZGh2jICOnqF5LUViuRrqFcKouypKw9C9weHaJBe0UHkKQB7AmMjQ7RIA+9kJS9kg+/2Dc6 gCQNoOR92CPA3Yv/hkVZUo5KPqFvBrBpdAhJGqV9ogM06EWvPRZlSTn67+gADSv5hUZSubYkXUO5 VC967bEoS8rRTyj3hD4o+61LSeUqfd91/ZK/YVGWlKMngV9Gh2jQrsDU6BCS1KeSi/IC4EdL/qZF WVKuXvSTfUEmArtHh5CkPkyj7Mtb3g48uORvWpQl5arkogxwQHQASerDvsCE6BANetFqMliUJeXr uugADXsTZb/oSCrLW6IDNKzyNceiLClX9wKzokM0aDrpwv2SlLtplH18MliUJbVQ6YdflL5CI6kM +wMrRIdo0EPAHVV/YFGWlLPSi/KBwKToEJK0HKX/UH8t6aoXL2JRlpSz0ovyisDrokNI0jKsDOwV HaJhS32tsShLytmvSG+Jlaz0lRpJ7XYA6ZKWJfvh0v7AoiwpZ/OBH0SHaNj+wJToEJK0FG+LDtCw B4CfLe0PLcqScndJdICGTQPeHB1Ckiq8FHhtdIiGXUJalKlkUZaUu2XuxArxvugAklThvcDY6BAN W+ZijEVZUu4eAm6MDtGwHYFXRoeQpMWMAd4dHaJh84BLl/UBFmVJbXBxdIAhODQ6gCQtZl/gZdEh GnYD8PCyPsCiLKkNulCU3wVMjg4hSQt14ZCw5b62WJQltcFyf+ovwMqkG5BIUrS1gNdHhxgCi7Kk Iiz3OLJC/F10AEkC3gOMjw7RsAfp4fwXi7Kktij9MnEAuwB/FR1CUqdNBD4YHWIILqWHKypZlCW1 xUXA3OgQQ/DR6ACSOu3twNrRIYbg/F4+yKIsqS0eAq6MDjEEBwMbRIeQ1EkjwNHRIYbgKeCCXj7Q oiypTc6KDjAEY4EPRYeQ1En7AptHhxiC84Ene/lAi7KkNjkXmBMdYgjeS7oKhiQN08ejAwxJz4su FmVJbTIbuCw6xBBMAw6PDiGpU7YD9ogOMQSP08fJ4RZlSW1zdnSAITmSdPa5JA1DV1aTvw883esH W5Qltc33gGeiQwzBS+jGnbEkxdsceHN0iCH5dj8fPK6pFBn4EPBEdAhJjfg9sFl0iCH4B+A/SGdo S1JTPkM3Fk/7Pnyv5KL8T9EBJGlAawMfAD4fHURSsbYEDowOMSTnAc/28xe68NODJLXZJ0kn90lS E/4P3emDfV9itCsbRpLaajW8rrKkZrwK2C86xJDcxyhuWmVRlqT8HQNMjw4hqTj/m3Q3vi44FXiu 379kUZak/K1MN24rK2l4dgf2ig4xJPNJJ0b3zaIsSe1wNDAjOoSkIowBTogOMURXkK6W1DeLsiS1 wyTg+OgQkorwPtKd+Lri66P9ixZlSWqPNwO7RYeQ1GorAp+ODjFED5HuxjcqY4AF9WWRJDXsRGBs dAhJrfVpYK3oEEP0Dfq8dvLixuAdnySpTbYGDo0OIamVNgSOiA4xZKM6iW+RMcDjNQWRJA3HZ0lv n0pSP04EJkaHGKJrgVsH+QQWZUlqnzVJ1z+VpF4dSHduLrLI1wb9BBZlSWqnI4Cdo0OoZ3OjAzSk 7xs4KMSKwMnRIYbsHuDsQT/JGOCBwbNIkoZsDPDvpMvGKX9PRAdoyJ+jA6gn/wqsGx1iyE4G5gz6 ScYAtw+eRZIUYBPgk9Eh1JNS370t9QeAkuxKum5ylzxODYddgEVZktru74HNo0Noue6JDtCAJ4HZ 0SG0TBOBU4CR6CBD9nVqemxalCWp3SYAp+K1lXN3W3SABtyG92L4/9u78yC56uOA419JSEKAEIc4 LA4Jm8NGXEZcQYABQ4AYbOwCEgI4lXKi2BQxToUEh8SYpGIbElMuoOICnNixLQh3KiBA3KcMdoHA UFzmkMAgCR2IQ1qhO3/0rFikvWZ3Zvq9N99PVdcuKmmmmTezr/f3fq+76C4EPpOdRIutooH7sYcy yLYZkqR0BwPnZiehXlXxXFvF4r9K9gf+LjuJBDcCrzfqwYYCc4FXG/WAkqQU3wf2zU5CPXo4O4Em eCQ7AfVoE+AaYHh2Igl+2MgHG1r7en8jH1SS1HIjgWuBUdmJqFuvA7Ozk2gwa4fi+hHw6ewkEtwH zGzkA3YWyg808kElSSn2BC7JTkI9uj07gQZ6uRYqnpOBKdlJJLm00Q/YtVB2Q74kld85wInZSahb U7MTaKBfZiegbo0jOj60o5nA9EY/aGehPA94rNEPLklquSHAT4HtsxPRBh6nGjfAraFaRX9VDCGG EI3NTiTJd2jCou/QLt/726EkVcM2RLE8tK+/qJZr+KXhBDcBs7KT0AbOA07ITiLJY8AdzXjgrg2o xxAdMLwRRJKq4bvAv2QnoY8ZTuztHZ+dyACtBQ6gwTdMadAmE9to27HLBcAxxI18Ddd1teE9qnWj gSS1u+8CX8hOQh+zkjguZXUNFslF8wmid3C7FsmP0qQiGTYcaXgkdsCQpCpZDByI/fKLZAjRWu3I 5Dzq9T4x5W1OdiJaZzhRt03OTiTRkcBDzXrw9fevPUhU5pKkatgSuAXYNDsRrbMWOBvoyE6kTn+L RXLRXEF7F8l308QiGWBYN3/2NnBGM59UktRS2wG7ADdnJ6J1FhL3BX0pO5F+ugG4IDsJfcxZwPey k0h2JvBmM5+gu0L5ZaIH57hmPrEkqaX2Ju5FeTw7Ea3zNHGunZSdSB+eIYZYrMhOROscSFwp2ig7 kUTTgH9v9pN0VygD/A74MzbcwyxJKq9jieLspexEtM6dxETFPbMT6cHviY4CC7IT0ToTiJvXtkjO I9Nq4DRgfrOfqKcemw8B1zf7ySVJLTUMuA44JDsRrbOauIRexK5Ts4GjiWJZxbA5cCsOFLoKeLYV T9TbivH2xAShMa1IRJLUMguAP8BOGEUyDLgS+IvsRGqeA46nyfs/VZfhxFCNY7ITSbYY2J3Y5990 vU1tmgdc2IokJEkttQ1wG9ERQ8WwGpgCfIv8vcC3AIdhkVwkQ4CfYJEMcBEtKpL7Ywjwf0QrG8Mw DKNa8SAwEhXNwcQV3Va/H96lOCva+riLyP95UYR4ngIOVtkKeJ38F8cwDMNofFxD71cXlWME0Y5t Kc1/D6wBpuK+16L6S+IYZf+sKEIcP8jXsmkOJ8ZuZr9AhmEYRuPjZ9jlqKi2IVYTF9P4476a2IJz QKv+Z1S3U4BV5P+MKELcNsjXckB6ag+3vjeISzInNDEXSVKO/Yirh3dmJ6INdBBbZK4EXiNagu3M 4H6xeQW4nNhm8WOctldUXyIGvbRzr+ROK4AvA4ta/cT1ftD+Ffixi0MWAAANTElEQVTHZiQiSUr3 PeCfspNQn7YFjgI+B+wD7AGM7eHvdhB9s18EHgHuxz7aZXAMsYK6cXYiBXEpcF7GEw/kN9IrgHMa nYgkqRAuAH6QnYTqNproYrIZcbPTB8SV4M4tGyqPQ4G7iGOpuOIxkXg/t1x/t150dTewGzEOVZJU LZ8niqtfZyeiuqwgRpQvAN4mjuGy1Iw0EAcRRfLo7EQK5AxijHqKgRTKa4kei5sSv/VIkqrlBOIu +4ezE5HayOHAdGL6nsJ1wPczExhIodzpHmIZ/Di8W1qSquYoYBRwb3YiUhs4CpiGK8ldvQOcRLRI TDOYQhni0tyrRLE8YvDpSJIK5DCiPZndMKTmOZEY7rZJdiIF8w1gRnYSjVoJ/jRwPXH3rSSpWq4m TlprshORKuZ04OcUcNpcsgeI+yXSb0Qd7Ipyp4XAL4ipPvs36DElScUwCfgU0a7KYllqjCnAT7FP 8vqWEvdJLM5OBBo7trSDaF5+NPBCAx9XkpTvTOAOvNFIGqwhxLTFK3F8fHcuJIbrFEKzbsIbDpxN NK/ftEnPIUlqvaeJPZVvZScildAI4CfAV7MTKajfEB3VVmcn0qnZ3SrGA98G/hwY2eTnkiS1xhzi bvSZ2YlIJbIlcDPR4UIbWkps8yrU5MhG7VHuyXvA7cSNIB3E/mULZkkqt9F8NATg5eRcpDLYBbgP ODA7kQL7BgVsR9nsQrnTUuBBomB+HdgK2KlFzy1JarwRwGnAPFxZlnpzEFEkT0jOo8huBv4hO4nu ZA4K2Y1YkTiBWGpvVdEuSWqsq4G/JsYoS/rImcBV2CO5N28B+wKLshPpTlEm6o0BjiB65h0A7AGM Tc1IklSPJ4BTiKuGUrsbCfwb8M3sRApuDXAscH92Ij0pSqHcna2Jgnk3oh3RZkRBvTmuPktqrR2J q19F/plZBAuIAQr3ZSciJdoBuAk4JDuREriEaPogSSq5S4kpUUbvsRI4H3+pUHs6AphL/uewDPEk ca+DJKkCRgJPkX9yKUtch8NJ1D6GAH9P/KKY/dkrQywhdg1IkipkArCQ/JNMWWI2cPgAXmepTLYj plZmf97KFA5ckaSKOpGYGpV9oilLrAIuJia2SlVzMv7yXG/8aECvtCSpNP6Z/JNN2eLXwK4DebGl AhoFXEb+56psMQP3JUtS5Q0lpo5mn3TKFu8DUwbwektFMgl4kfzPU9liLjBuAK+3JKmEtgReIf/k U8aYBuxc/0supdoYuAhYTv5nqGyxAu9XkKS2sw+wlPyTUBnjPeBcYnVeKrrDgBfI/9yUNc6u/yWX JFXBn5J/EipzzAD2rPtVl1pjDLEX2Rt4Bx5T637VJUmVcjn5J6Myx4fAd7AzhorlK8Ac8j8fZY6n iBsfJUltbCPgTvJPSmWP54Hj6nztpUbbg9hHn/15KHu8BexU52svSaqo0Ti5r1FxDzCxvpdfGrQt iJ7fH5L/GSh7fAB8tr6XX5JUdeOAN8g/SVUhVgBXAWPrOgJS/YYSk+Lmkf++r0KsAr5Y1xGQJLWN fYl+wdknq6rEfOCvgGH1HASpn44Cnib/fV6l+HpdR0CS1HaOB1aSf8KqUrxGDCuxYFYjHAzcRv77 umpxST0HQZLUvr5G/kmrivEccZnc/ssaiL2BG4A15L+XqxY34udSklSHi8k/eVU1ngVOBYb0+2io ne2JBXIz4zfAJv0+GpIkEUXcteSfxKocjwMn40qWurc/cB0ODGlmvIQ33UqSBmg4cCv5J7Oqx6vE SGxXtQQxcvo2XEFudrwBTOjfIZEkqXsjgDvIP6m1QywgtryM69eRUZWMIPavP0v++7AdYh4xnEWS pEHbFHiE/JNbu0QHcCXRrk/V9gngAhw33cqYT+z7liSpYTYnbnrJPsm1WzxBbMvYsu9DpJIYChxD 3KC3gvz3WDvFu8Ckvg+RJEn12wKYSf7Jrh1jGVFYHdPnUVJR7QCcD8wi//3UjrEUOLzPoyRJ0iBs T9wpnn3Sa+f4LXAeML6PY6V8Y4CzgDuxe0VmLAOO7uNYSZLUEDsBs8k/+bV7rAF+BXyLWK1UMWwG nA78L1GgZb9P2j2WA1/o9YhJktRg44GXyT8JGhGrgYeBc7BrRoZNgVOICW8d5L8fjIhlWCRLkpJs BzxD/snQ2DBeBS4j9jSP6OkAalA+CUwheh5/SP4xNz4eS4Bjezx6bcDRn5KUbyxwFzFFTMX0HnAv ML0Wb+amU1qjiV88jq/FzrnpqBfvAn8EPJadSCYLZUkqhjHA7cDk7ETUL3OBR4EZta9PEfud9XHb AwcS7+vDat+7Ol987wAnEO0s25qFsiQVx6bEuGvvLC+fd4ibAmcAjxNdNRanZtR6GxNDKA4iCuPJ wC6pGWkg5hCr/i9kJ1IEFsqSVCwjgeuAk7MT0aAtBp4HnqzFc7X4MDOpBhlHFMUTieETewJ7Ee9f ldfrRJH8SnYiRWGhLEnFMxyYCpyWnYgabgVxk+CsWsxe7+s7WYmtZxSxGjyh9rXr97sSUyZVLS8R RbL777uwUJakYhoGXEqMXlb7eB94C1jUJRYCC7r8dwfRjWAl0dLu/dq/7SD63UKMeB5T+34UsS0C Yoz3cGDrWozt8rXz+22JvcVqHzOIq1gLsxMpGgtlSSq2KcB/ABtlJyKpkm4mJh8uy06kiCyUJan4 jgduIFprSVKjXA78DXZs6ZGFsiSVw77ANGDH7EQkld5q4JvAj7MTKToLZUkqjx2IYnm/7EQkldYS 4E+Ivu3qg4WyJJXLaOB6YhiAJNVjDnASMDM7kbIYlp2AJKkuK4AbidXlzybnIqk8ZhLDjH6XnUiZ WChLUvmsJib4zSJu9Buem46kgpsKfIXi9OkuDbdeSFK5TSLaO43PTkRS4SwHzgcuy06krCyUJan8 xgL/Q0zVkiSIwTWnAo9lJ1Jmbr2QpPLrAK4FRgKTcRFEancPA38IvJidSNlZKEtSNawF7gWeJjpi bNz7X5dUUVcT7d/e7+svqm+uOkhS9UwEbgF2z05EUsssAb5GTPFUg7iiLEnVswD4L6Ln8sHJuUhq vieA44gtF2ogC2VJqqZVwHTgWeImv01y05HUBGuBK4itFvOTc6kkt15IUvVtD/yM6LksqRp+D5wF PJSdSJW5oixJ1beE6IqxmJjM5c9+qdxuAk7ErhZN54qyJLWXvYiiee/sRCTV7QPgPKKzhVrAVQVJ ai/zgZ8TQ0om4YKJVBaPEb2R781OpJ0MzU5AktRyHcDXgc8BLyXnIql3HcC3gcOB15JzaTuuKEtS +3qDaCO3CjgUzwlS0UwnBgjdTnS4UIt5yU2SBLAP8J/AgdmJSGIxsYrsXuRkrh5IkgDeJlrIvUNc 4h2Rm47Utm4kVpEfyU5ErihLkjb0SeBK4NjsRKQ2Mpu4d+Cu5DzUhSvKkqT1LQamArOIEdijc9OR Km058ENiut4LybloPRbKkqSe/JZYWV4JHAJslJuOVDnTgC8S2y1WJuciSZIGaCfgF8Sd94ZhDC5e wJHykiRVzpHA0+QXGoZRxlgEnItXZyRJqqyhwFeBeeQXHoZRhlgBXEVMxJQkSW1gC+ASYCn5hYhh FDHWADcDeyBJktrSWOBiYtRudmFiGEWJe4BJSJIkAdsSBfMy8osUw8iKR4EjkCRJ6sbOxH7MleQX LYbRqngUOApJkqR+mIAFs1H9eAw4CUmSpAHYnRhc4h5moyqxBrgT+DySJEkNsA1wPvAW+YWOYQwk lhODd/ZCkiSpCUYSfZifJ7/wMYz+xHvAZcCOSJIktcBQYm/nPeQXQobRXcwiroJsgSRJUpKDgf/G 4SVGfqwB7gVOxVHTkiSpQDYHpgBPkl8wGe0Vc4k+4J9CkiSp4CYR+0IXkV9EGdWM1cTWn1OB4UiS JJXMxkQh415mo1HxJrF6PAGpF0OyE5AkqQ4TgT8GTgP2SM5F5bIQuAW4HniQ2Iss9cpCWZJUVhOJ lebTiaEm0vreBW4DbgSmE1MipX6zUJYkVUFn0XwGsGtyLsrVAdwO/BK4C1iRm47KzEJZklQlQ4hW c18GTgD2zk1HLTKXGCl9K7FyvDw3HVWFhbIkqcq2A44DTgSOxcERVbEaeBqYRmytmEncpCc1lIWy JKldDAP2I6YBngjsj+fBMnkbuJsojO8h9h9LTeUPCElSuxoHHAMcBkwGPoPnxSKZAzwKzAAeAJ7N TUftyB8IkiSF0cT+5s7CeTIwKjWj9vIaURR3FsfP5aYjWShLktSTEcABwKG12BfYBc+djbAAeAZ4 HPhVLdxKocLxwy5JUv+NJno2TyRGbO9JFNDbZCZVYCuBl4nV4eeBJ2vfv5aZlNRfFsqSJA3eeKIV 3d7ExMAJxOrzDsRNhFU3H5gNzCKK4GeIPcUvAavy0pIGx0JZkqTmGQ7szEeF8/pftya2eBTZWmL8 85t8VAx3fu38fmlOalJzWShLkpRrNDCW2L6xdTcxFtiq9ne3rH0dCWzS5d9vRKxcb177s2XAh7Xv 3yWK3ZXAktqfLan991KiCO6MRbXo+v0i7FGsNvX/crhD4WcBwnsAAAAASUVORK5CYII= "
                     preserveAspectRatio="none"
                     height="21.13969"
                     width="18.867174" />
                  <ellipse
                     style="opacity:1;fill:none;fill-opacity:1;stroke:#000000;stroke-width:1.1829561;stroke-linecap:round;stroke-linejoin:round;stroke-miterlimit:4;stroke-dasharray:none;stroke-dashoffset:0;stroke-opacity:1"
                     id="path4291"
                     cx="84.132111"
                     cy="86.941742"
                     rx="16.570711"
                     ry="14.699824" />
                </g>
                <circle
                   r="3.4745038"
                   cy="101.3743"
                   cx="84.265755"
                   id="path4293"
                   style="opacity:1;fill:none;fill-opacity:1;stroke:#000000;stroke-width:1.18295598;stroke-linecap:round;stroke-linejoin:round;stroke-miterlimit:4;stroke-dasharray:none;stroke-dashoffset:0;stroke-opacity:1" />
                <circle
                   r="3.4745038"
                   cy="109.65965"
                   cx="77.495705"
                   id="path4293-3"
                   style="opacity:1;fill:none;fill-opacity:1;stroke:#000000;stroke-width:1.1829561;stroke-linecap:round;stroke-linejoin:round;stroke-miterlimit:4;stroke-dasharray:none;stroke-dashoffset:0;stroke-opacity:1" />
                <circle
                   r="3.4745038"
                   cy="112.33234"
                   cx="66.492325"
                   id="path4293-6"
                   style="opacity:1;fill:none;fill-opacity:1;stroke:#000000;stroke-width:1.1829561;stroke-linecap:round;stroke-linejoin:round;stroke-miterlimit:4;stroke-dasharray:none;stroke-dashoffset:0;stroke-opacity:1" />
              </g>
            </g>
          </g>
          <path
             style="fill:none;stroke:#000000;stroke-width:0.4060784;stroke-linecap:butt;stroke-linejoin:miter;stroke-miterlimit:4;stroke-dasharray:none;stroke-opacity:1"
             d="M 80.977711,140.76573 V 94.834737"
             id="path2228"
             inkscape:connector-curvature="0" />
          <path
             style="fill:none;stroke:#000000;stroke-width:0.4060784;stroke-linecap:butt;stroke-linejoin:miter;stroke-miterlimit:4;stroke-dasharray:none;stroke-opacity:1"
             d="M 22.006019,140.88115 H 197.30544"
             id="path2230"
             inkscape:connector-curvature="0" />
          <path
             style="fill:none;stroke:#000000;stroke-width:0.4060784;stroke-linecap:butt;stroke-linejoin:miter;stroke-miterlimit:4;stroke-dasharray:none;stroke-opacity:1"
             d="M 140.87264,140.85814 V 94.927102"
             id="path2228-9"
             inkscape:connector-curvature="0" />
        </g>
      </g>
    </g>
  </g>
</svg>
