,genome,start,stop,sequence,confidence
89,4,162009,162015,ACACGTGGCG,0.0
90,4,640618,640624,ACACGTGGCG,0.0
91,4,2594265,2594271,ACACGTGGCG,0.0
92,4,6903225,6903231,ACACGTGGCG,0.0
93,4,8985785,8985791,ACACGTGGCG,0.0
94,4,9295723,9295729,ACACGTGGCG,0.0
95,4,9468095,9468101,ACACGTGGCG,0.0
96,4,10082002,10082008,ACACGTGGCG,0.0
97,4,10375923,10375929,ACACGTGGCG,0.0
98,4,10492463,10492469,ACACGTGGCG,0.0
99,4,11640158,11640164,ACACGTGGCG,0.0
100,4,11785470,11785476,ACACGTGGCG,0.0
101,4,12079909,12079915,ACACGTGGCG,0.0
102,4,13461002,13461008,ACACGTGGCG,0.0
103,4,14001851,14001857,ACACGTGGCG,0.0
104,4,14812688,14812694,ACACGTGGCG,0.0
105,4,14892083,14892089,ACACGTGGCG,0.0
106,4,15079620,15079626,ACACGTGGCG,0.0
107,4,15191242,15191248,ACACGTGGCG,0.0
108,4,16102315,16102321,ACACGTGGCG,0.0
109,4,16368495,16368501,ACACGTGGCG,0.0
110,4,16721269,16721275,ACACGTGGCG,0.0
111,4,17692583,17692589,ACACGTGGCG,0.0
112,4,17858660,17858666,ACACGTGGCG,0.0
113,4,17875124,17875130,ACACGTGGCG,0.0
114,4,17986068,17986074,ACACGTGGCG,0.0
115,4,18472183,18472189,ACACGTGGCG,0.0
