,genome,start,stop,sequence,confidence
4,4,9302208,9302214,GCGTCGGCAA,0.9048480535426934
5,4,13083353,13083359,GCGTCGGCAA,0.9048480535426934
83,4,3872239,3872245,ATGTCGGCAA,0.0
84,4,3993209,3993215,ATGTCGGCAA,0.0
85,4,4337466,4337472,ATGTCGGCAA,0.0
86,4,5184205,5184211,ATGTCGGCAA,0.0
87,4,7012933,7012939,ATGTCGGCAA,0.0
88,4,7874322,7874328,ATGTCGGCAA,0.0
89,4,15581713,15581719,ATGTCGGCAA,0.0
90,4,15647384,15647390,ATGTCGGCAA,0.0
91,4,15649492,15649498,ATGTCGGCAA,0.0
92,4,17908004,17908010,ATGTCGGCAA,0.0
125,4,2778448,2778454,CTGTCGGCAA,0.8156898920545723
126,4,3811283,3811289,CTGTCGGCAA,0.8156898920545723
127,4,16256332,16256338,CTGTCGGCAA,0.8156898920545723
159,4,972271,972277,TCGTCGGCAA,0.7282684944441855
160,4,1930667,1930673,TCGTCGGCAA,0.7282684944441855
161,4,2008436,2008442,TCGTCGGCAA,0.7282684944441855
162,4,4223393,4223399,TCGTCGGCAA,0.7282684944441855
163,4,8978114,8978120,TCGTCGGCAA,0.7282684944441855
164,4,9280204,9280210,TCGTCGGCAA,0.7282684944441855
165,4,10174819,10174825,TCGTCGGCAA,0.7282684944441855
166,4,10649588,10649594,TCGTCGGCAA,0.7282684944441855
167,4,11336383,11336389,TCGTCGGCAA,0.7282684944441855
168,4,11713405,11713411,TCGTCGGCAA,0.7282684944441855
169,4,11930123,11930129,TCGTCGGCAA,0.7282684944441855
170,4,12466415,12466421,TCGTCGGCAA,0.7282684944441855
171,4,16628911,16628917,TCGTCGGCAA,0.7282684944441855
172,4,17287253,17287259,TCGTCGGCAA,0.7282684944441855
