,min_Stagger,max_Stagger,min_Opening,max_Opening,min_Buckle,max_Buckle,min_MGW,max_MGW,min_EP,max_EP,min_Shear,max_Shear,min_Stretch,max_Stretch,min_ProT,max_ProT,min_Roll1,max_Roll1,min_Roll2,max_Roll2,min_HelT1,max_HelT1,min_HelT2,max_HelT2,min_Tilt1,max_Tilt1,min_Tilt2,max_Tilt2,min_Rise1,max_Rise1,min_Rise2,max_Rise2,min_Shift1,max_Shift1,min_Shift2,max_Shift2,min_Slide1,max_Slide1,min_Slide2,max_Slide2
0,0.5645199000000001,0.88710001,0.8448599000000001,0.9119500100000001,0.29659989999999997,0.5072900100000001,0.26566989999999996,0.7194000100000001,0.7954799,0.9423700100000001,0.016129900000000003,0.09677001,0.11110989999999998,0.33333001,0.5539999,0.7651700100000001,0.26495989999999997,0.7437500100000001,0.20510989999999998,0.37769001,0.0829799,0.57665001,0.4599199,0.6329100100000001,0.1470899,0.60661001,0.6670499000000001,0.8677300099999999,0.3623199,0.7681200100000001,0.42028989999999994,0.6521700100000001,0.4857099,0.83810001,0.1999999,0.28571000999999996,0.010199900000000001,0.5204100100000001,0.22448990000000002,0.45918001
1,0.6612899,0.7580600100000001,0.6163499,0.75262001,0.3204999,0.34927000999999996,0.5193999,0.72537001,0.6361599000000001,0.72768001,0.3064499,0.32258001000000003,0.22221989999999997,0.33333001,0.4866499,0.51092001,0.2388099,0.35909001,0.3637399,0.41255000999999997,0.4627299,0.60900001,0.6244699,0.67370001,0.41960990000000004,0.58609001,0.5735499000000001,0.64994001,0.4057999,0.62319001,0.1884099,0.26087001,0.24761989999999998,0.26667000999999996,0.5523799,0.6857100100000001,0.2346899,0.46939000999999997,0.5510199,0.6530600100000001
2,0.5967699000000001,0.5967700100000001,0.8511499,0.85115001,0.5887399,0.58874001,0.8029899,0.80299001,0.9581899,0.95819001,0.9354799,0.93548001,0.11110989999999998,0.11111000999999998,0.5928399,0.59284001,0.4096499,0.40965001,0.6961099000000001,0.6961100100000001,0.6300999,0.63010001,0.26300989999999996,0.26301000999999996,0.3990899,0.39909001,0.5313599000000001,0.5313600100000001,0.1884099,0.18841001,0.4492799,0.44928001,0.7142899,0.71429001,0.5999999,0.60000001,0.6224499,0.62245001,0.40815989999999996,0.40816000999999996
3,0.7419399,0.74194001,0.8364798999999999,0.8469600100000001,0.46190990000000004,0.48501001000000005,0.6477599,0.77015001,0.9446299,0.9604500100000001,0.0967699,0.09677001,0.11110989999999998,0.11111000999999998,0.7414999000000001,0.7955100100000001,0.6926199000000001,0.7251600100000001,0.44043989999999994,0.44335001,0.21518990000000002,0.23910001,0.2826999,0.45570001,0.27821989999999996,0.28962001,0.6590599000000001,0.72862001,0.4782599,0.55072001,0.4057999,0.5797100100000001,0.5714299,0.60952001,0.5618999,0.60000001,0.3163299,0.34694001,0.1734699,0.18367001
4,0.6128999,0.80645001,0.8280899,0.89099001,0.2653999,0.51135001,0.4507499,0.69254001,0.8847499000000001,0.9649700100000002,0.04838989999999999,0.06452001,0.11110989999999998,0.22222000999999997,0.5181999,0.8173500100000001,0.41428989999999993,0.48170001,0.3160999,0.41778001000000003,0.3277099,0.49789000999999994,0.4374099,0.8846700100000001,0.3842599,0.49487000999999997,0.5131099000000001,0.74230001,0.4057999,0.6376800100000001,0.42028989999999994,0.59420001,0.5714299,0.62857001,0.1142899,0.48571001,0.1632699,0.25510001,0.29591989999999996,0.45918001
5,0.6290299,0.9516100100000001,0.5429799000000001,0.8658300099999999,0.1199399,0.50689001,0.4805999,0.76119001,0.6090399,0.96384001,0.2419399,0.91935001,0.11110989999999998,0.33333001,0.34465989999999996,0.92779001,0.28936989999999996,0.40209001,0.2754199,0.7455000100000001,0.4360099,0.8959200100000001,0.0576699,0.68354001,0.25313990000000003,0.48803001,0.5370599,0.83010001,0.4347799,0.6087000100000001,0.043479899999999995,0.50725001,0.1142899,0.50476001,0.14285989999999998,0.7238100100000001,0.29591989999999996,0.39796001,0.2448999,0.81633001
