,genome,start,stop,sequence,confidence
14,4,1036010,1036016,TCGTCGGTCA,0.9349197826551747
15,4,1638275,1638281,TCGTCGGTCA,0.9349197826551747
16,4,5429520,5429526,TCGTCGGTCA,0.9349197826551747
17,4,8192396,8192402,TCGTCGGTCA,0.9349197826551747
18,4,11210689,11210695,TCGTCGGTCA,0.9349197826551747
19,4,12060900,12060906,TCGTCGGTCA,0.9349197826551747
20,4,13145301,13145307,TCGTCGGTCA,0.9349197826551747
21,4,15205418,15205424,TCGTCGGTCA,0.9349197826551747
22,4,17632909,17632915,TCGTCGGTCA,0.9349197826551747
53,4,2803020,2803026,TCGTCGGTCG,0.7282684944441855
54,4,8455078,8455084,TCGTCGGTCG,0.7282684944441855
55,4,8862934,8862940,TCGTCGGTCG,0.7282684944441855
56,4,12310245,12310251,TCGTCGGTCG,0.7282684944441855
57,4,15563494,15563500,TCGTCGGTCG,0.7282684944441855
58,4,16053866,16053872,TCGTCGGTCG,0.7282684944441855
59,4,17475525,17475531,TCGTCGGTCG,0.7282684944441855
89,4,433916,433922,ATGTCGGTCA,0.5862593282839927
90,4,2276846,2276852,ATGTCGGTCA,0.5862593282839927
91,4,5462189,5462195,ATGTCGGTCA,0.5862593282839927
92,4,6365035,6365041,ATGTCGGTCA,0.5862593282839927
93,4,7076730,7076736,ATGTCGGTCA,0.5862593282839927
94,4,10898160,10898166,ATGTCGGTCA,0.5862593282839927
95,4,12243658,12243664,ATGTCGGTCA,0.5862593282839927
120,4,2196678,2196684,ATGTCGGTCG,0.0
121,4,10704594,10704600,ATGTCGGTCG,0.0
122,4,17386193,17386199,ATGTCGGTCG,0.0
123,4,17980085,17980091,ATGTCGGTCG,0.0
141,4,52099,52105,CTGTCGGTCA,1.0045148082532174
142,4,5054488,5054494,CTGTCGGTCA,1.0045148082532174
143,4,5057336,5057342,CTGTCGGTCA,1.0045148082532174
144,4,8453193,8453199,CTGTCGGTCA,1.0045148082532174
153,4,9301345,9301351,CTGTCGGTCG,0.8156898920545723
154,4,11263843,11263849,CTGTCGGTCG,0.8156898920545723
166,4,997212,997218,CCGTCGGTCA,0.9663074045043838
167,4,3100693,3100699,CCGTCGGTCA,0.9663074045043838
168,4,6948034,6948040,CCGTCGGTCA,0.9663074045043838
169,4,10133590,10133596,CCGTCGGTCA,0.9663074045043838
170,4,17155831,17155837,CCGTCGGTCA,0.9663074045043838
179,4,17187514,17187520,CCGTCGGTCG,0.7681471213250757
180,4,18152063,18152069,CCGTCGGTCG,0.7681471213250757
196,4,6152749,6152755,GCGTCGGTCA,1.0781697454482755
197,4,12365860,12365866,GCGTCGGTCA,1.0781697454482755
198,4,12388004,12388010,GCGTCGGTCA,1.0781697454482755
211,4,3741675,3741681,GCGTCGGTCG,0.9048480535426934
212,4,4180722,4180728,GCGTCGGTCG,0.9048480535426934
213,4,12437244,12437250,GCGTCGGTCG,0.9048480535426934
214,4,14685760,14685766,GCGTCGGTCG,0.9048480535426934
