,genome,start,sequence,confidence
10,4,997212,CCGTCGGTCA,0.9663074045043838
11,4,3100693,CCGTCGGTCA,0.9663074045043838
12,4,6948034,CCGTCGGTCA,0.9663074045043838
13,4,10133590,CCGTCGGTCA,0.9663074045043838
14,4,17155831,CCGTCGGTCA,0.9663074045043838
29,4,6152749,GCGTCGGTCA,1.0781697454482755
30,4,12365860,GCGTCGGTCA,1.0781697454482755
31,4,12388004,GCGTCGGTCA,1.0781697454482755
49,4,1036010,TCGTCGGTCA,0.9349197826551747
50,4,1638275,TCGTCGGTCA,0.9349197826551747
51,4,5429520,TCGTCGGTCA,0.9349197826551747
52,4,8192396,TCGTCGGTCA,0.9349197826551747
53,4,11210689,TCGTCGGTCA,0.9349197826551747
54,4,12060900,TCGTCGGTCA,0.9349197826551747
55,4,13145301,TCGTCGGTCA,0.9349197826551747
56,4,15205418,TCGTCGGTCA,0.9349197826551747
57,4,17632909,TCGTCGGTCA,0.9349197826551747
88,4,433916,ATGTCGGTCA,0.5862593282839927
89,4,2276846,ATGTCGGTCA,0.5862593282839927
90,4,5462189,ATGTCGGTCA,0.5862593282839927
91,4,6365035,ATGTCGGTCA,0.5862593282839927
92,4,7076730,ATGTCGGTCA,0.5862593282839927
93,4,10898160,ATGTCGGTCA,0.5862593282839927
94,4,12243658,ATGTCGGTCA,0.5862593282839927
120,4,52099,CTGTCGGTCA,1.0045148082532174
121,4,5054488,CTGTCGGTCA,1.0045148082532174
122,4,5057336,CTGTCGGTCA,1.0045148082532174
123,4,8453193,CTGTCGGTCA,1.0045148082532174
131,4,17187514,CCGTCGGTCG,0.7681471213250757
132,4,18152063,CCGTCGGTCG,0.7681471213250757
146,4,3741675,GCGTCGGTCG,0.9048480535426934
147,4,4180722,GCGTCGGTCG,0.9048480535426934
148,4,12437244,GCGTCGGTCG,0.9048480535426934
149,4,14685760,GCGTCGGTCG,0.9048480535426934
176,4,2803020,TCGTCGGTCG,0.7282684944441855
177,4,8455078,TCGTCGGTCG,0.7282684944441855
178,4,8862934,TCGTCGGTCG,0.7282684944441855
179,4,12310245,TCGTCGGTCG,0.7282684944441855
180,4,15563494,TCGTCGGTCG,0.7282684944441855
181,4,16053866,TCGTCGGTCG,0.7282684944441855
182,4,17475525,TCGTCGGTCG,0.7282684944441855
200,4,2196678,ATGTCGGTCG,0.0
201,4,10704594,ATGTCGGTCG,0.0
202,4,17386193,ATGTCGGTCG,0.0
203,4,17980085,ATGTCGGTCG,0.0
213,4,9301345,CTGTCGGTCG,0.8156898920545723
214,4,11263843,CTGTCGGTCG,0.8156898920545723
