,genome,start,stop,sequence,confidence
16,4,537699,537705,GCGTCGGCGT,1.471827095823419
17,4,1890010,1890016,GCGTCGGCGT,1.471827095823419
18,4,5288165,5288171,GCGTCGGCGT,1.471827095823419
19,4,14439367,14439373,GCGTCGGCGT,1.471827095823419
20,4,14670572,14670578,GCGTCGGCGT,1.471827095823419
21,4,17045555,17045561,GCGTCGGCGT,1.471827095823419
44,4,149564,149570,TCGTCGGCGT,1.3703649149040553
45,4,1205574,1205580,TCGTCGGCGT,1.3703649149040553
46,4,1879560,1879566,TCGTCGGCGT,1.3703649149040553
47,4,5113793,5113799,TCGTCGGCGT,1.3703649149040553
48,4,6553318,6553324,TCGTCGGCGT,1.3703649149040553
49,4,10896858,10896864,TCGTCGGCGT,1.3703649149040553
50,4,17055252,17055258,TCGTCGGCGT,1.3703649149040553
51,4,17898821,17898827,TCGTCGGCGT,1.3703649149040553
85,4,216570,216576,ATGTCGGCAG,0.0
86,4,2640538,2640544,ATGTCGGCAG,0.0
87,4,3872278,3872284,ATGTCGGCAG,0.0
88,4,3993248,3993254,ATGTCGGCAG,0.0
89,4,6118167,6118173,ATGTCGGCAG,0.0
90,4,6908268,6908274,ATGTCGGCAG,0.0
91,4,11081438,11081444,ATGTCGGCAG,0.0
92,4,12763322,12763328,ATGTCGGCAG,0.0
109,4,4754118,4754124,CTGTCGGCAG,0.8156898920545723
110,4,13634291,13634297,CTGTCGGCAG,0.8156898920545723
111,4,15695879,15695885,CTGTCGGCAG,0.8156898920545723
121,4,9510751,9510757,CCGTCGGCAG,0.7681471213250757
122,4,15954374,15954380,CCGTCGGCAG,0.7681471213250757
137,4,11018602,11018608,ATGTCGGCGT,1.1608294448367504
138,4,14709146,14709152,ATGTCGGCGT,1.1608294448367504
166,4,6605286,6605292,GCGTCGGCAG,0.9048480535426934
183,4,7491736,7491742,CCGTCGGCGT,1.3919680312420968
184,4,8626577,8626583,CCGTCGGCGT,1.3919680312420968
185,4,10464839,10464845,CCGTCGGCGT,1.3919680312420968
186,4,11150700,11150706,CCGTCGGCGT,1.3919680312420968
187,4,11272517,11272523,CCGTCGGCGT,1.3919680312420968
206,4,4139489,4139495,TCGTCGGCAG,0.7282684944441855
