,genome,start,stop,sequence,confidence
60,4,1025634,1025640,TGACGTGGCT,0.0
61,4,1394657,1394663,TGACGTGGCT,0.0
62,4,5314938,5314944,TGACGTGGCT,0.0
63,4,5569882,5569888,TGACGTGGCT,0.0
64,4,8511128,8511134,TGACGTGGCT,0.0
65,4,9368288,9368294,TGACGTGGCT,0.0
66,4,10259564,10259570,TGACGTGGCT,0.0
67,4,11340312,11340318,TGACGTGGCT,0.0
68,4,12224287,12224293,TGACGTGGCT,0.0
69,4,14566787,14566793,TGACGTGGCT,0.0
70,4,14731841,14731847,TGACGTGGCT,0.0
71,4,16704247,16704253,TGACGTGGCT,0.0
124,4,2246423,2246429,CGACGTGGCT,0.262488094968133
125,4,3684886,3684892,CGACGTGGCT,0.262488094968133
126,4,6681740,6681746,CGACGTGGCT,0.262488094968133
127,4,7232207,7232213,CGACGTGGCT,0.262488094968133
128,4,8289611,8289617,CGACGTGGCT,0.262488094968133
129,4,13357984,13357990,CGACGTGGCT,0.262488094968133
130,4,14479385,14479391,CGACGTGGCT,0.262488094968133
131,4,18292741,18292747,CGACGTGGCT,0.262488094968133
