Query_60575,CP002687.1,100.000,20,0,0,1,20,11897097,11897116,4.94e-04,40.1
Query_60575,CP002687.1,100.000,14,0,0,4,17,3343010,3342997,1.9,28.2
Query_60575,CP002687.1,100.000,14,0,0,1,14,14780257,14780244,1.9,28.2
Query_60575,CP002687.1,100.000,13,0,0,2,14,13675023,13675035,7.4,26.3
Query_60575,CP002687.1,100.000,13,0,0,3,15,16085265,16085277,7.4,26.3
Query_60575,CP002687.1,100.000,12,0,0,9,20,2739641,2739652,29,24.3
Query_60575,CP002687.1,100.000,12,0,0,8,19,11967088,11967077,29,24.3
Query_60575,CP002687.1,100.000,12,0,0,1,12,14882956,14882967,29,24.3
Query_60575,CP002687.1,100.000,12,0,0,4,15,15328773,15328762,29,24.3
Query_60575,CP002687.1,100.000,11,0,0,4,14,63961,63951,116,22.3
Query_60575,CP002687.1,100.000,11,0,0,8,18,1134751,1134741,116,22.3
Query_60575,CP002687.1,100.000,11,0,0,5,15,1532030,1532020,116,22.3
Query_60575,CP002687.1,100.000,11,0,0,4,14,2781077,2781087,116,22.3
Query_60575,CP002687.1,100.000,11,0,0,5,15,3786186,3786196,116,22.3
Query_60575,CP002687.1,100.000,11,0,0,9,19,4164771,4164761,116,22.3
Query_60575,CP002687.1,100.000,11,0,0,9,19,4612203,4612213,116,22.3
Query_60575,CP002687.1,89.474,19,2,0,1,19,7369610,7369628,116,22.3
Query_60575,CP002687.1,100.000,11,0,0,3,13,8398216,8398206,116,22.3
Query_60575,CP002687.1,100.000,11,0,0,10,20,9545218,9545208,116,22.3
Query_60575,CP002687.1,100.000,11,0,0,10,20,9551794,9551784,116,22.3
Query_60575,CP002687.1,100.000,11,0,0,7,17,10212220,10212230,116,22.3
Query_60575,CP002687.1,100.000,11,0,0,3,13,11340315,11340325,116,22.3
Query_60575,CP002687.1,100.000,11,0,0,10,20,11543051,11543041,116,22.3
Query_60575,CP002687.1,100.000,11,0,0,7,17,11564671,11564681,116,22.3
Query_60575,CP002687.1,100.000,11,0,0,5,15,11691413,11691403,116,22.3
Query_60575,CP002687.1,100.000,11,0,0,1,11,12085891,12085901,116,22.3
Query_60575,CP002687.1,100.000,11,0,0,10,20,12759131,12759141,116,22.3
Query_60575,CP002687.1,100.000,11,0,0,3,13,12811306,12811296,116,22.3
Query_60575,CP002687.1,100.000,11,0,0,10,20,13458095,13458105,116,22.3
Query_60575,CP002687.1,100.000,11,0,0,1,11,13752544,13752534,116,22.3
Query_60575,CP002687.1,93.333,15,1,0,5,19,14110399,14110413,116,22.3
Query_60575,CP002687.1,100.000,11,0,0,2,12,14694561,14694571,116,22.3
Query_60575,CP002687.1,100.000,11,0,0,5,15,15812577,15812587,116,22.3
Query_60575,CP002687.1,100.000,11,0,0,7,17,17498850,17498840,116,22.3
Query_60575,CP002687.1,100.000,11,0,0,10,20,18057217,18057207,116,22.3
Query_60575,CP002687.1,100.000,11,0,0,10,20,18271915,18271925,116,22.3
Query_60575,CP002687.1,100.000,11,0,0,1,11,18290266,18290256,116,22.3
Query_60575,CP002687.1,100.000,11,0,0,1,11,18399881,18399871,116,22.3
Query_60575,CP002687.1,100.000,10,0,0,11,20,78813,78822,458,20.3
Query_60575,CP002687.1,100.000,10,0,0,1,10,149385,149394,458,20.3
Query_60575,CP002687.1,100.000,10,0,0,11,20,172319,172310,458,20.3
Query_60575,CP002687.1,92.857,14,1,0,7,20,216427,216440,458,20.3
Query_60575,CP002687.1,100.000,10,0,0,7,16,291534,291543,458,20.3
Query_60575,CP002687.1,100.000,10,0,0,5,14,499092,499083,458,20.3
Query_60575,CP002687.1,100.000,10,0,0,8,17,569280,569271,458,20.3
Query_60575,CP002687.1,100.000,10,0,0,8,17,675096,675087,458,20.3
Query_60575,CP002687.1,100.000,10,0,0,9,18,846982,846973,458,20.3
Query_60575,CP002687.1,92.857,14,1,0,6,19,1069801,1069788,458,20.3
Query_60575,CP002687.1,100.000,10,0,0,1,10,1102092,1102083,458,20.3
Query_60575,CP002687.1,100.000,10,0,0,1,10,1270263,1270254,458,20.3
Query_60575,CP002687.1,100.000,10,0,0,1,10,1373318,1373309,458,20.3
Query_60575,CP002687.1,100.000,10,0,0,1,10,1522973,1522964,458,20.3
Query_60575,CP002687.1,100.000,10,0,0,2,11,1834444,1834453,458,20.3
Query_60575,CP002687.1,100.000,10,0,0,11,20,1991488,1991497,458,20.3
Query_60575,CP002687.1,100.000,10,0,0,11,20,2183589,2183580,458,20.3
Query_60575,CP002687.1,100.000,10,0,0,11,20,2234959,2234968,458,20.3
Query_60575,CP002687.1,100.000,10,0,0,9,18,2241784,2241775,458,20.3
Query_60575,CP002687.1,100.000,10,0,0,1,10,2356153,2356144,458,20.3
Query_60575,CP002687.1,100.000,10,0,0,10,19,2562476,2562467,458,20.3
Query_60575,CP002687.1,100.000,10,0,0,7,16,2603735,2603726,458,20.3
Query_60575,CP002687.1,100.000,10,0,0,4,13,2611813,2611804,458,20.3
Query_60575,CP002687.1,100.000,10,0,0,5,14,3450224,3450215,458,20.3
Query_60575,CP002687.1,100.000,10,0,0,5,14,4934610,4934601,458,20.3
Query_60575,CP002687.1,100.000,10,0,0,9,18,5153068,5153077,458,20.3
Query_60575,CP002687.1,100.000,10,0,0,11,20,6420863,6420854,458,20.3
Query_60575,CP002687.1,100.000,10,0,0,7,16,6524356,6524365,458,20.3
Query_60575,CP002687.1,100.000,10,0,0,1,10,6614989,6614998,458,20.3
Query_60575,CP002687.1,100.000,10,0,0,1,10,6891897,6891906,458,20.3
Query_60575,CP002687.1,100.000,10,0,0,10,19,7078151,7078160,458,20.3
Query_60575,CP002687.1,100.000,10,0,0,1,10,7156044,7156035,458,20.3
Query_60575,CP002687.1,100.000,10,0,0,11,20,7238401,7238392,458,20.3
Query_60575,CP002687.1,100.000,10,0,0,1,10,7553489,7553498,458,20.3
Query_60575,CP002687.1,100.000,10,0,0,1,10,7596076,7596067,458,20.3
Query_60575,CP002687.1,100.000,10,0,0,8,17,7734279,7734288,458,20.3
Query_60575,CP002687.1,100.000,10,0,0,10,19,7818994,7819003,458,20.3
Query_60575,CP002687.1,100.000,10,0,0,5,14,7840827,7840836,458,20.3
Query_60575,CP002687.1,100.000,10,0,0,10,19,8031562,8031571,458,20.3
Query_60575,CP002687.1,100.000,10,0,0,1,10,8054669,8054660,458,20.3
Query_60575,CP002687.1,100.000,10,0,0,3,12,8521243,8521252,458,20.3
Query_60575,CP002687.1,100.000,10,0,0,6,15,8615781,8615790,458,20.3
Query_60575,CP002687.1,100.000,10,0,0,2,11,8734586,8734595,458,20.3
Query_60575,CP002687.1,100.000,10,0,0,1,10,8787172,8787163,458,20.3
Query_60575,CP002687.1,100.000,10,0,0,10,19,9104429,9104438,458,20.3
Query_60575,CP002687.1,100.000,10,0,0,3,12,9368291,9368300,458,20.3
Query_60575,CP002687.1,100.000,10,0,0,9,18,9442540,9442531,458,20.3
Query_60575,CP002687.1,100.000,10,0,0,11,20,9867231,9867240,458,20.3
Query_60575,CP002687.1,100.000,10,0,0,10,19,9911828,9911819,458,20.3
Query_60575,CP002687.1,100.000,10,0,0,10,19,10017209,10017218,458,20.3
Query_60575,CP002687.1,100.000,10,0,0,8,17,10321178,10321187,458,20.3
Query_60575,CP002687.1,100.000,10,0,0,8,17,10801757,10801766,458,20.3
Query_60575,CP002687.1,100.000,10,0,0,3,12,10812266,10812275,458,20.3
Query_60575,CP002687.1,100.000,10,0,0,1,10,10822883,10822874,458,20.3
Query_60575,CP002687.1,100.000,10,0,0,10,19,10965947,10965938,458,20.3
Query_60575,CP002687.1,100.000,10,0,0,3,12,11019495,11019504,458,20.3
Query_60575,CP002687.1,100.000,10,0,0,11,20,11215034,11215043,458,20.3
Query_60575,CP002687.1,100.000,10,0,0,9,18,11505551,11505560,458,20.3
Query_60575,CP002687.1,100.000,10,0,0,11,20,11616629,11616620,458,20.3
Query_60575,CP002687.1,100.000,10,0,0,5,14,11685274,11685265,458,20.3
Query_60575,CP002687.1,100.000,10,0,0,10,19,12063653,12063662,458,20.3
Query_60575,CP002687.1,100.000,10,0,0,11,20,12080178,12080187,458,20.3
Query_60575,CP002687.1,100.000,10,0,0,11,20,12227704,12227713,458,20.3
Query_60575,CP002687.1,100.000,10,0,0,6,15,12239782,12239791,458,20.3
Query_60575,CP002687.1,100.000,10,0,0,11,20,12253023,12253032,458,20.3
Query_60575,CP002687.1,100.000,10,0,0,4,13,12253550,12253541,458,20.3
Query_60575,CP002687.1,100.000,10,0,0,1,10,12345441,12345450,458,20.3
Query_60575,CP002687.1,100.000,10,0,0,1,10,12465993,12465984,458,20.3
Query_60575,CP002687.1,92.857,14,1,0,5,18,12467445,12467458,458,20.3
Query_60575,CP002687.1,100.000,10,0,0,1,10,12514864,12514855,458,20.3
Query_60575,CP002687.1,100.000,10,0,0,2,11,12556065,12556056,458,20.3
Query_60575,CP002687.1,100.000,10,0,0,1,10,12723498,12723507,458,20.3
Query_60575,CP002687.1,100.000,10,0,0,11,20,13140773,13140764,458,20.3
Query_60575,CP002687.1,100.000,10,0,0,6,15,13708468,13708477,458,20.3
Query_60575,CP002687.1,100.000,10,0,0,10,19,13762299,13762290,458,20.3
Query_60575,CP002687.1,100.000,10,0,0,9,18,13789254,13789245,458,20.3
Query_60575,CP002687.1,100.000,10,0,0,1,10,13812916,13812925,458,20.3
Query_60575,CP002687.1,100.000,10,0,0,4,13,13825145,13825154,458,20.3
Query_60575,CP002687.1,100.000,10,0,0,1,10,14077186,14077195,458,20.3
Query_60575,CP002687.1,100.000,10,0,0,11,20,14219279,14219270,458,20.3
Query_60575,CP002687.1,100.000,10,0,0,5,14,14545051,14545060,458,20.3
Query_60575,CP002687.1,100.000,10,0,0,8,17,14757474,14757465,458,20.3
Query_60575,CP002687.1,100.000,10,0,0,9,18,14790936,14790945,458,20.3
Query_60575,CP002687.1,100.000,10,0,0,5,14,14956312,14956321,458,20.3
Query_60575,CP002687.1,100.000,10,0,0,2,11,15340414,15340405,458,20.3
Query_60575,CP002687.1,100.000,10,0,0,1,10,15367969,15367978,458,20.3
Query_60575,CP002687.1,100.000,10,0,0,4,13,15586186,15586195,458,20.3
Query_60575,CP002687.1,100.000,10,0,0,5,14,15685126,15685117,458,20.3
Query_60575,CP002687.1,100.000,10,0,0,5,14,15701340,15701331,458,20.3
Query_60575,CP002687.1,100.000,10,0,0,11,20,15963873,15963864,458,20.3
Query_60575,CP002687.1,100.000,10,0,0,11,20,16164996,16165005,458,20.3
Query_60575,CP002687.1,100.000,10,0,0,1,10,16256221,16256212,458,20.3
Query_60575,CP002687.1,100.000,10,0,0,5,14,16359297,16359288,458,20.3
Query_60575,CP002687.1,100.000,10,0,0,1,10,16490369,16490360,458,20.3
Query_60575,CP002687.1,100.000,10,0,0,4,13,16727948,16727939,458,20.3
Query_60575,CP002687.1,100.000,10,0,0,1,10,16764214,16764205,458,20.3
Query_60575,CP002687.1,100.000,10,0,0,2,11,16983328,16983319,458,20.3
Query_60575,CP002687.1,100.000,10,0,0,1,10,16990601,16990592,458,20.3
Query_60575,CP002687.1,100.000,10,0,0,11,20,17010077,17010086,458,20.3
Query_60575,CP002687.1,100.000,10,0,0,2,11,17043823,17043814,458,20.3
Query_60575,CP002687.1,100.000,10,0,0,1,10,17514911,17514902,458,20.3
Query_60575,CP002687.1,100.000,10,0,0,8,17,17698106,17698097,458,20.3
Query_60575,CP002687.1,100.000,10,0,0,10,19,18396513,18396504,458,20.3
Query_60575,CP002687.1,92.857,14,1,0,6,19,18560667,18560680,458,20.3
Query_60575,CP002686.1,100.000,14,0,0,2,15,19647824,19647837,1.9,28.2
Query_60575,CP002686.1,100.000,12,0,0,6,17,863746,863757,29,24.3
Query_60575,CP002686.1,93.750,16,1,0,3,18,1999757,1999772,29,24.3
Query_60575,CP002686.1,100.000,12,0,0,9,20,3784872,3784883,29,24.3
Query_60575,CP002686.1,100.000,12,0,0,9,20,4284631,4284620,29,24.3
Query_60575,CP002686.1,100.000,12,0,0,4,15,6229016,6229027,29,24.3
Query_60575,CP002686.1,100.000,12,0,0,1,12,6837609,6837598,29,24.3
Query_60575,CP002686.1,100.000,12,0,0,6,17,8011612,8011601,29,24.3
Query_60575,CP002686.1,100.000,12,0,0,6,17,18442249,18442260,29,24.3
Query_60575,CP002686.1,100.000,12,0,0,8,19,19041932,19041943,29,24.3
Query_60575,CP002686.1,100.000,12,0,0,9,20,19441573,19441562,29,24.3
Query_60575,CP002686.1,100.000,11,0,0,10,20,903172,903182,116,22.3
Query_60575,CP002686.1,100.000,11,0,0,7,17,2088057,2088047,116,22.3
Query_60575,CP002686.1,100.000,11,0,0,10,20,3247662,3247672,116,22.3
Query_60575,CP002686.1,100.000,11,0,0,5,15,3381426,3381416,116,22.3
Query_60575,CP002686.1,100.000,11,0,0,2,12,3591563,3591573,116,22.3
Query_60575,CP002686.1,100.000,11,0,0,1,11,3957676,3957666,116,22.3
Query_60575,CP002686.1,100.000,11,0,0,10,20,4334596,4334586,116,22.3
Query_60575,CP002686.1,100.000,11,0,0,4,14,5548992,5548982,116,22.3
Query_60575,CP002686.1,100.000,11,0,0,5,15,5790788,5790778,116,22.3
Query_60575,CP002686.1,100.000,11,0,0,3,13,6673555,6673545,116,22.3
Query_60575,CP002686.1,100.000,11,0,0,2,12,6815898,6815908,116,22.3
Query_60575,CP002686.1,100.000,11,0,0,10,20,7524375,7524385,116,22.3
Query_60575,CP002686.1,100.000,11,0,0,9,19,7771217,7771227,116,22.3
Query_60575,CP002686.1,100.000,11,0,0,4,14,8687027,8687037,116,22.3
Query_60575,CP002686.1,100.000,11,0,0,8,18,9789496,9789506,116,22.3
Query_60575,CP002686.1,100.000,11,0,0,2,12,10120098,10120088,116,22.3
Query_60575,CP002686.1,100.000,11,0,0,9,19,10403660,10403650,116,22.3
Query_60575,CP002686.1,100.000,11,0,0,5,15,13879290,13879300,116,22.3
Query_60575,CP002686.1,100.000,11,0,0,1,11,14320803,14320793,116,22.3
Query_60575,CP002686.1,100.000,11,0,0,5,15,14324625,14324615,116,22.3
Query_60575,CP002686.1,100.000,11,0,0,6,16,16896459,16896469,116,22.3
Query_60575,CP002686.1,100.000,11,0,0,4,14,18177939,18177929,116,22.3
Query_60575,CP002686.1,100.000,11,0,0,1,11,18892476,18892466,116,22.3
Query_60575,CP002686.1,100.000,11,0,0,3,13,19183092,19183102,116,22.3
Query_60575,CP002686.1,100.000,11,0,0,6,16,19206787,19206777,116,22.3
Query_60575,CP002686.1,100.000,11,0,0,1,11,19822682,19822672,116,22.3
Query_60575,CP002686.1,100.000,11,0,0,9,19,20949773,20949763,116,22.3
Query_60575,CP002686.1,100.000,11,0,0,6,16,21623635,21623645,116,22.3
Query_60575,CP002686.1,100.000,11,0,0,3,13,21949337,21949327,116,22.3
Query_60575,CP002686.1,100.000,10,0,0,6,15,307452,307443,458,20.3
Query_60575,CP002686.1,100.000,10,0,0,10,19,756967,756958,458,20.3
Query_60575,CP002686.1,100.000,10,0,0,5,14,810328,810337,458,20.3
Query_60575,CP002686.1,100.000,10,0,0,5,14,1122003,1121994,458,20.3
Query_60575,CP002686.1,100.000,10,0,0,1,10,1577461,1577470,458,20.3
Query_60575,CP002686.1,100.000,10,0,0,11,20,1775865,1775856,458,20.3
Query_60575,CP002686.1,100.000,10,0,0,10,19,2061531,2061540,458,20.3
Query_60575,CP002686.1,100.000,10,0,0,1,10,2143421,2143430,458,20.3
Query_60575,CP002686.1,100.000,10,0,0,6,15,2296719,2296728,458,20.3
Query_60575,CP002686.1,92.857,14,1,0,2,15,2511641,2511628,458,20.3
Query_60575,CP002686.1,100.000,10,0,0,10,19,2642442,2642451,458,20.3
Query_60575,CP002686.1,100.000,10,0,0,10,19,2644498,2644507,458,20.3
Query_60575,CP002686.1,100.000,10,0,0,9,18,2995864,2995873,458,20.3
Query_60575,CP002686.1,100.000,10,0,0,8,17,3292439,3292430,458,20.3
Query_60575,CP002686.1,100.000,10,0,0,11,20,3546414,3546405,458,20.3
Query_60575,CP002686.1,100.000,10,0,0,8,17,3548493,3548502,458,20.3
Query_60575,CP002686.1,100.000,10,0,0,1,10,3592197,3592206,458,20.3
Query_60575,CP002686.1,100.000,10,0,0,1,10,3698049,3698040,458,20.3
Query_60575,CP002686.1,100.000,10,0,0,8,17,3755627,3755618,458,20.3
Query_60575,CP002686.1,100.000,10,0,0,6,15,3839531,3839540,458,20.3
Query_60575,CP002686.1,100.000,10,0,0,1,10,3860802,3860793,458,20.3
Query_60575,CP002686.1,100.000,10,0,0,8,17,3996294,3996303,458,20.3
Query_60575,CP002686.1,100.000,10,0,0,1,10,4102774,4102765,458,20.3
Query_60575,CP002686.1,100.000,10,0,0,7,16,4178703,4178694,458,20.3
Query_60575,CP002686.1,100.000,10,0,0,11,20,4551254,4551245,458,20.3
Query_60575,CP002686.1,100.000,10,0,0,1,10,4779368,4779359,458,20.3
Query_60575,CP002686.1,100.000,10,0,0,1,10,4846151,4846160,458,20.3
Query_60575,CP002686.1,100.000,10,0,0,7,16,4862182,4862173,458,20.3
Query_60575,CP002686.1,100.000,10,0,0,5,14,4953829,4953820,458,20.3
Query_60575,CP002686.1,100.000,10,0,0,1,10,5046506,5046497,458,20.3
Query_60575,CP002686.1,100.000,10,0,0,6,15,5082280,5082289,458,20.3
Query_60575,CP002686.1,100.000,10,0,0,1,10,5125566,5125557,458,20.3
Query_60575,CP002686.1,100.000,10,0,0,1,10,5152899,5152890,458,20.3
Query_60575,CP002686.1,100.000,10,0,0,10,19,5314204,5314213,458,20.3
Query_60575,CP002686.1,100.000,10,0,0,5,14,5336670,5336661,458,20.3
Query_60575,CP002686.1,100.000,10,0,0,1,10,5752390,5752399,458,20.3
Query_60575,CP002686.1,100.000,10,0,0,11,20,5800303,5800294,458,20.3
Query_60575,CP002686.1,100.000,10,0,0,1,10,6044583,6044592,458,20.3
Query_60575,CP002686.1,92.857,14,1,0,4,17,6142499,6142486,458,20.3
Query_60575,CP002686.1,100.000,10,0,0,3,12,6147113,6147104,458,20.3
Query_60575,CP002686.1,100.000,10,0,0,10,19,6213933,6213942,458,20.3
Query_60575,CP002686.1,100.000,10,0,0,1,10,6301877,6301868,458,20.3
Query_60575,CP002686.1,100.000,10,0,0,9,18,6385202,6385211,458,20.3
Query_60575,CP002686.1,100.000,10,0,0,11,20,6600127,6600118,458,20.3
Query_60575,CP002686.1,100.000,10,0,0,11,20,6747895,6747886,458,20.3
Query_60575,CP002686.1,100.000,10,0,0,1,10,6917121,6917112,458,20.3
Query_60575,CP002686.1,100.000,10,0,0,3,12,6935904,6935913,458,20.3
Query_60575,CP002686.1,100.000,10,0,0,10,19,7002038,7002047,458,20.3
Query_60575,CP002686.1,100.000,10,0,0,3,12,7138889,7138898,458,20.3
Query_60575,CP002686.1,100.000,10,0,0,2,11,7263297,7263306,458,20.3
Query_60575,CP002686.1,100.000,10,0,0,10,19,7323638,7323629,458,20.3
Query_60575,CP002686.1,100.000,10,0,0,3,12,7563834,7563843,458,20.3
Query_60575,CP002686.1,100.000,10,0,0,9,18,7882783,7882774,458,20.3
Query_60575,CP002686.1,100.000,10,0,0,11,20,8196267,8196258,458,20.3
Query_60575,CP002686.1,100.000,10,0,0,11,20,9241622,9241631,458,20.3
Query_60575,CP002686.1,100.000,10,0,0,11,20,9437917,9437908,458,20.3
Query_60575,CP002686.1,100.000,10,0,0,11,20,9446180,9446171,458,20.3
Query_60575,CP002686.1,100.000,10,0,0,1,10,10133010,10133019,458,20.3
Query_60575,CP002686.1,100.000,10,0,0,11,20,10197686,10197695,458,20.3
Query_60575,CP002686.1,100.000,10,0,0,5,14,10305007,10304998,458,20.3
Query_60575,CP002686.1,100.000,10,0,0,11,20,10430742,10430751,458,20.3
Query_60575,CP002686.1,100.000,10,0,0,5,14,10490370,10490361,458,20.3
Query_60575,CP002686.1,100.000,10,0,0,5,14,10490660,10490651,458,20.3
Query_60575,CP002686.1,100.000,10,0,0,11,20,10496471,10496462,458,20.3
Query_60575,CP002686.1,100.000,10,0,0,5,14,10642021,10642030,458,20.3
Query_60575,CP002686.1,100.000,10,0,0,1,10,10931121,10931130,458,20.3
Query_60575,CP002686.1,100.000,10,0,0,10,19,10955766,10955757,458,20.3
Query_60575,CP002686.1,100.000,10,0,0,11,20,10955802,10955793,458,20.3
Query_60575,CP002686.1,100.000,10,0,0,1,10,11052748,11052757,458,20.3
Query_60575,CP002686.1,100.000,10,0,0,7,16,11096715,11096724,458,20.3
Query_60575,CP002686.1,100.000,10,0,0,10,19,11107294,11107285,458,20.3
Query_60575,CP002686.1,100.000,10,0,0,10,19,11272253,11272262,458,20.3
Query_60575,CP002686.1,100.000,10,0,0,10,19,11389088,11389097,458,20.3
Query_60575,CP002686.1,100.000,10,0,0,11,20,11719355,11719364,458,20.3
Query_60575,CP002686.1,100.000,10,0,0,10,19,12388132,12388123,458,20.3
Query_60575,CP002686.1,100.000,10,0,0,10,19,12654057,12654048,458,20.3
Query_60575,CP002686.1,100.000,10,0,0,11,20,13081188,13081197,458,20.3
Query_60575,CP002686.1,100.000,10,0,0,1,10,13141502,13141511,458,20.3
Query_60575,CP002686.1,100.000,10,0,0,11,20,13212071,13212080,458,20.3
Query_60575,CP002686.1,100.000,10,0,0,11,20,14444848,14444839,458,20.3
Query_60575,CP002686.1,100.000,10,0,0,3,12,15171092,15171083,458,20.3
Query_60575,CP002686.1,100.000,10,0,0,1,10,15190846,15190855,458,20.3
Query_60575,CP002686.1,100.000,10,0,0,8,17,15209346,15209337,458,20.3
Query_60575,CP002686.1,100.000,10,0,0,5,14,15446202,15446193,458,20.3
Query_60575,CP002686.1,100.000,10,0,0,6,15,15565413,15565422,458,20.3
Query_60575,CP002686.1,100.000,10,0,0,10,19,16042224,16042215,458,20.3
Query_60575,CP002686.1,100.000,10,0,0,4,13,16251380,16251389,458,20.3
Query_60575,CP002686.1,100.000,10,0,0,10,19,16378439,16378430,458,20.3
Query_60575,CP002686.1,100.000,10,0,0,9,18,16429505,16429496,458,20.3
Query_60575,CP002686.1,100.000,10,0,0,9,18,16442321,16442312,458,20.3
Query_60575,CP002686.1,100.000,10,0,0,9,18,16684657,16684648,458,20.3
Query_60575,CP002686.1,100.000,10,0,0,6,15,16893059,16893068,458,20.3
Query_60575,CP002686.1,92.857,14,1,0,3,16,16963867,16963854,458,20.3
Query_60575,CP002686.1,92.857,14,1,0,5,18,16983959,16983946,458,20.3
Query_60575,CP002686.1,100.000,10,0,0,1,10,17335689,17335680,458,20.3
Query_60575,CP002686.1,100.000,10,0,0,3,12,17737698,17737707,458,20.3
Query_60575,CP002686.1,100.000,10,0,0,3,12,17746656,17746665,458,20.3
Query_60575,CP002686.1,100.000,10,0,0,6,15,17828136,17828145,458,20.3
Query_60575,CP002686.1,100.000,10,0,0,5,14,17916077,17916086,458,20.3
Query_60575,CP002686.1,100.000,10,0,0,1,10,17973277,17973268,458,20.3
Query_60575,CP002686.1,100.000,10,0,0,10,19,18075733,18075724,458,20.3
Query_60575,CP002686.1,100.000,10,0,0,2,11,18103131,18103140,458,20.3
Query_60575,CP002686.1,100.000,10,0,0,1,10,18312901,18312892,458,20.3
Query_60575,CP002686.1,100.000,10,0,0,4,13,18402852,18402843,458,20.3
Query_60575,CP002686.1,100.000,10,0,0,1,10,18681371,18681380,458,20.3
Query_60575,CP002686.1,100.000,10,0,0,10,19,18760101,18760092,458,20.3
Query_60575,CP002686.1,100.000,10,0,0,1,10,18916835,18916826,458,20.3
Query_60575,CP002686.1,100.000,10,0,0,5,14,18918156,18918165,458,20.3
Query_60575,CP002686.1,100.000,10,0,0,10,19,19044863,19044854,458,20.3
Query_60575,CP002686.1,100.000,10,0,0,10,19,19086438,19086447,458,20.3
Query_60575,CP002686.1,100.000,10,0,0,11,20,19089389,19089398,458,20.3
Query_60575,CP002686.1,100.000,10,0,0,11,20,19091288,19091297,458,20.3
Query_60575,CP002686.1,100.000,10,0,0,5,14,19264088,19264097,458,20.3
Query_60575,CP002686.1,100.000,10,0,0,1,10,19325746,19325755,458,20.3
Query_60575,CP002686.1,100.000,10,0,0,11,20,19398376,19398367,458,20.3
Query_60575,CP002686.1,100.000,10,0,0,5,14,19527436,19527427,458,20.3
Query_60575,CP002686.1,100.000,10,0,0,5,14,19805312,19805321,458,20.3
Query_60575,CP002686.1,100.000,10,0,0,8,17,19843335,19843326,458,20.3
Query_60575,CP002686.1,100.000,10,0,0,1,10,20016821,20016812,458,20.3
Query_60575,CP002686.1,100.000,10,0,0,10,19,20066402,20066411,458,20.3
Query_60575,CP002686.1,100.000,10,0,0,8,17,20196563,20196554,458,20.3
Query_60575,CP002686.1,100.000,10,0,0,10,19,20264276,20264285,458,20.3
Query_60575,CP002686.1,100.000,10,0,0,3,12,20611486,20611495,458,20.3
Query_60575,CP002686.1,100.000,10,0,0,11,20,20776980,20776971,458,20.3
Query_60575,CP002686.1,100.000,10,0,0,1,10,20903172,20903181,458,20.3
Query_60575,CP002686.1,100.000,10,0,0,5,14,20984202,20984211,458,20.3
Query_60575,CP002686.1,100.000,10,0,0,1,10,21070480,21070489,458,20.3
Query_60575,CP002686.1,100.000,10,0,0,7,16,21173298,21173289,458,20.3
Query_60575,CP002686.1,100.000,10,0,0,11,20,21214214,21214205,458,20.3
Query_60575,CP002686.1,100.000,10,0,0,1,10,21236863,21236854,458,20.3
Query_60575,CP002686.1,100.000,10,0,0,3,12,21344761,21344770,458,20.3
Query_60575,CP002686.1,100.000,10,0,0,8,17,21512853,21512844,458,20.3
Query_60575,CP002686.1,100.000,10,0,0,11,20,21575916,21575925,458,20.3
Query_60575,CP002686.1,100.000,10,0,0,1,10,21954096,21954087,458,20.3
Query_60575,CP002686.1,100.000,10,0,0,11,20,22023241,22023250,458,20.3
Query_60575,CP002686.1,100.000,10,0,0,9,18,22238427,22238436,458,20.3
Query_60575,CP002686.1,100.000,10,0,0,1,10,22458005,22458014,458,20.3
Query_60575,CP002686.1,100.000,10,0,0,8,17,22544879,22544870,458,20.3
Query_60575,CP002686.1,100.000,10,0,0,9,18,22579184,22579193,458,20.3
Query_60575,CP002686.1,100.000,10,0,0,1,10,22732047,22732038,458,20.3
Query_60575,CP002686.1,100.000,10,0,0,3,12,22757370,22757361,458,20.3
Query_60575,CP002686.1,100.000,10,0,0,11,20,22837214,22837205,458,20.3
Query_60575,CP002686.1,100.000,10,0,0,1,10,22906909,22906900,458,20.3
Query_60575,CP002686.1,100.000,10,0,0,11,20,23137023,23137032,458,20.3
Query_60575,CP002686.1,100.000,10,0,0,2,11,23153611,23153602,458,20.3
Query_60575,CP002686.1,100.000,10,0,0,1,10,23275871,23275862,458,20.3
Query_60575,CP002686.1,100.000,10,0,0,1,10,23301533,23301542,458,20.3
Query_60575,CP002686.1,100.000,10,0,0,11,20,23308248,23308257,458,20.3
Query_60575,CP002686.1,100.000,10,0,0,10,19,23351859,23351868,458,20.3
Query_60575,CP002688.1,100.000,13,0,0,4,16,2372923,2372911,7.4,26.3
Query_60575,CP002688.1,100.000,12,0,0,1,12,4153979,4153990,29,24.3
Query_60575,CP002688.1,100.000,12,0,0,8,19,16916594,16916583,29,24.3
Query_60575,CP002688.1,100.000,12,0,0,6,17,23450522,23450511,29,24.3
Query_60575,CP002688.1,100.000,12,0,0,8,19,24933793,24933782,29,24.3
Query_60575,CP002688.1,100.000,12,0,0,1,12,26499116,26499105,29,24.3
Query_60575,CP002688.1,100.000,12,0,0,6,17,26817228,26817217,29,24.3
Query_60575,CP002688.1,100.000,11,0,0,5,15,1164332,1164322,116,22.3
Query_60575,CP002688.1,100.000,11,0,0,2,12,1428073,1428083,116,22.3
Query_60575,CP002688.1,100.000,11,0,0,6,16,2212240,2212250,116,22.3
Query_60575,CP002688.1,100.000,11,0,0,1,11,2939257,2939267,116,22.3
Query_60575,CP002688.1,100.000,11,0,0,10,20,4481549,4481559,116,22.3
Query_60575,CP002688.1,100.000,11,0,0,1,11,4759877,4759867,116,22.3
Query_60575,CP002688.1,100.000,11,0,0,8,18,4785543,4785553,116,22.3
Query_60575,CP002688.1,89.474,19,2,0,2,20,5753240,5753258,116,22.3
Query_60575,CP002688.1,100.000,11,0,0,3,13,6316692,6316702,116,22.3
Query_60575,CP002688.1,100.000,11,0,0,9,19,7228819,7228829,116,22.3
Query_60575,CP002688.1,100.000,11,0,0,1,11,7446816,7446826,116,22.3
Query_60575,CP002688.1,93.333,15,1,0,6,20,8045983,8045997,116,22.3
Query_60575,CP002688.1,100.000,11,0,0,8,18,9732583,9732573,116,22.3
Query_60575,CP002688.1,100.000,11,0,0,10,20,10669823,10669833,116,22.3
Query_60575,CP002688.1,100.000,11,0,0,9,19,11671841,11671831,116,22.3
Query_60575,CP002688.1,100.000,11,0,0,9,19,11673442,11673432,116,22.3
Query_60575,CP002688.1,100.000,11,0,0,9,19,11676206,11676196,116,22.3
Query_60575,CP002688.1,100.000,11,0,0,9,19,11677807,11677797,116,22.3
Query_60575,CP002688.1,100.000,11,0,0,9,19,11680571,11680561,116,22.3
Query_60575,CP002688.1,100.000,11,0,0,2,12,12704621,12704631,116,22.3
Query_60575,CP002688.1,100.000,11,0,0,5,15,12773760,12773750,116,22.3
Query_60575,CP002688.1,100.000,11,0,0,10,20,13107910,13107900,116,22.3
Query_60575,CP002688.1,100.000,11,0,0,10,20,13246725,13246715,116,22.3
Query_60575,CP002688.1,100.000,11,0,0,5,15,14761898,14761888,116,22.3
Query_60575,CP002688.1,100.000,11,0,0,1,11,16331178,16331188,116,22.3
Query_60575,CP002688.1,100.000,11,0,0,1,11,17629226,17629216,116,22.3
Query_60575,CP002688.1,100.000,11,0,0,6,16,18817030,18817020,116,22.3
Query_60575,CP002688.1,100.000,11,0,0,1,11,19913833,19913823,116,22.3
Query_60575,CP002688.1,100.000,11,0,0,8,18,21983917,21983927,116,22.3
Query_60575,CP002688.1,100.000,11,0,0,6,16,23070727,23070717,116,22.3
Query_60575,CP002688.1,100.000,11,0,0,1,11,23409095,23409085,116,22.3
Query_60575,CP002688.1,100.000,11,0,0,5,15,23933775,23933765,116,22.3
Query_60575,CP002688.1,100.000,11,0,0,5,15,24989857,24989867,116,22.3
Query_60575,CP002688.1,100.000,10,0,0,1,10,27741,27732,458,20.3
Query_60575,CP002688.1,100.000,10,0,0,7,16,49078,49087,458,20.3
Query_60575,CP002688.1,100.000,10,0,0,10,19,69940,69949,458,20.3
Query_60575,CP002688.1,100.000,10,0,0,1,10,208791,208800,458,20.3
Query_60575,CP002688.1,100.000,10,0,0,4,13,212242,212251,458,20.3
Query_60575,CP002688.1,100.000,10,0,0,11,20,270182,270191,458,20.3
Query_60575,CP002688.1,100.000,10,0,0,1,10,339417,339426,458,20.3
Query_60575,CP002688.1,100.000,10,0,0,11,20,518630,518639,458,20.3
Query_60575,CP002688.1,100.000,10,0,0,5,14,611632,611641,458,20.3
Query_60575,CP002688.1,100.000,10,0,0,2,11,653941,653932,458,20.3
Query_60575,CP002688.1,100.000,10,0,0,5,14,702492,702483,458,20.3
Query_60575,CP002688.1,100.000,10,0,0,6,15,778753,778744,458,20.3
Query_60575,CP002688.1,100.000,10,0,0,10,19,900603,900594,458,20.3
Query_60575,CP002688.1,92.857,14,1,0,6,19,967247,967234,458,20.3
Query_60575,CP002688.1,100.000,10,0,0,2,11,994603,994594,458,20.3
Query_60575,CP002688.1,100.000,10,0,0,10,19,1316675,1316666,458,20.3
Query_60575,CP002688.1,100.000,10,0,0,5,14,1365843,1365852,458,20.3
Query_60575,CP002688.1,100.000,10,0,0,1,10,1375865,1375856,458,20.3
Query_60575,CP002688.1,100.000,10,0,0,2,11,1496307,1496298,458,20.3
Query_60575,CP002688.1,100.000,10,0,0,1,10,1563218,1563227,458,20.3
Query_60575,CP002688.1,100.000,10,0,0,1,10,1747299,1747308,458,20.3
Query_60575,CP002688.1,100.000,10,0,0,3,12,2321643,2321634,458,20.3
Query_60575,CP002688.1,100.000,10,0,0,2,11,2440027,2440018,458,20.3
Query_60575,CP002688.1,100.000,10,0,0,6,15,2789699,2789690,458,20.3
Query_60575,CP002688.1,100.000,10,0,0,11,20,2841169,2841178,458,20.3
Query_60575,CP002688.1,100.000,10,0,0,3,12,2871286,2871295,458,20.3
Query_60575,CP002688.1,100.000,10,0,0,5,14,2888078,2888069,458,20.3
Query_60575,CP002688.1,100.000,10,0,0,10,19,3077907,3077916,458,20.3
Query_60575,CP002688.1,100.000,10,0,0,1,10,3310856,3310847,458,20.3
Query_60575,CP002688.1,100.000,10,0,0,10,19,3772285,3772276,458,20.3
Query_60575,CP002688.1,100.000,10,0,0,4,13,3827181,3827190,458,20.3
Query_60575,CP002688.1,92.857,14,1,0,5,18,3845247,3845234,458,20.3
Query_60575,CP002688.1,100.000,10,0,0,10,19,3950817,3950808,458,20.3
Query_60575,CP002688.1,100.000,10,0,0,2,11,3971100,3971091,458,20.3
Query_60575,CP002688.1,100.000,10,0,0,11,20,4051340,4051331,458,20.3
Query_60575,CP002688.1,100.000,10,0,0,1,10,4241247,4241256,458,20.3
Query_60575,CP002688.1,100.000,10,0,0,8,17,4277182,4277173,458,20.3
Query_60575,CP002688.1,100.000,10,0,0,6,15,4615291,4615282,458,20.3
Query_60575,CP002688.1,100.000,10,0,0,10,19,4932630,4932621,458,20.3
Query_60575,CP002688.1,100.000,10,0,0,10,19,5053674,5053665,458,20.3
Query_60575,CP002688.1,100.000,10,0,0,8,17,5178249,5178258,458,20.3
Query_60575,CP002688.1,100.000,10,0,0,11,20,5207298,5207307,458,20.3
Query_60575,CP002688.1,100.000,10,0,0,10,19,5338468,5338477,458,20.3
Query_60575,CP002688.1,100.000,10,0,0,3,12,5543081,5543072,458,20.3
Query_60575,CP002688.1,100.000,10,0,0,1,10,5759949,5759958,458,20.3
Query_60575,CP002688.1,100.000,10,0,0,3,12,6180489,6180498,458,20.3
Query_60575,CP002688.1,100.000,10,0,0,11,20,6271468,6271459,458,20.3
Query_60575,CP002688.1,100.000,10,0,0,10,19,6396152,6396161,458,20.3
Query_60575,CP002688.1,100.000,10,0,0,6,15,6736077,6736068,458,20.3
Query_60575,CP002688.1,100.000,10,0,0,5,14,6837128,6837119,458,20.3
Query_60575,CP002688.1,100.000,10,0,0,10,19,7053559,7053550,458,20.3
Query_60575,CP002688.1,100.000,10,0,0,1,10,7178667,7178658,458,20.3
Query_60575,CP002688.1,100.000,10,0,0,9,18,7230189,7230198,458,20.3
Query_60575,CP002688.1,100.000,10,0,0,9,18,7249446,7249455,458,20.3
Query_60575,CP002688.1,100.000,10,0,0,1,10,7558078,7558087,458,20.3
Query_60575,CP002688.1,100.000,10,0,0,11,20,7758199,7758190,458,20.3
Query_60575,CP002688.1,100.000,10,0,0,1,10,7913327,7913336,458,20.3
Query_60575,CP002688.1,100.000,10,0,0,11,20,8359762,8359771,458,20.3
Query_60575,CP002688.1,100.000,10,0,0,11,20,8449137,8449128,458,20.3
Query_60575,CP002688.1,100.000,10,0,0,1,10,8895177,8895168,458,20.3
Query_60575,CP002688.1,100.000,10,0,0,10,19,8929161,8929152,458,20.3
Query_60575,CP002688.1,100.000,10,0,0,9,18,9233705,9233696,458,20.3
Query_60575,CP002688.1,100.000,10,0,0,11,20,9464380,9464389,458,20.3
Query_60575,CP002688.1,100.000,10,0,0,1,10,9487341,9487350,458,20.3
Query_60575,CP002688.1,100.000,10,0,0,11,20,9530462,9530453,458,20.3
Query_60575,CP002688.1,100.000,10,0,0,11,20,9543874,9543883,458,20.3
Query_60575,CP002688.1,100.000,10,0,0,11,20,9735605,9735596,458,20.3
Query_60575,CP002688.1,100.000,10,0,0,1,10,9764035,9764026,458,20.3
Query_60575,CP002688.1,100.000,10,0,0,11,20,9861570,9861561,458,20.3
Query_60575,CP002688.1,100.000,10,0,0,10,19,9944369,9944378,458,20.3
Query_60575,CP002688.1,100.000,10,0,0,11,20,9976895,9976904,458,20.3
Query_60575,CP002688.1,100.000,10,0,0,9,18,10279451,10279460,458,20.3
Query_60575,CP002688.1,100.000,10,0,0,3,12,10327680,10327671,458,20.3
Query_60575,CP002688.1,100.000,10,0,0,7,16,10614490,10614499,458,20.3
Query_60575,CP002688.1,100.000,10,0,0,8,17,10616149,10616140,458,20.3
Query_60575,CP002688.1,100.000,10,0,0,5,14,10642912,10642921,458,20.3
Query_60575,CP002688.1,100.000,10,0,0,3,12,11336186,11336195,458,20.3
Query_60575,CP002688.1,100.000,10,0,0,1,10,12271990,12271999,458,20.3
Query_60575,CP002688.1,100.000,10,0,0,5,14,12749970,12749961,458,20.3
Query_60575,CP002688.1,100.000,10,0,0,6,15,12955150,12955141,458,20.3
Query_60575,CP002688.1,100.000,10,0,0,11,20,12985252,12985261,458,20.3
Query_60575,CP002688.1,100.000,10,0,0,11,20,13008316,13008325,458,20.3
Query_60575,CP002688.1,100.000,10,0,0,6,15,13158697,13158706,458,20.3
Query_60575,CP002688.1,100.000,10,0,0,6,15,13164464,13164473,458,20.3
Query_60575,CP002688.1,100.000,10,0,0,9,18,13232862,13232853,458,20.3
Query_60575,CP002688.1,100.000,10,0,0,11,20,13425173,13425182,458,20.3
Query_60575,CP002688.1,100.000,10,0,0,10,19,13598298,13598307,458,20.3
Query_60575,CP002688.1,100.000,10,0,0,1,10,13666718,13666727,458,20.3
Query_60575,CP002688.1,100.000,10,0,0,1,10,13672232,13672241,458,20.3
Query_60575,CP002688.1,100.000,10,0,0,3,12,14443046,14443055,458,20.3
Query_60575,CP002688.1,100.000,10,0,0,3,12,14502346,14502355,458,20.3
Query_60575,CP002688.1,100.000,10,0,0,6,15,15100664,15100655,458,20.3
Query_60575,CP002688.1,100.000,10,0,0,11,20,15420830,15420821,458,20.3
Query_60575,CP002688.1,100.000,10,0,0,1,10,15453943,15453934,458,20.3
Query_60575,CP002688.1,100.000,10,0,0,11,20,15540458,15540449,458,20.3
Query_60575,CP002688.1,100.000,10,0,0,10,19,15792297,15792306,458,20.3
Query_60575,CP002688.1,100.000,10,0,0,11,20,16021347,16021338,458,20.3
Query_60575,CP002688.1,100.000,10,0,0,1,10,16156437,16156428,458,20.3
Query_60575,CP002688.1,100.000,10,0,0,1,10,16335252,16335243,458,20.3
Query_60575,CP002688.1,100.000,10,0,0,1,10,16335422,16335431,458,20.3
Query_60575,CP002688.1,100.000,10,0,0,11,20,16585727,16585736,458,20.3
Query_60575,CP002688.1,100.000,10,0,0,10,19,16738868,16738877,458,20.3
Query_60575,CP002688.1,100.000,10,0,0,2,11,17099601,17099592,458,20.3
Query_60575,CP002688.1,100.000,10,0,0,9,18,17382330,17382339,458,20.3
Query_60575,CP002688.1,100.000,10,0,0,1,10,17636056,17636065,458,20.3
Query_60575,CP002688.1,92.857,14,1,0,2,15,17649169,17649182,458,20.3
Query_60575,CP002688.1,100.000,10,0,0,10,19,17929958,17929949,458,20.3
Query_60575,CP002688.1,100.000,10,0,0,10,19,18039115,18039124,458,20.3
Query_60575,CP002688.1,100.000,10,0,0,10,19,18622183,18622174,458,20.3
Query_60575,CP002688.1,100.000,10,0,0,11,20,18949261,18949270,458,20.3
Query_60575,CP002688.1,100.000,10,0,0,11,20,19177765,19177756,458,20.3
Query_60575,CP002688.1,100.000,10,0,0,6,15,19198730,19198739,458,20.3
Query_60575,CP002688.1,100.000,10,0,0,5,14,19365258,19365249,458,20.3
Query_60575,CP002688.1,100.000,10,0,0,1,10,19370948,19370939,458,20.3
Query_60575,CP002688.1,100.000,10,0,0,9,18,19769448,19769439,458,20.3
Query_60575,CP002688.1,100.000,10,0,0,10,19,19858519,19858528,458,20.3
Query_60575,CP002688.1,100.000,10,0,0,11,20,19955067,19955058,458,20.3
Query_60575,CP002688.1,100.000,10,0,0,11,20,20077854,20077845,458,20.3
Query_60575,CP002688.1,100.000,10,0,0,10,19,20096416,20096407,458,20.3
Query_60575,CP002688.1,100.000,10,0,0,11,20,20190385,20190376,458,20.3
Query_60575,CP002688.1,100.000,10,0,0,9,18,20498957,20498966,458,20.3
Query_60575,CP002688.1,100.000,10,0,0,7,16,20562110,20562101,458,20.3
Query_60575,CP002688.1,100.000,10,0,0,7,16,20567491,20567482,458,20.3
Query_60575,CP002688.1,100.000,10,0,0,7,16,20600832,20600823,458,20.3
Query_60575,CP002688.1,100.000,10,0,0,3,12,21346859,21346850,458,20.3
Query_60575,CP002688.1,100.000,10,0,0,11,20,21498237,21498246,458,20.3
Query_60575,CP002688.1,100.000,10,0,0,1,10,22029455,22029446,458,20.3
Query_60575,CP002688.1,100.000,10,0,0,3,12,22053349,22053358,458,20.3
Query_60575,CP002688.1,100.000,10,0,0,2,11,22129628,22129619,458,20.3
Query_60575,CP002688.1,100.000,10,0,0,7,16,22314816,22314807,458,20.3
Query_60575,CP002688.1,100.000,10,0,0,10,19,22336507,22336498,458,20.3
Query_60575,CP002688.1,100.000,10,0,0,11,20,22405809,22405800,458,20.3
Query_60575,CP002688.1,100.000,10,0,0,1,10,22534234,22534225,458,20.3
Query_60575,CP002688.1,100.000,10,0,0,1,10,22658592,22658583,458,20.3
Query_60575,CP002688.1,100.000,10,0,0,11,20,22824741,22824732,458,20.3
Query_60575,CP002688.1,100.000,10,0,0,10,19,22885063,22885054,458,20.3
Query_60575,CP002688.1,100.000,10,0,0,8,17,23024541,23024532,458,20.3
Query_60575,CP002688.1,100.000,10,0,0,10,19,23184955,23184964,458,20.3
Query_60575,CP002688.1,100.000,10,0,0,9,18,23343358,23343349,458,20.3
Query_60575,CP002688.1,100.000,10,0,0,5,14,23358380,23358389,458,20.3
Query_60575,CP002688.1,100.000,10,0,0,1,10,23400119,23400128,458,20.3
Query_60575,CP002688.1,100.000,10,0,0,1,10,23503405,23503414,458,20.3
Query_60575,CP002688.1,100.000,10,0,0,2,11,23551315,23551324,458,20.3
Query_60575,CP002688.1,100.000,10,0,0,1,10,23767615,23767606,458,20.3
Query_60575,CP002688.1,92.857,14,1,0,6,19,23891313,23891326,458,20.3
Query_60575,CP002688.1,100.000,10,0,0,10,19,24176707,24176698,458,20.3
Query_60575,CP002688.1,100.000,10,0,0,1,10,24205537,24205546,458,20.3
Query_60575,CP002688.1,100.000,10,0,0,11,20,24648320,24648311,458,20.3
Query_60575,CP002688.1,100.000,10,0,0,11,20,24726598,24726607,458,20.3
Query_60575,CP002688.1,100.000,10,0,0,1,10,24793389,24793398,458,20.3
Query_60575,CP002688.1,100.000,10,0,0,1,10,24807800,24807809,458,20.3
Query_60575,CP002688.1,100.000,10,0,0,2,11,24973251,24973260,458,20.3
Query_60575,CP002688.1,100.000,10,0,0,9,18,25021388,25021397,458,20.3
Query_60575,CP002688.1,100.000,10,0,0,2,11,25090022,25090031,458,20.3
Query_60575,CP002688.1,100.000,10,0,0,11,20,25274181,25274190,458,20.3
Query_60575,CP002688.1,100.000,10,0,0,1,10,25342165,25342174,458,20.3
Query_60575,CP002688.1,100.000,10,0,0,1,10,25528135,25528144,458,20.3
Query_60575,CP002688.1,100.000,10,0,0,1,10,25685839,25685848,458,20.3
Query_60575,CP002688.1,100.000,10,0,0,7,16,26253670,26253679,458,20.3
Query_60575,CP002688.1,100.000,10,0,0,1,10,26294869,26294860,458,20.3
Query_60575,CP002688.1,100.000,10,0,0,10,19,26310435,26310426,458,20.3
Query_60575,CP002688.1,100.000,10,0,0,6,15,26318102,26318093,458,20.3
Query_60575,CP002688.1,100.000,10,0,0,11,20,26467602,26467593,458,20.3
Query_60575,CP002688.1,100.000,10,0,0,11,20,26572675,26572684,458,20.3
Query_60575,CP002688.1,100.000,10,0,0,1,10,26574737,26574728,458,20.3
Query_60575,CP002688.1,100.000,10,0,0,1,10,26765505,26765496,458,20.3
Query_60575,CP002688.1,100.000,10,0,0,3,12,26803838,26803829,458,20.3
Query_60575,CP002688.1,100.000,10,0,0,4,13,26854742,26854733,458,20.3
Query_60575,CP002685.1,100.000,13,0,0,5,17,12920073,12920085,7.4,26.3
Query_60575,CP002685.1,100.000,12,0,0,8,19,8531099,8531088,29,24.3
Query_60575,CP002685.1,100.000,12,0,0,2,13,9652031,9652042,29,24.3
Query_60575,CP002685.1,100.000,12,0,0,3,14,18925471,18925482,29,24.3
Query_60575,CP002685.1,100.000,12,0,0,9,20,18956031,18956020,29,24.3
Query_60575,CP002685.1,100.000,11,0,0,8,18,1959194,1959184,116,22.3
Query_60575,CP002685.1,100.000,11,0,0,3,13,2026567,2026577,116,22.3
Query_60575,CP002685.1,100.000,11,0,0,9,19,2574162,2574152,116,22.3
Query_60575,CP002685.1,100.000,11,0,0,6,16,2987548,2987558,116,22.3
Query_60575,CP002685.1,100.000,11,0,0,8,18,3252303,3252293,116,22.3
Query_60575,CP002685.1,100.000,11,0,0,5,15,3536792,3536802,116,22.3
Query_60575,CP002685.1,100.000,11,0,0,5,15,5100241,5100251,116,22.3
Query_60575,CP002685.1,100.000,11,0,0,5,15,5375043,5375033,116,22.3
Query_60575,CP002685.1,100.000,11,0,0,10,20,7209104,7209094,116,22.3
Query_60575,CP002685.1,100.000,11,0,0,8,18,8168295,8168305,116,22.3
Query_60575,CP002685.1,100.000,11,0,0,9,19,9293683,9293693,116,22.3
Query_60575,CP002685.1,93.333,15,1,0,6,20,9672506,9672492,116,22.3
Query_60575,CP002685.1,100.000,11,0,0,9,19,10104077,10104067,116,22.3
Query_60575,CP002685.1,100.000,11,0,0,5,15,10185971,10185961,116,22.3
Query_60575,CP002685.1,93.333,15,1,0,6,20,10773572,10773558,116,22.3
Query_60575,CP002685.1,100.000,11,0,0,10,20,12122174,12122164,116,22.3
Query_60575,CP002685.1,100.000,11,0,0,6,16,12288184,12288174,116,22.3
Query_60575,CP002685.1,100.000,11,0,0,4,14,12976239,12976229,116,22.3
Query_60575,CP002685.1,100.000,11,0,0,6,16,15090007,15090017,116,22.3
Query_60575,CP002685.1,100.000,11,0,0,10,20,15508888,15508898,116,22.3
Query_60575,CP002685.1,100.000,11,0,0,6,16,16550002,16550012,116,22.3
Query_60575,CP002685.1,100.000,11,0,0,5,15,18255831,18255841,116,22.3
Query_60575,CP002685.1,100.000,11,0,0,5,15,19461989,19461979,116,22.3
Query_60575,CP002685.1,100.000,10,0,0,9,18,292021,292030,458,20.3
Query_60575,CP002685.1,100.000,10,0,0,10,19,292370,292361,458,20.3
Query_60575,CP002685.1,100.000,10,0,0,11,20,495006,495015,458,20.3
Query_60575,CP002685.1,100.000,10,0,0,11,20,611984,611975,458,20.3
Query_60575,CP002685.1,100.000,10,0,0,11,20,617447,617438,458,20.3
Query_60575,CP002685.1,100.000,10,0,0,2,11,707085,707094,458,20.3
Query_60575,CP002685.1,100.000,10,0,0,1,10,1102814,1102805,458,20.3
Query_60575,CP002685.1,100.000,10,0,0,11,20,1167609,1167600,458,20.3
Query_60575,CP002685.1,100.000,10,0,0,5,14,1655216,1655225,458,20.3
Query_60575,CP002685.1,100.000,10,0,0,10,19,1890301,1890292,458,20.3
Query_60575,CP002685.1,100.000,10,0,0,10,19,2145255,2145264,458,20.3
Query_60575,CP002685.1,100.000,10,0,0,1,10,2188945,2188936,458,20.3
Query_60575,CP002685.1,100.000,10,0,0,10,19,2195686,2195695,458,20.3
Query_60575,CP002685.1,100.000,10,0,0,1,10,2901963,2901954,458,20.3
Query_60575,CP002685.1,100.000,10,0,0,2,11,2992234,2992243,458,20.3
Query_60575,CP002685.1,100.000,10,0,0,10,19,3222710,3222701,458,20.3
Query_60575,CP002685.1,100.000,10,0,0,10,19,3414228,3414219,458,20.3
Query_60575,CP002685.1,100.000,10,0,0,5,14,4006298,4006307,458,20.3
Query_60575,CP002685.1,100.000,10,0,0,9,18,4226587,4226578,458,20.3
Query_60575,CP002685.1,100.000,10,0,0,11,20,5031006,5030997,458,20.3
Query_60575,CP002685.1,100.000,10,0,0,11,20,5143982,5143973,458,20.3
Query_60575,CP002685.1,100.000,10,0,0,10,19,5680283,5680292,458,20.3
Query_60575,CP002685.1,100.000,10,0,0,8,17,6143087,6143078,458,20.3
Query_60575,CP002685.1,100.000,10,0,0,11,20,6185842,6185851,458,20.3
Query_60575,CP002685.1,100.000,10,0,0,1,10,6308664,6308673,458,20.3
Query_60575,CP002685.1,100.000,10,0,0,3,12,7144252,7144243,458,20.3
Query_60575,CP002685.1,100.000,10,0,0,5,14,7292338,7292347,458,20.3
Query_60575,CP002685.1,100.000,10,0,0,10,19,7575411,7575420,458,20.3
Query_60575,CP002685.1,100.000,10,0,0,9,18,7720038,7720047,458,20.3
Query_60575,CP002685.1,100.000,10,0,0,11,20,7767421,7767412,458,20.3
Query_60575,CP002685.1,100.000,10,0,0,5,14,8021910,8021901,458,20.3
Query_60575,CP002685.1,100.000,10,0,0,10,19,8025499,8025508,458,20.3
Query_60575,CP002685.1,100.000,10,0,0,8,17,8084187,8084196,458,20.3
Query_60575,CP002685.1,100.000,10,0,0,1,10,8087668,8087659,458,20.3
Query_60575,CP002685.1,100.000,10,0,0,1,10,8294249,8294258,458,20.3
Query_60575,CP002685.1,100.000,10,0,0,11,20,8316134,8316125,458,20.3
Query_60575,CP002685.1,100.000,10,0,0,3,12,8465395,8465386,458,20.3
Query_60575,CP002685.1,100.000,10,0,0,10,19,8863759,8863750,458,20.3
Query_60575,CP002685.1,100.000,10,0,0,5,14,8945041,8945032,458,20.3
Query_60575,CP002685.1,100.000,10,0,0,5,14,9288325,9288334,458,20.3
Query_60575,CP002685.1,100.000,10,0,0,1,10,9320059,9320050,458,20.3
Query_60575,CP002685.1,100.000,10,0,0,10,19,9340641,9340650,458,20.3
Query_60575,CP002685.1,100.000,10,0,0,11,20,9390466,9390475,458,20.3
Query_60575,CP002685.1,100.000,10,0,0,11,20,9530406,9530415,458,20.3
Query_60575,CP002685.1,100.000,10,0,0,5,14,9586433,9586442,458,20.3
Query_60575,CP002685.1,100.000,10,0,0,1,10,9593808,9593817,458,20.3
Query_60575,CP002685.1,100.000,10,0,0,1,10,10367014,10367023,458,20.3
Query_60575,CP002685.1,100.000,10,0,0,1,10,10414112,10414103,458,20.3
Query_60575,CP002685.1,100.000,10,0,0,5,14,10488684,10488675,458,20.3
Query_60575,CP002685.1,100.000,10,0,0,11,20,10743625,10743634,458,20.3
Query_60575,CP002685.1,100.000,10,0,0,1,10,10793700,10793709,458,20.3
Query_60575,CP002685.1,100.000,10,0,0,8,17,10907762,10907753,458,20.3
Query_60575,CP002685.1,92.857,14,1,0,5,18,11042040,11042053,458,20.3
Query_60575,CP002685.1,100.000,10,0,0,11,20,11132663,11132654,458,20.3
Query_60575,CP002685.1,100.000,10,0,0,5,14,11148268,11148259,458,20.3
Query_60575,CP002685.1,100.000,10,0,0,1,10,11227971,11227980,458,20.3
Query_60575,CP002685.1,100.000,10,0,0,11,20,11289554,11289563,458,20.3
Query_60575,CP002685.1,100.000,10,0,0,4,13,11319623,11319632,458,20.3
Query_60575,CP002685.1,100.000,10,0,0,6,15,11799757,11799766,458,20.3
Query_60575,CP002685.1,100.000,10,0,0,2,11,11812940,11812931,458,20.3
Query_60575,CP002685.1,100.000,10,0,0,1,10,11898534,11898543,458,20.3
Query_60575,CP002685.1,100.000,10,0,0,10,19,11899731,11899722,458,20.3
Query_60575,CP002685.1,100.000,10,0,0,3,12,11913860,11913869,458,20.3
Query_60575,CP002685.1,100.000,10,0,0,5,14,11946989,11946980,458,20.3
Query_60575,CP002685.1,100.000,10,0,0,11,20,12327207,12327216,458,20.3
Query_60575,CP002685.1,100.000,10,0,0,3,12,12922254,12922263,458,20.3
Query_60575,CP002685.1,100.000,10,0,0,2,11,13016122,13016113,458,20.3
Query_60575,CP002685.1,100.000,10,0,0,10,19,13191456,13191465,458,20.3
Query_60575,CP002685.1,100.000,10,0,0,10,19,13318249,13318240,458,20.3
Query_60575,CP002685.1,100.000,10,0,0,6,15,13390081,13390072,458,20.3
Query_60575,CP002685.1,100.000,10,0,0,11,20,13971603,13971594,458,20.3
Query_60575,CP002685.1,100.000,10,0,0,9,18,14021736,14021727,458,20.3
Query_60575,CP002685.1,100.000,10,0,0,11,20,14448936,14448927,458,20.3
Query_60575,CP002685.1,100.000,10,0,0,11,20,14781527,14781536,458,20.3
Query_60575,CP002685.1,100.000,10,0,0,11,20,14792672,14792663,458,20.3
Query_60575,CP002685.1,100.000,10,0,0,5,14,14973449,14973458,458,20.3
Query_60575,CP002685.1,100.000,10,0,0,1,10,15073352,15073343,458,20.3
Query_60575,CP002685.1,100.000,10,0,0,11,20,15145704,15145695,458,20.3
Query_60575,CP002685.1,100.000,10,0,0,6,15,15344635,15344644,458,20.3
Query_60575,CP002685.1,100.000,10,0,0,5,14,15614655,15614664,458,20.3
Query_60575,CP002685.1,100.000,10,0,0,5,14,15617915,15617906,458,20.3
Query_60575,CP002685.1,100.000,10,0,0,5,14,15945579,15945588,458,20.3
Query_60575,CP002685.1,100.000,10,0,0,2,11,16134546,16134537,458,20.3
Query_60575,CP002685.1,100.000,10,0,0,9,18,16489859,16489850,458,20.3
Query_60575,CP002685.1,100.000,10,0,0,2,11,16562956,16562947,458,20.3
Query_60575,CP002685.1,100.000,10,0,0,1,10,16634006,16634015,458,20.3
Query_60575,CP002685.1,100.000,10,0,0,2,11,16665943,16665934,458,20.3
Query_60575,CP002685.1,100.000,10,0,0,3,12,16810629,16810620,458,20.3
Query_60575,CP002685.1,100.000,10,0,0,3,12,16926482,16926491,458,20.3
Query_60575,CP002685.1,100.000,10,0,0,1,10,17300565,17300574,458,20.3
Query_60575,CP002685.1,100.000,10,0,0,10,19,17331289,17331280,458,20.3
Query_60575,CP002685.1,100.000,10,0,0,11,20,17334859,17334850,458,20.3
Query_60575,CP002685.1,100.000,10,0,0,9,18,17390214,17390223,458,20.3
Query_60575,CP002685.1,100.000,10,0,0,3,12,17557732,17557741,458,20.3
Query_60575,CP002685.1,100.000,10,0,0,3,12,17561302,17561311,458,20.3
Query_60575,CP002685.1,100.000,10,0,0,3,12,17579593,17579602,458,20.3
Query_60575,CP002685.1,100.000,10,0,0,1,10,17639630,17639639,458,20.3
Query_60575,CP002685.1,100.000,10,0,0,1,10,17641316,17641325,458,20.3
Query_60575,CP002685.1,100.000,10,0,0,10,19,17664061,17664052,458,20.3
Query_60575,CP002685.1,100.000,10,0,0,11,20,17688400,17688391,458,20.3
Query_60575,CP002685.1,100.000,10,0,0,10,19,18322611,18322602,458,20.3
Query_60575,CP002685.1,100.000,10,0,0,1,10,18339368,18339359,458,20.3
Query_60575,CP002685.1,100.000,10,0,0,2,11,18553297,18553306,458,20.3
Query_60575,CP002685.1,100.000,10,0,0,2,11,18581418,18581427,458,20.3
Query_60575,CP002685.1,100.000,10,0,0,3,12,18706059,18706050,458,20.3
Query_60575,CP002685.1,100.000,10,0,0,4,13,18800450,18800459,458,20.3
Query_60575,CP002685.1,100.000,10,0,0,1,10,18898044,18898053,458,20.3
Query_60575,CP002685.1,100.000,10,0,0,1,10,18913788,18913779,458,20.3
Query_60575,CP002685.1,100.000,10,0,0,1,10,18919289,18919298,458,20.3
Query_60575,CP002685.1,100.000,10,0,0,1,10,19352702,19352693,458,20.3
Query_60575,CP002685.1,100.000,10,0,0,6,15,19511276,19511285,458,20.3
Query_60575,CP002685.1,100.000,10,0,0,2,11,19544302,19544293,458,20.3
Query_60575,AP000423.1,100.000,13,0,0,2,14,108327,108339,7.4,26.3
Query_60575,AP000423.1,100.000,13,0,0,2,14,130322,130310,7.4,26.3
Query_60575,AP000423.1,92.857,14,1,0,7,20,34335,34322,458,20.3
Query_60575,CP002684.1,100.000,12,0,0,1,12,830321,830332,29,24.3
Query_60575,CP002684.1,100.000,12,0,0,1,12,5884905,5884894,29,24.3
Query_60575,CP002684.1,100.000,12,0,0,1,12,7261577,7261588,29,24.3
Query_60575,CP002684.1,100.000,12,0,0,9,20,17936296,17936285,29,24.3
Query_60575,CP002684.1,100.000,11,0,0,9,19,166016,166006,116,22.3
Query_60575,CP002684.1,100.000,11,0,0,6,16,625240,625230,116,22.3
Query_60575,CP002684.1,100.000,11,0,0,4,14,2966463,2966473,116,22.3
Query_60575,CP002684.1,100.000,11,0,0,4,14,3756861,3756871,116,22.3
Query_60575,CP002684.1,100.000,11,0,0,10,20,3882671,3882681,116,22.3
Query_60575,CP002684.1,100.000,11,0,0,2,12,4381145,4381135,116,22.3
Query_60575,CP002684.1,100.000,11,0,0,8,18,4397220,4397210,116,22.3
Query_60575,CP002684.1,100.000,11,0,0,1,11,4740001,4740011,116,22.3
Query_60575,CP002684.1,100.000,11,0,0,1,11,4851588,4851598,116,22.3
Query_60575,CP002684.1,100.000,11,0,0,10,20,6425962,6425952,116,22.3
Query_60575,CP002684.1,100.000,11,0,0,3,13,6619892,6619902,116,22.3
Query_60575,CP002684.1,100.000,11,0,0,1,11,7239298,7239308,116,22.3
Query_60575,CP002684.1,100.000,11,0,0,2,12,8451188,8451198,116,22.3
Query_60575,CP002684.1,100.000,11,0,0,2,12,8496177,8496187,116,22.3
Query_60575,CP002684.1,100.000,11,0,0,2,12,13227640,13227650,116,22.3
Query_60575,CP002684.1,100.000,11,0,0,10,20,15101778,15101768,116,22.3
Query_60575,CP002684.1,100.000,11,0,0,10,20,15688336,15688326,116,22.3
Query_60575,CP002684.1,100.000,11,0,0,10,20,15818527,15818517,116,22.3
Query_60575,CP002684.1,100.000,11,0,0,1,11,16243673,16243663,116,22.3
Query_60575,CP002684.1,100.000,11,0,0,4,14,16916706,16916716,116,22.3
Query_60575,CP002684.1,100.000,11,0,0,2,12,17179493,17179503,116,22.3
Query_60575,CP002684.1,100.000,11,0,0,2,12,17266438,17266428,116,22.3
Query_60575,CP002684.1,100.000,11,0,0,10,20,18316666,18316656,116,22.3
Query_60575,CP002684.1,100.000,11,0,0,10,20,18995562,18995552,116,22.3
Query_60575,CP002684.1,100.000,11,0,0,1,11,19492937,19492947,116,22.3
Query_60575,CP002684.1,93.333,15,1,0,3,17,20015594,20015580,116,22.3
Query_60575,CP002684.1,100.000,11,0,0,8,18,20348537,20348547,116,22.3
Query_60575,CP002684.1,100.000,11,0,0,4,14,21954332,21954322,116,22.3
Query_60575,CP002684.1,100.000,11,0,0,1,11,22516543,22516533,116,22.3
Query_60575,CP002684.1,100.000,11,0,0,10,20,22936934,22936924,116,22.3
Query_60575,CP002684.1,100.000,11,0,0,1,11,23342702,23342692,116,22.3
Query_60575,CP002684.1,100.000,11,0,0,9,19,23561196,23561186,116,22.3
Query_60575,CP002684.1,100.000,11,0,0,8,18,23858379,23858369,116,22.3
Query_60575,CP002684.1,100.000,11,0,0,10,20,24994072,24994082,116,22.3
Query_60575,CP002684.1,100.000,11,0,0,5,15,25519065,25519055,116,22.3
Query_60575,CP002684.1,100.000,11,0,0,9,19,26417860,26417850,116,22.3
Query_60575,CP002684.1,100.000,11,0,0,6,16,26478092,26478082,116,22.3
Query_60575,CP002684.1,100.000,11,0,0,9,19,26725699,26725709,116,22.3
Query_60575,CP002684.1,100.000,11,0,0,2,12,26817539,26817549,116,22.3
Query_60575,CP002684.1,100.000,11,0,0,2,12,27389023,27389013,116,22.3
Query_60575,CP002684.1,100.000,11,0,0,1,11,27478951,27478941,116,22.3
Query_60575,CP002684.1,100.000,11,0,0,1,11,28740167,28740157,116,22.3
Query_60575,CP002684.1,100.000,11,0,0,1,11,29248910,29248920,116,22.3
Query_60575,CP002684.1,100.000,11,0,0,5,15,29327563,29327553,116,22.3
Query_60575,CP002684.1,100.000,11,0,0,1,11,29735967,29735957,116,22.3
Query_60575,CP002684.1,100.000,11,0,0,10,20,29886818,29886828,116,22.3
Query_60575,CP002684.1,100.000,10,0,0,1,10,99401,99410,458,20.3
Query_60575,CP002684.1,100.000,10,0,0,11,20,213730,213739,458,20.3
Query_60575,CP002684.1,100.000,10,0,0,11,20,532409,532418,458,20.3
Query_60575,CP002684.1,100.000,10,0,0,5,14,833372,833381,458,20.3
Query_60575,CP002684.1,100.000,10,0,0,7,16,954877,954868,458,20.3
Query_60575,CP002684.1,100.000,10,0,0,10,19,1203137,1203146,458,20.3
Query_60575,CP002684.1,100.000,10,0,0,5,14,1342536,1342527,458,20.3
Query_60575,CP002684.1,100.000,10,0,0,1,10,1469124,1469133,458,20.3
Query_60575,CP002684.1,100.000,10,0,0,10,19,1606114,1606105,458,20.3
Query_60575,CP002684.1,100.000,10,0,0,3,12,1702844,1702853,458,20.3
Query_60575,CP002684.1,100.000,10,0,0,2,11,1730137,1730146,458,20.3
Query_60575,CP002684.1,100.000,10,0,0,11,20,1797690,1797699,458,20.3
Query_60575,CP002684.1,100.000,10,0,0,2,11,1829238,1829229,458,20.3
Query_60575,CP002684.1,100.000,10,0,0,2,11,2090250,2090259,458,20.3
Query_60575,CP002684.1,100.000,10,0,0,11,20,2154817,2154808,458,20.3
Query_60575,CP002684.1,100.000,10,0,0,1,10,2169921,2169930,458,20.3
Query_60575,CP002684.1,100.000,10,0,0,10,19,2201857,2201866,458,20.3
Query_60575,CP002684.1,100.000,10,0,0,4,13,2307039,2307048,458,20.3
Query_60575,CP002684.1,100.000,10,0,0,5,14,2317856,2317847,458,20.3
Query_60575,CP002684.1,100.000,10,0,0,1,10,2446182,2446173,458,20.3
Query_60575,CP002684.1,100.000,10,0,0,10,19,2491978,2491987,458,20.3
Query_60575,CP002684.1,100.000,10,0,0,10,19,2530554,2530563,458,20.3
Query_60575,CP002684.1,100.000,10,0,0,5,14,2574222,2574213,458,20.3
Query_60575,CP002684.1,100.000,10,0,0,11,20,2695744,2695753,458,20.3
Query_60575,CP002684.1,100.000,10,0,0,6,15,2831962,2831971,458,20.3
Query_60575,CP002684.1,100.000,10,0,0,6,15,3012152,3012143,458,20.3
Query_60575,CP002684.1,100.000,10,0,0,1,10,3057733,3057724,458,20.3
Query_60575,CP002684.1,100.000,10,0,0,1,10,3061952,3061943,458,20.3
Query_60575,CP002684.1,100.000,10,0,0,3,12,3764201,3764192,458,20.3
Query_60575,CP002684.1,100.000,10,0,0,5,14,3849839,3849848,458,20.3
Query_60575,CP002684.1,100.000,10,0,0,10,19,3886073,3886082,458,20.3
Query_60575,CP002684.1,100.000,10,0,0,11,20,4038505,4038514,458,20.3
Query_60575,CP002684.1,100.000,10,0,0,2,11,4071045,4071054,458,20.3
Query_60575,CP002684.1,100.000,10,0,0,3,12,4082671,4082662,458,20.3
Query_60575,CP002684.1,100.000,10,0,0,8,17,4121459,4121450,458,20.3
Query_60575,CP002684.1,100.000,10,0,0,8,17,4137703,4137694,458,20.3
Query_60575,CP002684.1,100.000,10,0,0,2,11,4420860,4420869,458,20.3
Query_60575,CP002684.1,100.000,10,0,0,7,16,4703908,4703899,458,20.3
Query_60575,CP002684.1,100.000,10,0,0,8,17,4878689,4878698,458,20.3
Query_60575,CP002684.1,100.000,10,0,0,1,10,5149655,5149664,458,20.3
Query_60575,CP002684.1,100.000,10,0,0,11,20,5269426,5269417,458,20.3
Query_60575,CP002684.1,100.000,10,0,0,11,20,5776109,5776118,458,20.3
Query_60575,CP002684.1,100.000,10,0,0,5,14,5888126,5888135,458,20.3
Query_60575,CP002684.1,100.000,10,0,0,11,20,5979981,5979972,458,20.3
Query_60575,CP002684.1,100.000,10,0,0,9,18,6373230,6373239,458,20.3
Query_60575,CP002684.1,100.000,10,0,0,11,20,6426082,6426073,458,20.3
Query_60575,CP002684.1,100.000,10,0,0,1,10,6688616,6688625,458,20.3
Query_60575,CP002684.1,100.000,10,0,0,1,10,6709459,6709468,458,20.3
Query_60575,CP002684.1,100.000,10,0,0,1,10,6862261,6862270,458,20.3
Query_60575,CP002684.1,100.000,10,0,0,1,10,6917456,6917465,458,20.3
Query_60575,CP002684.1,100.000,10,0,0,9,18,6935924,6935933,458,20.3
Query_60575,CP002684.1,100.000,10,0,0,1,10,7039448,7039457,458,20.3
Query_60575,CP002684.1,100.000,10,0,0,9,18,7054024,7054015,458,20.3
Query_60575,CP002684.1,100.000,10,0,0,2,11,7102175,7102166,458,20.3
Query_60575,CP002684.1,100.000,10,0,0,11,20,7231061,7231052,458,20.3
Query_60575,CP002684.1,100.000,10,0,0,10,19,7507183,7507174,458,20.3
Query_60575,CP002684.1,100.000,10,0,0,7,16,7542148,7542139,458,20.3
Query_60575,CP002684.1,100.000,10,0,0,2,11,7645641,7645632,458,20.3
Query_60575,CP002684.1,100.000,10,0,0,11,20,7776435,7776444,458,20.3
Query_60575,CP002684.1,100.000,10,0,0,8,17,7783383,7783392,458,20.3
Query_60575,CP002684.1,100.000,10,0,0,2,11,7902444,7902453,458,20.3
Query_60575,CP002684.1,100.000,10,0,0,2,11,8058632,8058641,458,20.3
Query_60575,CP002684.1,100.000,10,0,0,2,11,8175873,8175882,458,20.3
Query_60575,CP002684.1,100.000,10,0,0,10,19,8243748,8243757,458,20.3
Query_60575,CP002684.1,100.000,10,0,0,6,15,8273821,8273812,458,20.3
Query_60575,CP002684.1,100.000,10,0,0,1,10,8523568,8523559,458,20.3
Query_60575,CP002684.1,100.000,10,0,0,3,12,8642200,8642209,458,20.3
Query_60575,CP002684.1,100.000,10,0,0,1,10,8676623,8676614,458,20.3
Query_60575,CP002684.1,100.000,10,0,0,4,13,9421991,9422000,458,20.3
Query_60575,CP002684.1,100.000,10,0,0,11,20,9443486,9443495,458,20.3
Query_60575,CP002684.1,100.000,10,0,0,1,10,9615613,9615604,458,20.3
Query_60575,CP002684.1,100.000,10,0,0,4,13,9638091,9638100,458,20.3
Query_60575,CP002684.1,100.000,10,0,0,1,10,9668476,9668467,458,20.3
Query_60575,CP002684.1,100.000,10,0,0,8,17,9809730,9809739,458,20.3
Query_60575,CP002684.1,100.000,10,0,0,9,18,10224976,10224985,458,20.3
Query_60575,CP002684.1,100.000,10,0,0,1,10,10261333,10261324,458,20.3
Query_60575,CP002684.1,100.000,10,0,0,11,20,10263692,10263683,458,20.3
Query_60575,CP002684.1,100.000,10,0,0,11,20,10351649,10351640,458,20.3
Query_60575,CP002684.1,100.000,10,0,0,10,19,10516970,10516961,458,20.3
Query_60575,CP002684.1,100.000,10,0,0,11,20,10709553,10709562,458,20.3
Query_60575,CP002684.1,100.000,10,0,0,10,19,10783833,10783824,458,20.3
Query_60575,CP002684.1,100.000,10,0,0,6,15,11064603,11064594,458,20.3
Query_60575,CP002684.1,100.000,10,0,0,8,17,11135674,11135665,458,20.3
Query_60575,CP002684.1,100.000,10,0,0,5,14,11168816,11168807,458,20.3
Query_60575,CP002684.1,100.000,10,0,0,4,13,11181876,11181885,458,20.3
Query_60575,CP002684.1,100.000,10,0,0,11,20,11444731,11444740,458,20.3
Query_60575,CP002684.1,100.000,10,0,0,9,18,11460928,11460937,458,20.3
Query_60575,CP002684.1,100.000,10,0,0,6,15,11488487,11488478,458,20.3
Query_60575,CP002684.1,100.000,10,0,0,1,10,11950950,11950941,458,20.3
Query_60575,CP002684.1,100.000,10,0,0,11,20,12235905,12235896,458,20.3
Query_60575,CP002684.1,100.000,10,0,0,1,10,12343807,12343798,458,20.3
Query_60575,CP002684.1,100.000,10,0,0,9,18,12455981,12455990,458,20.3
Query_60575,CP002684.1,100.000,10,0,0,10,19,12764437,12764446,458,20.3
Query_60575,CP002684.1,100.000,10,0,0,1,10,13079519,13079528,458,20.3
Query_60575,CP002684.1,100.000,10,0,0,1,10,13559708,13559699,458,20.3
Query_60575,CP002684.1,100.000,10,0,0,3,12,13965595,13965604,458,20.3
Query_60575,CP002684.1,100.000,10,0,0,1,10,14065130,14065121,458,20.3
Query_60575,CP002684.1,100.000,10,0,0,10,19,14303460,14303451,458,20.3
Query_60575,CP002684.1,100.000,10,0,0,1,10,14359795,14359804,458,20.3
Query_60575,CP002684.1,100.000,10,0,0,1,10,14405448,14405457,458,20.3
Query_60575,CP002684.1,100.000,10,0,0,1,10,14470293,14470302,458,20.3
Query_60575,CP002684.1,100.000,10,0,0,1,10,15532904,15532895,458,20.3
Query_60575,CP002684.1,100.000,10,0,0,10,19,15649481,15649490,458,20.3
Query_60575,CP002684.1,100.000,10,0,0,11,20,16043853,16043862,458,20.3
Query_60575,CP002684.1,100.000,10,0,0,6,15,16204662,16204653,458,20.3
Query_60575,CP002684.1,100.000,10,0,0,1,10,16295086,16295077,458,20.3
Query_60575,CP002684.1,100.000,10,0,0,1,10,16306083,16306074,458,20.3
Query_60575,CP002684.1,100.000,10,0,0,9,18,16313051,16313042,458,20.3
Query_60575,CP002684.1,100.000,10,0,0,6,15,16367322,16367331,458,20.3
Query_60575,CP002684.1,100.000,10,0,0,6,15,16439800,16439791,458,20.3
Query_60575,CP002684.1,100.000,10,0,0,1,10,16560994,16560985,458,20.3
Query_60575,CP002684.1,100.000,10,0,0,1,10,17127310,17127301,458,20.3
Query_60575,CP002684.1,100.000,10,0,0,6,15,17463831,17463822,458,20.3
Query_60575,CP002684.1,100.000,10,0,0,6,15,17473125,17473116,458,20.3
Query_60575,CP002684.1,100.000,10,0,0,1,10,18240882,18240873,458,20.3
Query_60575,CP002684.1,100.000,10,0,0,3,12,18802640,18802649,458,20.3
Query_60575,CP002684.1,100.000,10,0,0,5,14,18901888,18901897,458,20.3
Query_60575,CP002684.1,100.000,10,0,0,3,12,19313981,19313972,458,20.3
Query_60575,CP002684.1,100.000,10,0,0,11,20,19410328,19410337,458,20.3
Query_60575,CP002684.1,100.000,10,0,0,10,19,19433974,19433965,458,20.3
Query_60575,CP002684.1,100.000,10,0,0,3,12,19488160,19488169,458,20.3
Query_60575,CP002684.1,100.000,10,0,0,7,16,19739674,19739683,458,20.3
Query_60575,CP002684.1,100.000,10,0,0,6,15,19754728,19754719,458,20.3
Query_60575,CP002684.1,100.000,10,0,0,1,10,19832612,19832603,458,20.3
Query_60575,CP002684.1,100.000,10,0,0,1,10,19913417,19913426,458,20.3
Query_60575,CP002684.1,100.000,10,0,0,5,14,19923470,19923479,458,20.3
Query_60575,CP002684.1,100.000,10,0,0,11,20,20064532,20064541,458,20.3
Query_60575,CP002684.1,100.000,10,0,0,7,16,20145646,20145655,458,20.3
Query_60575,CP002684.1,100.000,10,0,0,11,20,21040737,21040728,458,20.3
Query_60575,CP002684.1,100.000,10,0,0,1,10,21311601,21311610,458,20.3
Query_60575,CP002684.1,100.000,10,0,0,11,20,21799055,21799064,458,20.3
Query_60575,CP002684.1,100.000,10,0,0,11,20,21835313,21835322,458,20.3
Query_60575,CP002684.1,100.000,10,0,0,11,20,21938893,21938884,458,20.3
Query_60575,CP002684.1,100.000,10,0,0,11,20,22332789,22332780,458,20.3
Query_60575,CP002684.1,100.000,10,0,0,4,13,22527672,22527681,458,20.3
Query_60575,CP002684.1,100.000,10,0,0,1,10,23072878,23072887,458,20.3
Query_60575,CP002684.1,100.000,10,0,0,11,20,23152165,23152174,458,20.3
Query_60575,CP002684.1,100.000,10,0,0,11,20,23160207,23160216,458,20.3
Query_60575,CP002684.1,100.000,10,0,0,11,20,23526449,23526440,458,20.3
Query_60575,CP002684.1,100.000,10,0,0,3,12,23762229,23762220,458,20.3
Query_60575,CP002684.1,100.000,10,0,0,5,14,23785624,23785615,458,20.3
Query_60575,CP002684.1,100.000,10,0,0,8,17,23860515,23860506,458,20.3
Query_60575,CP002684.1,100.000,10,0,0,4,13,23889201,23889192,458,20.3
Query_60575,CP002684.1,100.000,10,0,0,11,20,24648767,24648758,458,20.3
Query_60575,CP002684.1,100.000,10,0,0,1,10,24671476,24671485,458,20.3
Query_60575,CP002684.1,100.000,10,0,0,7,16,24850857,24850848,458,20.3
Query_60575,CP002684.1,100.000,10,0,0,1,10,24957460,24957451,458,20.3
Query_60575,CP002684.1,100.000,10,0,0,10,19,25000094,25000103,458,20.3
Query_60575,CP002684.1,100.000,10,0,0,10,19,25231978,25231969,458,20.3
Query_60575,CP002684.1,100.000,10,0,0,11,20,25463267,25463276,458,20.3
Query_60575,CP002684.1,100.000,10,0,0,11,20,25480557,25480566,458,20.3
Query_60575,CP002684.1,100.000,10,0,0,9,18,25646414,25646405,458,20.3
Query_60575,CP002684.1,100.000,10,0,0,2,11,25707702,25707711,458,20.3
Query_60575,CP002684.1,100.000,10,0,0,7,16,25824378,25824369,458,20.3
Query_60575,CP002684.1,100.000,10,0,0,11,20,25862663,25862672,458,20.3
Query_60575,CP002684.1,100.000,10,0,0,11,20,25920193,25920202,458,20.3
Query_60575,CP002684.1,100.000,10,0,0,9,18,26217035,26217044,458,20.3
Query_60575,CP002684.1,100.000,10,0,0,2,11,26227299,26227308,458,20.3
Query_60575,CP002684.1,100.000,10,0,0,6,15,26230791,26230782,458,20.3
Query_60575,CP002684.1,100.000,10,0,0,1,10,26350745,26350754,458,20.3
Query_60575,CP002684.1,100.000,10,0,0,10,19,26357479,26357488,458,20.3
Query_60575,CP002684.1,92.857,14,1,0,6,19,26376999,26376986,458,20.3
Query_60575,CP002684.1,100.000,10,0,0,10,19,26525848,26525857,458,20.3
Query_60575,CP002684.1,100.000,10,0,0,5,14,26587162,26587171,458,20.3
Query_60575,CP002684.1,100.000,10,0,0,10,19,26727977,26727986,458,20.3
Query_60575,CP002684.1,100.000,10,0,0,5,14,26765410,26765419,458,20.3
Query_60575,CP002684.1,100.000,10,0,0,10,19,26833578,26833587,458,20.3
Query_60575,CP002684.1,100.000,10,0,0,11,20,26852730,26852739,458,20.3
Query_60575,CP002684.1,100.000,10,0,0,3,12,27046419,27046428,458,20.3
Query_60575,CP002684.1,100.000,10,0,0,7,16,27058830,27058821,458,20.3
Query_60575,CP002684.1,100.000,10,0,0,11,20,27164874,27164865,458,20.3
Query_60575,CP002684.1,100.000,10,0,0,6,15,27313851,27313860,458,20.3
Query_60575,CP002684.1,100.000,10,0,0,3,12,27320956,27320947,458,20.3
Query_60575,CP002684.1,100.000,10,0,0,6,15,27540014,27540023,458,20.3
Query_60575,CP002684.1,100.000,10,0,0,11,20,27556623,27556632,458,20.3
Query_60575,CP002684.1,100.000,10,0,0,11,20,27572807,27572798,458,20.3
Query_60575,CP002684.1,100.000,10,0,0,10,19,27781852,27781861,458,20.3
Query_60575,CP002684.1,100.000,10,0,0,1,10,28363652,28363643,458,20.3
Query_60575,CP002684.1,100.000,10,0,0,1,10,28603796,28603805,458,20.3
Query_60575,CP002684.1,100.000,10,0,0,1,10,28669312,28669321,458,20.3
Query_60575,CP002684.1,100.000,10,0,0,5,14,28711703,28711694,458,20.3
Query_60575,CP002684.1,100.000,10,0,0,1,10,29130747,29130756,458,20.3
Query_60575,CP002684.1,100.000,10,0,0,2,11,29329411,29329420,458,20.3
Query_60575,CP002684.1,100.000,10,0,0,6,15,29517773,29517764,458,20.3
Query_60575,CP002684.1,100.000,10,0,0,2,11,29660071,29660080,458,20.3
Query_60575,CP002684.1,100.000,10,0,0,1,10,29914957,29914966,458,20.3
Query_60575,BK010421.1,100.000,11,0,0,8,18,271408,271398,116,22.3
Query_60575,BK010421.1,100.000,10,0,0,10,19,219562,219571,458,20.3


