,genome,start,sequence,confidence
33,4,9302208,GCGTCGGCAA,0.9048480535426934
34,4,13083353,GCGTCGGCAA,0.9048480535426934
67,4,972271,TCGTCGGCAA,0.7282684944441855
68,4,1930667,TCGTCGGCAA,0.7282684944441855
69,4,2008436,TCGTCGGCAA,0.7282684944441855
70,4,4223393,TCGTCGGCAA,0.7282684944441855
71,4,8978114,TCGTCGGCAA,0.7282684944441855
72,4,9280204,TCGTCGGCAA,0.7282684944441855
73,4,10174819,TCGTCGGCAA,0.7282684944441855
74,4,10649588,TCGTCGGCAA,0.7282684944441855
75,4,11336383,TCGTCGGCAA,0.7282684944441855
76,4,11713405,TCGTCGGCAA,0.7282684944441855
77,4,11930123,TCGTCGGCAA,0.7282684944441855
78,4,12466415,TCGTCGGCAA,0.7282684944441855
79,4,16628911,TCGTCGGCAA,0.7282684944441855
80,4,17287253,TCGTCGGCAA,0.7282684944441855
138,4,3872239,ATGTCGGCAA,0.0
139,4,3993209,ATGTCGGCAA,0.0
140,4,4337466,ATGTCGGCAA,0.0
141,4,5184205,ATGTCGGCAA,0.0
142,4,7012933,ATGTCGGCAA,0.0
143,4,7874322,ATGTCGGCAA,0.0
144,4,15581713,ATGTCGGCAA,0.0
145,4,15647384,ATGTCGGCAA,0.0
146,4,15649492,ATGTCGGCAA,0.0
147,4,17908004,ATGTCGGCAA,0.0
180,4,2778448,CTGTCGGCAA,0.8156898920545723
181,4,3811283,CTGTCGGCAA,0.8156898920545723
182,4,16256332,CTGTCGGCAA,0.8156898920545723
