,min_Stagger,max_Stagger,min_Opening,max_Opening,min_Buckle,max_Buckle,min_MGW,max_MGW,min_EP,max_EP,min_Shear,max_Shear,min_Stretch,max_Stretch,min_ProT,max_ProT,min_Roll1,max_Roll1,min_Roll2,max_Roll2,min_HelT1,max_HelT1,min_HelT2,max_HelT2,min_Tilt1,max_Tilt1,min_Tilt2,max_Tilt2,min_Rise1,max_Rise1,min_Rise2,max_Rise2,min_Shift1,max_Shift1,min_Shift2,max_Shift2,min_Slide1,max_Slide1,min_Slide2,max_Slide2
0,-1e-07,1.00000001,-1e-07,1.00000001,-1e-07,1.00000001,-1e-07,1.00000001,-1e-07,0.9988700100000001,-1e-07,1.00000001,-1e-07,1.00000001,-1e-07,1.00000001,-1e-07,1.00000001,-1e-07,1.00000001,-1e-07,1.00000001,-1e-07,1.00000001,-1e-07,1.00000001,-1e-07,1.00000001,0.014489900000000002,1.00000001,-1e-07,1.00000001,-1e-07,1.00000001,-1e-07,1.00000001,-1e-07,1.00000001,0.010199900000000001,1.00000001
1,-1e-07,1.00000001,-1e-07,1.00000001,-1e-07,1.00000001,-1e-07,1.00000001,-1e-07,1.00000001,-1e-07,1.00000001,-1e-07,1.00000001,-1e-07,1.00000001,-1e-07,1.00000001,-1e-07,1.00000001,-1e-07,1.00000001,-1e-07,1.00000001,-1e-07,1.00000001,-1e-07,1.00000001,0.014489900000000002,1.00000001,-1e-07,1.00000001,-1e-07,1.00000001,-1e-07,1.00000001,0.010199900000000001,1.00000001,0.0204099,1.00000001
2,-1e-07,1.00000001,-1e-07,1.00000001,-1e-07,1.00000001,-1e-07,1.00000001,-1e-07,0.9988700100000001,-1e-07,1.00000001,-1e-07,1.00000001,-1e-07,1.00000001,-1e-07,1.00000001,-1e-07,1.00000001,-1e-07,1.00000001,0.0070298999999999995,1.00000001,-1e-07,1.00000001,-1e-07,1.00000001,-1e-07,1.00000001,-1e-07,0.92754001,-1e-07,1.00000001,-1e-07,1.00000001,0.010199900000000001,1.00000001,-1e-07,1.00000001
3,-1e-07,1.00000001,-1e-07,1.00000001,-1e-07,1.00000001,-1e-07,1.00000001,-1e-07,1.00000001,-1e-07,1.00000001,-1e-07,1.00000001,-1e-07,1.00000001,-1e-07,1.00000001,-1e-07,1.00000001,-1e-07,1.00000001,-1e-07,1.00000001,-1e-07,1.00000001,-1e-07,1.00000001,-1e-07,1.00000001,-1e-07,1.00000001,-1e-07,1.00000001,-1e-07,0.97143001,-1e-07,1.00000001,0.010199900000000001,1.00000001
4,-1e-07,1.00000001,-1e-07,1.00000001,-1e-07,1.00000001,-1e-07,1.00000001,-1e-07,0.99209001,-1e-07,1.00000001,-1e-07,1.00000001,-1e-07,0.99333001,-1e-07,1.00000001,-1e-07,1.00000001,-1e-07,1.00000001,-1e-07,1.00000001,-1e-07,1.00000001,0.2394499,1.00000001,0.014489900000000002,1.00000001,0.014489900000000002,1.00000001,-1e-07,1.00000001,-1e-07,1.00000001,-1e-07,1.00000001,-1e-07,1.00000001
5,-1e-07,0.9838700100000001,0.27672990000000003,1.00000001,0.08792989999999999,1.00000001,0.24775989999999998,0.97313001,0.3615799,0.9988700100000001,-1e-07,0.96774001,-1e-07,1.00000001,0.11103990000000001,1.00000001,0.1504899,0.9581600100000001,0.09122989999999999,0.9459600100000001,-1e-07,0.91983001,-1e-07,0.87764001,-1e-07,1.00000001,0.2668199,0.9464100100000001,-1e-07,0.92754001,0.014489900000000002,0.7826100100000001,0.07618989999999999,0.9523800099999999,0.1333299,0.97143001,0.030609900000000002,0.93878001,0.010199900000000001,0.95918001
6,0.14515989999999998,0.91935001,0.42137990000000003,0.9853200100000001,0.2649899,0.87115001,0.1492499,0.8597000100000001,0.1977399,1.00000001,0.016129900000000003,0.96774001,-1e-07,0.7777800100000001,0.2718399,0.9484200100000001,0.1284099,0.95584001,0.22021989999999997,0.8657800099999999,0.0562599,0.85513001,0.0731399,0.7299600100000001,0.0695599,0.6773100100000001,0.3021699,0.8700100100000001,0.08695989999999999,0.72464001,0.3333299,1.00000001,0.14285989999999998,0.98095001,0.4095199,0.96190001,-1e-07,0.93878001,0.0204099,0.80612001
7,0.5645199000000001,0.88710001,0.8448599000000001,0.9287200100000002,0.2593199,0.5072900100000001,0.26566989999999996,0.81194001,0.7954799,0.9423700100000001,0.016129900000000003,0.09677001,0.11110989999999998,0.33333001,0.5212399,0.81311001,0.26495989999999997,0.8628700100000001,0.20510989999999998,0.38466001,0.0731399,0.63010001,0.39661989999999997,0.6329100100000001,0.0786799,0.60661001,0.6533599000000001,0.8700100100000001,0.3623199,0.7971000100000001,0.3912999,0.6521700100000001,0.4857099,1.00000001,0.1999999,0.28571000999999996,0.010199900000000001,0.7755100100000001,0.22448990000000002,0.47959000999999996
8,0.6612899,0.7580600100000001,0.6163499,0.75262001,0.3204999,0.34927000999999996,0.5193999,0.72537001,0.6361599000000001,0.72768001,0.3064499,0.32258001000000003,0.22221989999999997,0.33333001,0.4866499,0.51092001,0.2388099,0.35909001,0.3637399,0.41255000999999997,0.4627299,0.60900001,0.6244699,0.67370001,0.41960990000000004,0.58609001,0.5735499000000001,0.64994001,0.4057999,0.62319001,0.1884099,0.26087001,0.24761989999999998,0.26667000999999996,0.5523799,0.6857100100000001,0.2346899,0.46939000999999997,0.5510199,0.6530600100000001
9,0.5967699000000001,0.5967700100000001,0.8511499,0.85115001,0.5887399,0.58874001,0.8029899,0.80299001,0.9581899,0.95819001,0.9354799,0.93548001,0.11110989999999998,0.11111000999999998,0.5928399,0.59284001,0.4096499,0.40965001,0.6961099000000001,0.6961100100000001,0.6300999,0.63010001,0.26300989999999996,0.26301000999999996,0.3990899,0.39909001,0.5313599000000001,0.5313600100000001,0.1884099,0.18841001,0.4492799,0.44928001,0.7142899,0.71429001,0.5999999,0.60000001,0.6224499,0.62245001,0.40815989999999996,0.40816000999999996
10,0.7419399,0.74194001,0.8364798999999999,0.8469600100000001,0.46190990000000004,0.48501001000000005,0.6477599,0.77015001,0.9446299,0.9604500100000001,0.0967699,0.09677001,0.11110989999999998,0.11111000999999998,0.7414999000000001,0.7955100100000001,0.6926199000000001,0.7251600100000001,0.44043989999999994,0.44335001,0.21518990000000002,0.23910001,0.2826999,0.45570001,0.27821989999999996,0.28962001,0.6590599000000001,0.72862001,0.4782599,0.55072001,0.4057999,0.5797100100000001,0.5714299,0.60952001,0.5618999,0.60000001,0.3163299,0.34694001,0.1734699,0.18367001
11,0.6128999,0.80645001,0.8280899,0.89099001,0.2653999,0.5312000100000001,0.4507499,0.69254001,0.8847499000000001,0.9649700100000002,0.04838989999999999,0.06452001,0.11110989999999998,0.22222000999999997,0.5181999,0.8367700100000002,0.41428989999999993,0.48170001,0.3160999,0.41778001000000003,0.32207990000000003,0.49789000999999994,0.4374099,0.8846700100000001,0.3842599,0.49487000999999997,0.5131099000000001,0.74230001,0.4057999,0.6376800100000001,0.4057999,0.59420001,0.5714299,0.62857001,0.1142899,0.50476001,0.1632699,0.25510001,0.29591989999999996,0.45918001
12,0.5483899,0.9516100100000001,0.5429799000000001,0.8742100100000001,0.0117499,0.5429500100000001,0.3611899,0.89254001,0.5050799,0.96384001,0.2419399,0.9838700100000001,0.11110989999999998,0.5555600100000001,0.2487899,0.9696600100000001,0.22776989999999997,0.42010000999999997,0.2754199,0.81116001,0.4191299,0.9564000100000001,0.0309399,0.75949001,0.24970989999999998,1.00000001,0.4036499,0.9464100100000001,0.4057999,0.8695700100000001,0.043479899999999995,0.59420001,0.057139899999999993,0.59048001,0.0380999,0.7809500100000001,0.22448990000000002,0.81633001,0.05101989999999999,0.83673001
13,-1e-07,0.9516100100000001,0.3542999,0.96226001,0.1324999,0.73622001,0.3522399,1.00000001,0.5220299,0.9988700100000001,0.04838989999999999,1.00000001,-1e-07,1.00000001,0.12378990000000001,0.95934001,0.2190599,0.8739100100000001,0.1946499,0.93550001,-1e-07,0.84529001,0.0070298999999999995,0.8706000100000001,0.1607799,0.71722001,0.2668199,0.91334001,0.014489900000000002,0.7391300100000001,0.043479899999999995,0.69565001,-1e-07,0.83810001,0.0380999,0.9333300099999999,0.07142989999999999,0.8979600100000001,0.05101989999999999,0.97959001
14,-1e-07,1.00000001,-1e-07,1.00000001,-1e-07,0.91329001,0.1582099,1.00000001,0.3615799,1.00000001,0.0322599,1.00000001,-1e-07,1.00000001,-1e-07,1.00000001,0.09122989999999999,1.00000001,0.1446799,0.98141001,-1e-07,0.9943700100000001,-1e-07,0.9564000100000001,-1e-07,0.7331800100000001,-1e-07,1.00000001,-1e-07,0.7826100100000001,-1e-07,0.8695700100000001,0.0285699,1.00000001,0.009519900000000001,1.00000001,0.010199900000000001,0.97959001,0.030609900000000002,1.00000001
15,-1e-07,1.00000001,-1e-07,1.00000001,-1e-07,0.98825001,-1e-07,1.00000001,-1e-07,1.00000001,-1e-07,1.00000001,-1e-07,1.00000001,-1e-07,1.00000001,-1e-07,1.00000001,-1e-07,1.00000001,-1e-07,1.00000001,-1e-07,1.00000001,-1e-07,1.00000001,-1e-07,1.00000001,-1e-07,0.92754001,-1e-07,1.00000001,0.0285699,1.00000001,-1e-07,1.00000001,-1e-07,1.00000001,0.010199900000000001,1.00000001
16,-1e-07,1.00000001,-1e-07,1.00000001,-1e-07,0.98825001,-1e-07,1.00000001,-1e-07,1.00000001,-1e-07,1.00000001,-1e-07,1.00000001,-1e-07,1.00000001,-1e-07,1.00000001,-1e-07,1.00000001,-1e-07,1.00000001,-1e-07,1.00000001,-1e-07,1.00000001,-1e-07,1.00000001,0.014489900000000002,1.00000001,0.014489900000000002,1.00000001,-1e-07,1.00000001,-1e-07,1.00000001,-1e-07,1.00000001,0.010199900000000001,1.00000001
