{
  "hash": "154cbbd55fd77efdb224109d1f550b2a",
  "result": {
    "engine": "knitr",
    "markdown": "---\ntitle: Assessment of graph literacy among German medical students -- a cross-sectional study to assess graph interpretation skills\nsubtitle: Draft of the manuscript\ntitle-block-banner: true # \"#145F7D\" als Fakultäts-Farbe\n# title-block-banner-color: \"#F0F0F0\" als weisse Schrift\ntheme:\n  light: flatly\n  dark: darkly\nmetadata-files: \n  - _authordata.yml # vor der finalen Online-Veröffentlichung noch hierhin kopieren\n  - text/_plain-language-summary.md # die Gedankenstruktur des Manuskripts: siehe NOTIZ\nfilters:\n  - authors-block # um den Autoren-Block auch im Word-Dokument zu haben\n  - abstract-section # um den Abstract im normalen Text und nicht im YAML-Header zu schreiben\n  - color-text.lua # Schriftfarben\n  - webr # interaktiver R-Code\nengine: knitr\nwebr: \n  show-startup-message: true\n  packages: ['ggplot2']\nkeywords: \n  - Undergraduate Medical Education\n  - Health Literacy\ndescription: |\n  Eine allgemeine Beschreibung des Projekts, das hinter dem Manuskript steht.\nkey-points:\n  - Medizinische Ausbildung ist ein Querschnittsfach aus den Bereichen Medizin, Pädagogik und Psychologie.\n  - Medical education is a multidisciplinary field of medicine, education, and psychology.\ndate: last-modified\nciteproc: true\nbibliography: text/references.bib\nzotero: \"graph-literacy-progress\"\ncsl: bmc-medicine.csl # https://www.zotero.org/styles/bmc-medicine\ncitation-location: margin\nnumber-sections: false\nappendix-style: default\nlightbox: auto\nfunding: \n  statement: \"Der/die Autor*innen erhielt(en) für diese Arbeit keine spezielle Finanzierung.\"\nlang: en\neditor:\n  markdown:\n    canonical: true\n---\n\n\n\n\n\n\n## Abstract\n\n\n\n**Background**: Health literacy depends on diverse aspects of skills in processing information. To adequately understand medical reports, treatments and study results a set of abilities is needed, including understanding graphs properly. Especially for those advising and informing people with less health and graph literacy, it is important to achieve high competence in graph literacy themselves.  When providing information to patients graph literacy is a form of semiotic activity that is a crucial component of overall literacy for (future) medical doctors. \n\n**Methods**: A cross-sectional study was performed with medical students in their academic years 1, 2, 3, 4 and 5 at the medical school of the University of Muenster, Germany. We did measure outcome using the “Graph Literacy Scale” (Galesic and Garcia-Retamero, 2011). This test measures the graph literacy, meaning to read and interpret graphical provided information.\n\n**Results**: The first major finding of our study is that medical students showed above average test results in the “Graph Literacy Scale” in terms of their graph literacy compared to a German standard population. Although the students had an excellent overall performance, there was one question (question 11) achieving poor results with an better performance in higher academic years but still a ceiling effect on a low level with a maximum of 57,6% correct answers. \n\n**Conclusion**: Although abilities in reading the data and between the data are high in our cohorts, abilities to read beyond the data are inconsistent. This leads to implications for training of medical students and need of further research in this domain.\n\n\n\n------------------------------------------------------------------------\n\n::: {.callout-caution title=\"IN PROGRESS ...\"}\nThis manuscript is a work in progress. However, thank you for your interest. Please feel free to visit this web site again at a later date.\n\n[*Dieses Manuskript ist noch in Arbeit. Wir danken Ihnen jedoch für Ihr Interesse. Bitte besuchen Sie diese Website zu einem späteren Zeitpunkt noch einmal ...*]{color=\"gray\"}\n:::\n\n::: {.callout-tip title=\"STRUKTUR DES MANUSKRIPTS\" collapse=\"true\"}\n[{{< meta plain-language-summary >}}]{color=\"gray\"}\n:::\n\n\n## Background\n\n### Broad problem\n\nHealth literacy depends on diverse aspects of skills in processing information. To adequately understand medical reports, treatments and study results a set of abilities is needed. Thinking of future physicians one can imagine a multitude of situations where a high health literacy is required: whenever talking with patients about medical data, consenting in treatments and educating patients about diseases, making clinical decisions depending on laboratory results, imaging and study results, understanding evidence, interpreting of epidemiological data and communicating in medical teams.\n\n### Theoretical and/or empirical focus of the problem\n\nOne important aspect of health literacy is graph literacy, meaning the reading, interpreting and understanding of graphs. This process is depending on decoding and interpreting signs and symbols and is known as semiotic activity. When informations are provided graphically the underlying assumption, this could reduce the cognitive work load and would be easier to understand, seems obvious. Thus, the ability to understand graphs should not be considered isolated from other forms of literacy. It is an integral part of the ability to process and communicate information effectively in a world that is increasingly dependent on data and its visual representation.\n\nProcessing those visual representations is essential for understanding scientific and statistical data [@friel2001making] and particularly relevant in areas such as medical research where graphs and data visualizations are frequently used to convey complex information. A personal understanding of the representations is essential when preparing data for communication in order to ensure adequate knowledge transfer to others [@cooper2002graphical]. But misleading representations (either through deliberate manipulation or unintentionally through errors or incompleteness) can also have a significant influence on the reception of information by the recipient [@melnik2023my].\n\nIn summary it ca be said that graph literacy, as a form of semiotic activity, is a crucial component of overall literacy [@roth2002reading]. It can have an impact on risk comprehension [@okan2019using], suggesting that a higher graph literacy may be associated with a better decision-making performance. However, studies of graph literacy mainly refer to patients [@durand2020graph] or the ability of doctors [@caverly2015doctors] to interpret graphical representations. Data regarding medical students ability of graph literacy and investigations on how to increase these are lacking. \n\n### Focused problem statement\n\nEspecially for those advising and informing people with less health and graph literacy, it is important to achieve high competence in graph literacy themselves. But lack of understanding of visual representations can significantly impact decision making for patients and for (future) medical doctors.\n\nWhen providing information to patients, medical doctors must be aware about patient health literacy and about their own. Therefore, we conducted a cohort study with medical students for understanding their ability to interpret medical information provided visually.\n\n### Statement of study intent\n\nWe performed a study of medical students to investigate the following questions:\n\n1.  How high is the graph literacy among medical students?\n2.  Does the graph literacy of medical students change during their respective academic progress (measured in years)?\n3.  Are there any sub-areas of medical students' graph literacy that require special attention?\n\n## Methods\n\n### Setting and subjects\n\nOur cross-sectional study was performed with medical students in their academic years 1, 2, 3, 4 and 5 at the medical school of the University of Muenster, Germany. It takes six years to complete a course in medical school in Germany, with students enrolled directly from secondary schools. The course of study is divided into a pre-clinical section (the first two years) and a clinical section (the last four years). To improve students' clinical experience, they are rotated in various hospital departments during their final year (\"clinical/practical\" year).\n\n### Study design\n\nGraph literacy can be measured with the so-called 'graph literacy scale' introduced by Galesic et al. in 2011 [@galesic2011]. The students were asked to participate in the study and answer the questions of the \"Graph Literacy Scale\" (Galesic and Garcia-Retamero, 2011) with pen and paper. The validated questionnaire was handed out during April 2017 to June 2017. Completion of the questionnaire was voluntary, anonymously and performed in the context of the progress test. A mandatory examination, taking place annually at the medical faculty. No calculators were allowed. We did not ask participants about their social, biographical or educational background, but a post-secondary school diploma (abitur) is necessary for entering medical school and a statistical curriculum is part of the school education in the German upper school.\n\n### Ethical approval\n\nApproval was obtained from the local Ethics Committee University Muenster, Germany.\n\n### Data collection\n\nData collection for this study was determined à priori as follows: students of each study year of the medical University Muenster are asked to voluntarily participate and answer questions of the \"Graph Literacy Scale\". The study takes place during the annual progress test, a obligatory test students of all study years have to take. \n\n### Outcome Measures\n\nWe did measure outcome using the “Graph Literacy Scale” (Galesic and Garcia-Retamero, 2011). This test measures the graph literacy, meaning to read and interpret graphical provided information. The students had to answer 9 open and 4 multiple choice questions. Each of the questions represents one of the 3 levels of graph comprehension: reading the data, reading between the data, reading beyond the data (Galesic and Garcia-Retamero, 2011). Except for question 7 there is only one correct answer to every question. Question 7 does accept a range (\\>23 to \\>25) of correct answers. Participants received one point for every correct solution, meaning they could achieve 0 to 13 points in total. Only the correct answer was taken into account and only the defined exact numbers were considered correct in open questions. There was no error margin, questionnaires including blank responses were not considered for our analysis. The average score (standard\ndeviation) in this test format according to Galesic and Garcia-Retamero (2011) is 9.4 (standard deviation 2.6) for Germany. \n\n### Statistical methods\n\nAll data were entered and alyzed using the statistial software R Studio 2023.12.1. Descriptive means and standard deviations were calculated for participants' age and mean test scores were computed for all participants' and for each study year seperately. \n\n```{webr-r}\n#| context: interactive\n\n# Download a dataset\ndownload.file(\n  'https://raw.githubusercontent.com/coatless/raw-data/main/penguins.csv',\n  'penguins.csv'\n) # Download the dataset\n\n# Read the data\npenguins = read.csv(\"penguins.csv\")\n\n# Scatterplot example: penguin bill length versus bill depth\nggplot2::ggplot(data = penguins, ggplot2::aes(x = bill_length_mm, y = bill_depth_mm)) + # Build a scatterplot\n  ggplot2::geom_point(ggplot2::aes(color = species, \n                 shape = species),\n             size = 2)  +\n  ggplot2::scale_color_manual(values = c(\"darkorange\",\"darkorchid\",\"cyan4\"))\n```\n\n\n## Results\n\n### Recruitment Process and Demographic Characteristics\n\nWe obtained 449 complete questionnaires, which could be included in our analysis. Out of a total of 500 questionnaires 31 surveys were actively canceled by the respondents and therefore not considered. Out of those 469 left over, 20 were lacking answers regarding individual responses and therefor haven’t been included. 2 questionnaires were lacking information about the sex of the respondents, 1 was lacking information regarding age, those 3 weren’t excluded. Out of our 449 included questionnaires 126 students were in their first academic year, 128 students in their second academic year, 54 students in their third year, 59 students in their fourth year and 82 students in their fifth year. 151 students stated their sex was male, 296 stated their sex was female, 2 didn't give informations regarding sex.\n\n### Primary and secondary Outcomes\n\nAfter the evaluation of all datasets, three major findings were obtained. The first finding is that participants achieved an average score of 11.42 (s = 1.42) points, which is significantly higher than the average score of Galesic (2011) with 9.4 (s = 2.6) points. The second major finding is, although there is a slight increase in the scores between the first (11.33 points [s = 1.40]) to the fifth academic year (11.65 [s = 1.18]), no significant difference could be detected (p = xx). Finally, although the students had an excellent overall performance, there was one question (question 11, testing abilities to read beyond the data) achieving poor results with an increase of correct answers in the older cohorts, but still a ceiling effect on a low level with a maximum of 57,6% correct answers. \n\n## Discussion\n\nThe first major finding of our study is that medical students showed above average test results in the “Graph Literacy Scale” in terms of their graph literacy compared to a German standard population. Although abilities in reading the data and between the data are high in our cohorts, abilities to read beyond the data are inconsistent. Fluctuation range in the area of reading beyond the data is extremely high between individual questions. A finding also seen in the validation study (Galesic, 2011). Although our medical students perform better than the reference group, the overall result for question 11 is poor with 38.1%-57.3% (mean 48,3%) correct answers. Although there is an improvement in the ability to answer the question across the different cohorts with each year of study, there is a certain ceiling effect. Question 11 requires the comparison between 2 line charts. The participants are asked to decide based on those line charts which treatment contributes to a larger decrease of sick patients. The y-axes in those charts state \"% sick patients\" and does not give informations regarding the scale. The correct answer would be \"can't say\" based on the charts. @Garcia2011\n\nScoring high in other aspects of reading beyond the data, a possible explanation for poor performance of our medical students could be a base rate neglect manifesting with poor results when answering question 11. Whenever the correct answer is “can’t say” also a lacking tolerance of ambiguity could be an explanation for a poor performance. Considering the role of physicians giving answers and guiding therapy, admitting one can’t give an answer, might be especially complex. Low aversion to ambiguity is a known risk factor for suboptimal decision-making in clinical practice, as for example is shown by @Saposnik2011 for treatment in patients with Spinal Muscular Atrophy (SMA). If the assumption that a lack of ambiguity tolerance contributes to the response behavior is correct, this has far-reaching consequences for the need for training of the low graph literacy shown in our medical students cohort.\n\nThere are some limitations to our study, that need to be acknowledged. First, we performed a cross-sectional study, that was carried out on a specific point in time and in the setting of an mandatory test, every medical student has to take. This might have caused students to care less for correct answers or having a lower attention span because they already had to spend severe effort to perform well in their test. We can't say, if participants might have performed much better at a different time or at a later stage of their training, for example as residents in clinical practice. There might be an training effect for graph literacy, that only evoles over time needing to read and explain data regularly to patients or colleagues. Further we didn't ask participants to give specific informations regarding their statistical training in school or during their medical studies. We also can't say why the performance regarding graph literacy was especially inconsistent in \"reading beyond the data\". This question does need further research attention.\nNonetheless, a cross-sectional study design remains an efficient way to evaluate the prevalence of certain skills in a large sample of students. A true statement about how the graph literacy changes can not be given, because we did a single time measurement. But we can say, that in comparisson those students of higher academic experience do perform better when measuring their graph literacy.\n\n### Integration with prior work\n\nOnly a few studies provide insights into the graphical and numerical skills among medical students.\n\nIn a cross-sectional, descriptive study, the researchers applied the Objective Numeracy, Subjective Numeracy, and Graph Literacy Scales to medical students in their final two years of medical school and to medical residents. The study included 169 participants, comprising 70% sixth-year seventh-year students, and 30% residents. The findings showed that the mean graph literacy was 10.35. A multiple linear regression analysis revealed that higher scores in the Graph Literacy Scale were associated with the male gender and younger age. The study concluded that numeracy and graph literacy scales' mean scores were high among the medical students in this sample [@mas2018graphical]. This is consistent with our research findings, which also revealed high overall graph literacy skills for medical students. Due to the very good results of the students at the level of data reading skills, the authors of the study recommend a reduction of the graph literacy measurement for medical students to the aspects of reading between and beyond the data. Assuming this could lead to a more objective measurement of graphical skills in trained persons. However, since only a precise record of all aspects of the abilities and weaknesses of medical students provides a comprehensive picture, this abbreviation does not appear to be adequate for research purposes.\n\nLiterature regarding patients' and nurses' graphy literacy does provide further insight with respect to the different levels of graph literacy. For example Durand et al @Durand2020 examine the relationship between graph literacy, numeracy, health literacy, and sociodemographic characteristics in a Medicai-eligible population. They did not find a statistically significant association betwwen Graph literacy and higher education. But they found a positive relationship between graph literacy and numeracy, while numeracy was associated to education. @Gaissmaier2012 emphasizes the significance of graph literacy in understanding health-related statistical information and ability for informed medical decision making. They found a high graph literacy to be associated with a better comprehension and recall for graphics instead of numbers. This makes graph literacy tremendous important in patient-centered communication tools, as shown by @Nayak2016. @Dowding2018 do support this statement for visual displays for clinical dashboards used by nurses. \n\n@Gaissmeier2023 people fail to identify what they comprehend better but base their choice between representations on how attractive the representation is.\n\n@Tolbert2018 discusses the impact of different graphical representations on the accurate interpretation and clarity of patient-reported outcome scores in cancer patients/survivors.\n\n### Implications for practice\n\nDespite some improvement across different cohorts with each year of study, there seems to be a ceiling effect in abilities for reading beyond the data. This suggests that even with progression through medical education, there are limitations in the learning ability for this particular item. A possible base rate neglect and a lacking tolerance of ambiguity as explanations for poor performance, particularly when the correct answer is \"can't say,\" adds a psychological dimension to the interpretation of our results. The reluctance to admit uncertainty, especially in a medical context where physicians are expected to provide answers and guide therapy, could be contributing to this specific challenge.\nFor future training of medical students, addressing these challenges could involve interventions to improve tolerance for ambiguity and emphasize the importance of acknowledging uncertainty when necessary. Training programs might incorporate exercises that specifically target those skills. Additionally, providing awareness and education about base rate neglect could enhance decision-making in situations where uncertainty is inherent.\nFurther it can be deduced that special attention in graph literacy of medical students should also be paid to the ability to communicate visually presented results. This takes into account the doctor as a mediator between specialist knowledge and patient interests, as well as the possibly lower graph literacy skills of patients.\n\n### Implications for research\n\nOur findings suggest that while medical students generally exhibit above-average results in graph literacy, particularly in reading and interpreting data, there are challenges in their ability to go beyond the presented data. This fluctuations in performance does indicate a need for future research. Exploring the psychological factors influencing graph literacy in medical students, such as tolerance of ambiguity, could be valuable to gain a better understanding. Investigating interventions that could improve performance in reading beyond the data, especially in situations involving uncertainty, could contribute to the development of more effective educational strategies.\n\n### Conclusions\n\nIn summary, our findings suggest a nuanced understanding of the strengths and challenges in the graph literacy of medical students, with implications for both their training and need of further research in this domain.\n\n### Acknowledgements\nWe thank Mirta Galesic and Rocio Garcia-Retamero for providing their Graph Literacy scale (pen and paper format). This study had no external funding. \n\n\n\n\n## References {.unnumbered}\n\n::: {#refs}\n:::\n\n## Declarations {.appendix}\n\n\n\n### Ethics approval and consent to participate\n\nApproval was obtained from the local Ethics Committee University Muenster, Germany. A validated questionnaire for \"Graph Literacy\" was handed out to medical students during April 2017 to June 2017. Completion of the questionnaire was voluntary.\n\n### Consent for publication\n\nNot applicable\n\n### Availability of data and materials\n\nThe original data that support the findings of this study are available from Open Science Framework (osf.io, see manuscript-URL).\n\n### Competing interests\n\nThe authors declare that they have no competing interests.\n\n### Funding\n\nThe author(s) received no specific funding for this work.\n\n### Authors' contributions\nWe thank Mirta Galesic and Rocio Garcia-Retamero for providing their Graph Literacy scale (pen and paper format). \n\n### CRediT authorship contribution statement\n\n**Janina Soler Wenglein:** Data curation, Formal analysis, Investigation, Methodology, Visualization, Writing - original draft.  \n**Hendrik Friederichs:** Conceptualization, Formal analysis, Investigation, Methodology, Supervision, Writing - review & editing, Writing - original draft.\n\n### Acknowledgments\n\nThe authors are grateful for the insightful comments offered by the anonymous peer reviewers at {{< meta citation.container-title >}}. The generosity and expertise of one and all have improved this study in innumerable ways and saved us from many errors; those that inevitably remain are entirely our own responsibility.\n\n",
    "supporting": [],
    "filters": [
      "rmarkdown/pagebreak.lua"
    ],
    "includes": {},
    "engineDependencies": {},
    "preserve": {},
    "postProcess": true
  }
}