 ,Answer,Title,Concepts
3,d,Frage 1,Diagnose
4,b,Frage 2,Therapie
5,a,Frage 3,Diagnose
6,c,Frage 4,Diagnose
7,e,Frage 5,Diagnose
8,b,Frage 6,Therapie
9,c,Frage 7,Therapie
10,a,Frage 8,Therapie
11,c,Frage 9,Therapie
12,c,Frage 10,Therapie
13,b,Frage 11,Therapie
14,e,Frage 12,Diagnose
15,d,Frage 13,Diagnose
16,e,Frage 14,Diagnose
17,b,Frage 15,Diagnose
18,e,Frage 16,Diagnose
19,e,Frage 17,Diagnose
20,c,Frage 18,Therapie
21,c,Frage 19,Therapie
22,b,Frage 20,Therapie
23,c,Frage 21,Kommunikation
24,c,Frage 22,Data Literacy
25,b,Frage 23,Data Literacy
26,c,Frage 24,Data Literacy
27,d,Frage 25,Data Literacy
28,b,Frage 26,Data Literacy
29,e,Frage 27,Kommunikation
30,a,Frage 28,Diagnose
31,d,Frage 29,Diagnose
32,d,Frage 30,Therapie
33,d,Frage 31,Diagnose
34,e,Frage 32,Diagnose
35,a,Frage 33,Kommunikation
36,d,Frage 34,Data Literacy
37,a,Frage 35,Data Literacy
38,b,Frage 36,Data Literacy
39,a,Frage 37,Data Literacy
40,a,Frage 38,Data Literacy
41,e,Frage 39,Kommunikation
42,c,Frage 40,Diagnose
43,a,Frage 41,Diagnose
44,e,Frage 42,Diagnose
45,a,Frage 43,Therapie
46,b,Frage 44,Kommunikation
47,b,Frage 45,Data Literacy
48,d,Frage 46,Data Literacy
49,a,Frage 47,Data Literacy
50,a,Frage 48,Data Literacy
51,a,Frage 49,Data Literacy
52,d,Frage 50,Kommunikation
