\relax 
\providecommand*\new@tpo@label[2]{}
\providecommand\babel@aux[2]{}
\@nameuse{bbl@beforestart}
\providecommand\hyper@newdestlabel[2]{}
\providecommand\HyperFirstAtBeginDocument{\AtBeginDocument}
\HyperFirstAtBeginDocument{\ifx\hyper@anchor\@undefined
\global\let\oldnewlabel\newlabel
\gdef\newlabel#1#2{\newlabelxx{#1}#2}
\gdef\newlabelxx#1#2#3#4#5#6{\oldnewlabel{#1}{{#2}{#3}}}
\AtEndDocument{\ifx\hyper@anchor\@undefined
\let\newlabel\oldnewlabel
\fi}
\fi}
\global\let\hyper@last\relax 
\gdef\HyperFirstAtBeginDocument#1{#1}
\providecommand*\HyPL@Entry[1]{}
\HyPL@Entry{0<</S/D>>}
\babel@aux{ngerman}{}
\@writefile{toc}{\contentsline {section}{\nonumberline Zusammenfassung}{1}{section*.3}\protected@file@percent }
\newlabel{zusammenfassung}{{}{1}{Zusammenfassung}{section*.3}{}}
\@writefile{toc}{\contentsline {section}{\nonumberline Hintergrund}{1}{section*.5}\protected@file@percent }
\newlabel{hintergrund}{{}{1}{Hintergrund}{section*.5}{}}
\@writefile{toc}{\contentsline {subsection}{\nonumberline Neugründung Medizinische Fakultät OWL}{1}{subsection*.7}\protected@file@percent }
\newlabel{neugruxfcndung-medizinische-fakultuxe4t-owl}{{}{1}{Neugründung Medizinische Fakultät OWL}{subsection*.7}{}}
\@writefile{toc}{\contentsline {subsubsection}{\nonumberline Lehre im Medizinstudium}{2}{subsubsection*.9}\protected@file@percent }
\newlabel{lehre-im-medizinstudium}{{}{2}{Lehre im Medizinstudium}{subsubsection*.9}{}}
\@writefile{toc}{\contentsline {paragraph}{\nonumberline Bedeutung Wissen für Medizinpersonal}{2}{paragraph*.11}\protected@file@percent }
\newlabel{bedeutung-wissen-fuxfcr-medizinpersonal}{{}{2}{Bedeutung Wissen für Medizinpersonal}{paragraph*.11}{}}
\@writefile{toc}{\contentsline {paragraph}{\nonumberline Aquisition von Wissen}{2}{paragraph*.13}\protected@file@percent }
\newlabel{aquisition-von-wissen}{{}{2}{Aquisition von Wissen}{paragraph*.13}{}}
\@writefile{toc}{\contentsline {paragraph}{\nonumberline Prüfung von medizinischem Wissen im Studium}{3}{paragraph*.15}\protected@file@percent }
\newlabel{pruxfcfung-von-medizinischem-wissen-im-studium}{{}{3}{Prüfung von medizinischem Wissen im Studium}{paragraph*.15}{}}
