{
  "hash": "5e3b491c62ab630aa1be379a8d50a06d",
  "result": {
    "engine": "knitr",
    "markdown": "---\ntitle: Titel des Manuskripts\nsubtitle: Untertitel des Manuskripts\ntitle-block-banner: true # \"#145F7D\" als Fakultäts-Farbe\n# title-block-banner-color: \"#F0F0F0\" als weisse Schrift\ntheme:\n  light: flatly\n  dark: darkly\nmetadata-files: \n  - _authordata.yml # vor der finalen Online-Veröffentlichung noch hierhin kopieren\n  - text/_plain-language-summary.md # die Gedankenstruktur des Manuskripts: siehe NOTIZ\nfilters:\n  - authors-block # um den Autoren-Block auch im Word-Dokument zu haben\n  - abstract-section # um den Abstract im normalen Text und nicht im YAML-Header zu schreiben\n  - color-text.lua # Schriftfarben\n  - webr # interaktiver R-Code\nengine: knitr\nwebr: \n  show-startup-message: true\n  packages: ['ggplot2']\nkeywords: \n  - Medical Education\n  - Artificial Intelligence\ndescription: |\n  Eine allgemeine Beschreibung des Projekts, das hinter dem Manuskript steht.\nkey-points:\n  - Medizinische Ausbildung ist ein Querschnittsfach aus den Bereichen Medizin, Pädagogik und Psychologie.\n  - Medical education is a multidisciplinary field of medicine, education, and psychology.\ndate: last-modified\nciteproc: true\nbibliography: text/references.bib\ncsl: bmc-medicine.csl # https://www.zotero.org/styles/bmc-medicine\ncitation-location: margin\nnumber-sections: false\nappendix-style: default\nlightbox: auto\nfunding: \n  statement: \"Der/die Autor*innen erhielt(en) für diese Arbeit keine spezielle Finanzierung.\"\nlang: de\neditor:\n  markdown:\n    canonical: true\n---\n\n\n\n\n\n\n\n\n\n\nThere are {{wordcount}} words in this document.\n\n## Abstract\n\n\n\n**Background / Hintergrund**: {{< lipsum 1 >}}\n\n**Methods / Methoden**: ...\n\n**Results / Ergebnisse**: ...\n\n**Conclusio / Schlussfolgerungen**: ...\n\n\n\n------------------------------------------------------------------------\n\n::: {.callout-caution title=\"IN PROGRESS ...\"}\nThis manuscript is a work in progress. However, thank you for your interest. Please feel free to visit this web site again at a later date.\n\n[*Dieses Manuskript ist noch in Arbeit. Wir danken Ihnen jedoch für Ihr Interesse. Bitte besuchen Sie diese Website zu einem späteren Zeitpunkt noch einmal ...*]{color=\"grey\"}\n:::\n\n::: {.callout-tip title=\"STRUKTUR DES MANUSKRIPTS\" collapse=\"true\"}\n[{{< meta plain-language-summary >}}]{color=\"grey\"}\n:::\n\n## Background / Hintergrund\n\n\n### Broad problem / Allgemeineres Problem\n\n...\n\n### Theoretical and/or empirical focus of the problem / Theoretische und/oder empirische Fokussierung des Problems\n\n...\n\n### Focused problem statement / Fokussiertes Problem-Statement: Gap und möglicher Fortschritt\n\n...\n\n### Statement of study intent / Fokussierte Forschungsfrage/n\n\nWe performed a study of medical students to investigate the following questions:\n\n1.  What is ...\n2.  Why are ...\n\nWir haben eine Studie mit Medizinstudierenden durchgeführt, um die folgenden Fragen zu untersuchen:\n\n1.  Was ist ...\n2.  Warum sind ...\n\n\n\n## Methods / Methoden\n\n\n### Setting and subjects / Setting und Probanden\n\nOur study was conducted at Medical School ...\n\nUnsere Studie wurde an der Medizinischen Fakultät der ... durchgeführt.\n\nIt takes six years to complete a course in medical school in Germany, with students enrolled directly from secondary schools. The course of study is divided into a pre-clinical section (the first two years) and a clinical section (the last four years). To improve students' clinical experience, they are rotated in various hospital departments during their final year (\"clinical/practical\" year). ...\n\nDas Medizinstudium in Deutschland dauert sechs Jahre, wobei die Studierenden direkt von den weiterführenden Schulen aufgenommen werden. Das Studium gliedert sich in einen vorklinischen Teil (die ersten beiden Jahre) und einen klinischen Teil (die letzten vier Jahre). Um die klinische Erfahrung der Studenten zu verbessern, werden sie während ihres letzten Jahres (klinisch-praktisches Jahr) in verschiedenen Krankenhausabteilungen eingesetzt.\n\n### Study design / Studiendesign\n\nThe participants were asked to complete the BNT voluntarily and anonymously.\n\n### Ethical approval / Ethikvotum\n\nAll participants had to agree verbally to participate. Additionally, they provided informed consent prior to the study by reading the background information and choosing to provide data. Ethical approval was given by the Ethics Committee of the Chamber of Physicians at Westfalen-Lippe and Bielefeld University, Medical School OWL (XXXX-YYY-f-S).\n\nAlle Teilnehmer mussten sich mündlich zur Teilnahme bereit erklären. Zusätzlich gaben sie vor der Studie eine informierte Einwilligung, indem sie die Hintergrundinformationen lasen und sich daraufhin für die Bereitstellung ihrer Daten entschieden. Das Ethikvotum wurde von der Ethikkommission der Ärztekammer Westfalen-Lippe und der Universität Bielefeld, Medizinische Fakultät OWL (XXXX-YYY-f-S) erteilt.\n\n### Data collection / Datenerhebung\n\nData collection for this study was determined à priori as follows:\n\n-   Input ...\n\nDie Datenerhebung für diese Studie wurde à priori wie folgt festgelegt:\n\n-   Input ...\n\n```{webr-r}\n#| context: setup\n\n# Download a dataset\ndownload.file(\n  'https://raw.githubusercontent.com/coatless/raw-data/main/penguins.csv',\n  'penguins.csv'\n)\n\n# Read the data\ndf_penguins = read.csv(\"penguins.csv\")\n```\n\n### Outcome Measures / Ergebnisparameter\n\n...\n\n### Statistical methods / Statistische Methoden\n\nWe used the standard alpha level of .05 for significance and a power level of .80. Therefore, we needed a sample size of at least XX participants to detect an effect size showing a minimally important difference (d = .YY) [@hattie2023visible] in outcome level between intervention and control groups (calculated *a priori* with G\\*Power 3.1) [@faul2007g]. Statistical analysis, tables and figures were conducted using R [@R-base] in RStudio IDE (Posit Software, Boston, MA) with the tidyverse-, gt- and ggstatsplot-packages [@tidyverse; @gt; @patil2021visualizations]. Descriptive means and standard deviations were calculated for participants' age, and total test scores and frequencies were calculated for sex and for solving the case scenarios. Sample means and frequencies were compared with population means and frequencies using one-sample t-tests and chi-square tests, respectively. ...\n\nWir verwendeten das Standard-Alpha-Niveau von .05 für die Signifikanz und ein Power-Niveau von .80. Daher benötigten wir eine Stichprobengröße von mindestens XX Teilnehmern, um eine Effektgröße nachzuweisen, die einen minimal bedeutsamen Unterschied (d = .YY) [@hattie2023visible] im Ergebnisniveau zwischen Interventions- und Kontrollgruppe zeigt (*a priori* berechnet mit G\\*Power 3.1) [@faul2007g]. Statistische Analysen, Tabellen und Abbildungen wurden mit R [@R-base] in RStudio IDE (Posit Software, Boston, MA) mit den tidyverse-, gt- und ggstatsplot-Paketen [@tidyverse; @gt; @patil2021visualizations] durchgeführt. Deskriptive Mittelwerte und Standardabweichungen wurden für das Alter der Teilnehmer berechnet, und die Gesamttestwerte und Häufigkeiten wurden für das Geschlecht und für die Lösung der Fallszenarien berechnet. Die Mittelwerte und Häufigkeiten der Stichprobe wurden mit den Mittelwerten und Häufigkeiten der Grundgesamtheit unter Verwendung von t-Tests bzw. Chi-Quadrat-Tests für eine Stichprobe verglichen. ...\n\n```{webr-r}\n#| context: interactive\n\n# Download a dataset\ndownload.file(\n  'https://raw.githubusercontent.com/coatless/raw-data/main/penguins.csv',\n  'penguins.csv'\n) # <1>\n\n# Read the data\npenguins = read.csv(\"penguins.csv\") # <2>\n\n# Scatterplot example: penguin bill length versus bill depth\nggplot2::ggplot(data = penguins, ggplot2::aes(x = bill_length_mm, y = bill_depth_mm)) + # <3>\n  ggplot2::geom_point(ggplot2::aes(color = species, \n                 shape = species), # <3>\n             size = 2)  +\n  ggplot2::scale_color_manual(values = c(\"darkorange\",\"darkorchid\",\"cyan4\")) # <3>\n```\n\n1.  Download the dataset\n2.  Read the data\n3.  Build a scatterplot\n\n\n\n## Results / Ergebnisse\n\n\n### Recruitment Process and Demographic Characteristics / Studienteilnahme\n\nThe recruitment process is shown in Figure 1. We obtained XX complete data sets (return rate YY.Z%) after contacting ...\n\n[Der Rekrutierungsprozess ist in Abbildung 1 dargestellt. Wir erhielten XX vollständige Datensätze (Rücklaufquote YY.Z%), nachdem wir Kontakt mit ...]{color=\"gray\"}\n\n<!-- Man kann Code-Ergebnisse über {{< embed notebooks/EDA.qmd#fig-map >}} einfügen -->\n\n### Primary and secondary Outcomes / Haupt- und Nebenergebnisse\n\n![Beispielgrafik: ein Bild sagt mehr als tausend Worte ...](Durchschnittswerte_Selbsteinschätzung_NKLM_14a.jpg)\n\nHier kann ich aus der iA-Writer-App einfügen ... 😀\nDas funktioniert über die Tastatur sehr überzeugend, auch im Diktat? Was es zu beweisen gilt und offensichtlich ziemlich gut klappt. Tärää🎺￼￼\n\n<!-- Man kann Code-Ergebnisse über {{< embed notebooks/EDA.qmd#fig-map >}} einfügen -->\n\n\n\n## Discussion / Diskussion\n\n\n### Summary / Zusammenfassung der Ergebnisse\n\nAfter the evaluation of all datasets, the following findings emerged. The first is that ...\n\nNach Auswertung aller Datensätze ergaben sich die folgenden Erkenntnisse: Die erste ist, dass ...\n\n### Limitation: Studienpopulation\n\nmöglicher Einfluss der Studienpopulation auf Interpretation und Anwendbarkeit der Ergebnisse ...\n\n### Limitation: Studiendesign\n\nmöglicher Einfluss des Studiendesigns auf Interpretation und Anwendbarkeit der Ergebnisse ...\n\n### Integration with prior work / Vergleich mit bestehender theoretischer und empirischer Forschung\n\n... is a high effect size in comparison to Hattie et al. [@hattie2023visible].\n\n### Implications for practice / Direkte Auswirkungen der Ergebnisse auf Praxis\n\n\n\n\n\n\n\n\n\n{{< lipsum 1 >}}\n\n\n\n\n\n\n\n\n\n\n\n\n\n\n\n\n\n### Implications for research / Direkte Auswirkungen der Ergebnisse auf Forschung\n\n...\n\n## Conclusions / Schlussfolgerungen\n\n...\n\n\n\n## References {.unnumbered}\n\n::: {#refs}\n:::\n\n## Declarations {.appendix}\n\n\n\n### Ethics approval and consent to participate / Ethikvotum\n\nParticipants were asked to complete the test voluntarily and anonymously. To achieve maximum transparency, all participants had to verbally agree to participate. Additionally, they provided their informed consent prior to the study by reading the background information and choosing to provide data. An extra written consent was not obtained. The study and the use of only verbal consent was approved by the Ethics Committee of the Chamber of Physicians at Westfalen-Lippe and Bielefeld University, Medical School OWL (XXXX-YYY-f-S).\n\nDie Teilnehmer wurden gebeten, den Test freiwillig und anonym auszufüllen. Um ein Höchstmaß an Transparenz zu erreichen, mussten alle Teilnehmer ihre mündliche Zustimmung zur Teilnahme geben. Darüber hinaus gaben sie vor der Studie ihre informierte Zustimmung, indem sie die Hintergrundinformationen lasen und sich für die Bereitstellung ihrer Daten entschieden. Eine zusätzliche schriftliche Einwilligung wurde nicht eingeholt. Die Studie und die Verwendung der ausschließlich mündlichen Einwilligung wurde von der Ethikkommission der Ärztekammer Westfalen-Lippe und der Medizinischen Fakultät OWL der Universität Bielefeld genehmigt (XXXX-YYY-f-S).\n\n### Consent for publication / Einwilligung zur Veröffentlichung\n\nNot applicable\n\nNicht zutreffend\n\n### Availability of data and materials / Verfügbarkeit von Daten und Materialien\n\nThe original data that support the findings of this study are available from Open Science Framework (osf.io, see manuscript-URL).\n\nDie Originaldaten der Studie sind beim Open Science Framework (osf.io, siehe Manuskript-URL) verfügbar.\n\n### Competing interests / Konkurrierende Interessen\n\nThe authors declare that they have no competing interests.\n\nDie Autoren erklären, dass sie keine konkurrierenden Interessen haben.\n\n### Funding / Finanzierung\n\nThe author(s) received no specific funding for this work.\n\nDer/die Autor\\*innen erhielt(en) für diese Arbeit keine spezielle Finanzierung.\n\n### Authors' contributions / Beiträge der Autor\\*innen\n\nHF conceived the study and participated in its design and coordination. XX participated in the data acquisition and data analysis. YY participated in the study design. ZZ participated in the design and coordination of the study. All authors helped to draft the manuscript.\n\nHF konzipierte die Studie und beteiligte sich an deren Gestaltung und Koordination. XX war an der Datenerfassung und Datenanalyse beteiligt. YY war an der Gestaltung der Studie beteiligt. ZZ beteiligte sich an der Konzeption und Koordination der Studie. Alle Autor\\*innen haben an der Erstellung des Manuskripts mitgewirkt.\n\n### CRediT authorship contribution statement\n\n**Hendrik Friederichs:** Conceptualization, Data curation, Formal analysis, Funding acquisition, Investigation, Methodology, Project administration, Resources, Software, Supervision, Validation, Visualization, Writing - review & editing, Writing - original draft. **Wolf Jonas Friederichs:** Conceptualization, Data curation, Formal analysis, Funding acquisition, Investigation, Methodology, Project administration, Resources, Software, Supervision, Validation, Visualization, Writing - review & editing, Writing - original draft. **Maren März:** Conceptualization, Data curation, Formal analysis, Funding acquisition, Investigation, Methodology, Project administration, Resources, Software, Supervision, Validation, Visualization, Writing - review & editing, Writing - original draft.\n\n### Acknowledgments / Danksagung\n\nThe manuscript was linguistically improved using DeepL Pro (DeepL SE, Cologne, Germany). DeepL Pro provided translation and language refinement only to ensure clarity and coherence in English.\n \n[Das Manuskript wurde mit DeepL Pro (DeepL SE, Köln, Deutschland) sprachlich verbessert. DeepL Pro diente lediglich der Übersetzung und sprachlichen Verfeinerung, um die Klarheit und Kohärenz im Englischen zu gewährleisten.]{color=\"gray\"}\n\nThe authors are grateful for the insightful comments offered by the anonymous peer reviewers at {{< meta citation.container-title >}}. The generosity and expertise of one and all have improved this study in innumerable ways and saved us from many errors; those that inevitably remain are entirely our own responsibility.\n\n[Die Autoren sind dankbar für die aufschlussreichen Kommentare der anonymen Peer-Reviewer von {{< meta citation.container-title >}}. Die Großzügigkeit und das Fachwissen eines jeden Einzelnen haben diese Studie auf unzählige Arten verbessert und uns vor vielen Fehlern bewahrt; die, die unvermeidlich bleiben, liegen vollständig in unserer eigenen Verantwortung.]{color=\"gray\"}\n\n",
    "supporting": [],
    "filters": [
      "rmarkdown/pagebreak.lua"
    ],
    "includes": {},
    "engineDependencies": {},
    "preserve": null,
    "postProcess": false
  }
}