{
  "hash": "756319eba5874374208f2e417b4acffb",
  "result": {
    "markdown": "---\ntitle: draft\nsubtitle: draft\nimage: \"/Users/FriederichsH/sciebowl/Organization/Website/ag-7/docs/blog/images/graduation-cap.png\"\ndate: 5/07/2022\ncategories:\n  - Critical Thinking\n  - Life Long Learning\ncitation: true\nreference-location: margin\ncitation-location: margin\ngoogle-scholar: true\ndraft: true\nlang: de\n---\n\nDies ist ein Entwurf für einen neuen Blog-Beitrag.\n\n## Hintergrund {.unnumbered}\n\nLorem ipsum ...\n\n\n## Methoden {.unnumbered}\n\nLorem ipsum ...\n\n## Ergebnisse {.unnumbered}\n\nLorem ipsum ...\n\n## Diskussion {.unnumbered}\n\nLorem ipsum ...\n\n## Take-Home-Message {.unnumbered}\n\nLorem ipsum ...\n\n",
    "supporting": [],
    "filters": [
      "rmarkdown/pagebreak.lua"
    ],
    "includes": {},
    "engineDependencies": {},
    "preserve": {},
    "postProcess": null
  }
}