{
  "hash": "3c20206a0b3c2027d54a15ab97cee88c",
  "result": {
    "markdown": "---\ntitle: Kooperationsvereinbarung PTM\nsubtitle: Eine Vereinbarung mit der Charité Berlin zum Progress Test Medizin\nimage: \"/Users/FriederichsH/sciebowl/Organization/Website/ag-7/docs/blog/images/graduation-cap.png\"\ndate: 9/15/2021\ncategories:\n  - Lehre\n  - Life Long Learning\ncitation: true\nreference-location: margin\ncitation-location: margin\ngoogle-scholar: true\nlang: de\n---\n\n## Hintergrund {.unnumbered}\n\nAus der Lehr- und Expertiseforschung weiß man, dass eine klare Zielsetzung, Feedback, die Möglichkeit zur Wiederholung und graduelle Verbesserung der Performance zentrale Elemente des effektiven und erfolgreichen Lernens sind (siehe v.a. Werke von Hattie \\[1\\] und Ericsson \\[2\\]). Vereint werden diese Elemente in sog. Progress Tests.\n\nIn Progress Tests wird der kumulative Anstieg der Kompetenz von Studierenden regelmäßig gemessen und rückgemeldet. Diese Progresstests werden von Fakultäten international zunehmend eingesetzt und sind in ihrer Wirksamkeit eindrucksvoll belegt \\[3\\].\n\nDie Vermittlung und das Prüfen von medizinischem Wissen sind eine zentrale Aufgabe der medizinischen Fakultät, denn Wissen hat sich als ein Schlüsselelement für die Performance von Ärztinnen und Ärzten erwiesen. Der deutsche Progresstests Medizin (PTM -- bereitgestellt durch die Charité Berlin) enthält ca. 200 Fragen in einem Multiple-Choice-Format auf dem Niveau eines Abschluss-Examens. So lässt sich gesamtfakultär und fächerspezifisch der Wissenszuwachs der Studierenden bestimmen, was eine Steuerung und strukturelle sowie auch inhaltliche Optimierung der Lehre erlaubt. Die individuellen Ergebnisse ermöglichen den Studierenden zudem ein regelmäßiges Feedback zu ihrem Leistungsstand und unterstützen so die Ausformung einer akkuraten Selbsteinschätzung, die für das „Lebenslange Lernen\" von essenzieller Bedeutung ist. Somit stellen Progresstests für das Wissen von Studierenden ein zentrales Lehr- und Qualitätssicherungselement einer Fakultät dar, deren Implementierung äußerst sinnvoll ist.\n\nTrotz der Vorteile von Progresstests sind diese unter Studierenden und in der Fakultät nicht unumstritten. Kritikpunkte sind neben einem zeitlichen Verzug zwischen Test und Feedback vor allem der logistische und zeitliche Aufwand, der mit der Durchführung eines Progresstests einhergeht. Für das Ausfüllen der 200 MC-Fragen werden z.B. von den Teilnehmern bis zu drei Zeitstunden benötigt, die am besten halbjährlich investiert werden müssen.\n\nEinen möglichen Lösungsansatz bieten die von der Charité entwickelten Online-Formate des Progresstests. Dadurch tut sich die Gelegenheit auf, unter Einsatz von KI (künstlicher Intelligenz) adaptive Testformate einzuführen. Dabei wird das Niveau der Fragen im Verlauf des Tests dem Kompetenzlevel der Studierenden angepasst. Mit diesen adaptiven Testformaten lässt sich das Leistungsniveau der Studierenden in kürzerer Zeit und mit weniger Aufwand bestimmen. Zudem ist ein damit ein unmittelbares Feedback möglich.\n\nDie Medizinische Fakultät OWL ist aufgrund ihrer Neugründung selbst hochgradig an hochqualitativem und kurzfristigem Feedback zum Lernen ihrer Studierenden interessiert und würde die beschriebene Entwicklung des Progress Test Medizin gerne ernsthaft unterstützen. Dafür würde die hiesige AG Medical Education im Sinne einer Kooperation mit dem Progress Test Medizin der Charité Arbeitskraft und auch medizindidaktische Expertise für eine gemeinsame Durchführung von Forschungsprojekten anbieten. Die AG Medical Education selbst führt Lehrforschung zum Progresstest und auch Data-Science-Projekte durch, so dass die entsprechende spezifische Expertise vorhanden ist.\n\nDie bisherigen konstruktiven gemeinsamen Gespräche sollen in absehbarer Zeit in entsprechende Verhandlungen zu einer Kooperationsvereinbarung überführt werden.\n\n## Antrag Ethikkommission {.unnumbered}\n\nUm datenschutzrechtliche und ethische Fragen rund um die Verarbeitung und den Nutzen der sich aus dem Progresstest ergebenden Daten möglichst transparent zu klären, wurde ein entsprechender Antrag an die Ethikkommission der Ärztekammer Westfalen-Lippe gestellt.\n\nAnträge an die Ethikkommission werden von einem multiprofessionellen Gremium begutachtet, dem neben Vertretern aus Medizin und Jura auch Patientenvertreter\\*innen angehören.",
    "supporting": [],
    "filters": [
      "rmarkdown/pagebreak.lua"
    ],
    "includes": {},
    "engineDependencies": {},
    "preserve": {},
    "postProcess": null
  }
}