%YAML 1.1
%TAG !u! tag:unity3d.com,2011:
--- !u!1001 &1554191459018084948
PrefabInstance:
  m_ObjectHideFlags: 0
  serializedVersion: 2
  m_Modification:
    m_TransformParent: {fileID: 0}
    m_Modifications:
    - target: {fileID: 1474952065208578152, guid: d8ef235a2b152eb45a3beb5fa4ad5a28, type: 3}
      propertyPath: m_Pivot.x
      value: 0.5
      objectReference: {fileID: 0}
    - target: {fileID: 1474952065208578152, guid: d8ef235a2b152eb45a3beb5fa4ad5a28, type: 3}
      propertyPath: m_Pivot.y
      value: 0.5
      objectReference: {fileID: 0}
    - target: {fileID: 1474952065208578152, guid: d8ef235a2b152eb45a3beb5fa4ad5a28, type: 3}
      propertyPath: m_RootOrder
      value: 0
      objectReference: {fileID: 0}
    - target: {fileID: 1474952065208578152, guid: d8ef235a2b152eb45a3beb5fa4ad5a28, type: 3}
      propertyPath: m_AnchorMax.x
      value: 0.5
      objectReference: {fileID: 0}
    - target: {fileID: 1474952065208578152, guid: d8ef235a2b152eb45a3beb5fa4ad5a28, type: 3}
      propertyPath: m_AnchorMax.y
      value: 0.5
      objectReference: {fileID: 0}
    - target: {fileID: 1474952065208578152, guid: d8ef235a2b152eb45a3beb5fa4ad5a28, type: 3}
      propertyPath: m_AnchorMin.x
      value: 0.5
      objectReference: {fileID: 0}
    - target: {fileID: 1474952065208578152, guid: d8ef235a2b152eb45a3beb5fa4ad5a28, type: 3}
      propertyPath: m_AnchorMin.y
      value: 0.5
      objectReference: {fileID: 0}
    - target: {fileID: 1474952065208578152, guid: d8ef235a2b152eb45a3beb5fa4ad5a28, type: 3}
      propertyPath: m_SizeDelta.x
      value: 0
      objectReference: {fileID: 0}
    - target: {fileID: 1474952065208578152, guid: d8ef235a2b152eb45a3beb5fa4ad5a28, type: 3}
      propertyPath: m_SizeDelta.y
      value: 0
      objectReference: {fileID: 0}
    - target: {fileID: 1474952065208578152, guid: d8ef235a2b152eb45a3beb5fa4ad5a28, type: 3}
      propertyPath: m_LocalPosition.x
      value: 0
      objectReference: {fileID: 0}
    - target: {fileID: 1474952065208578152, guid: d8ef235a2b152eb45a3beb5fa4ad5a28, type: 3}
      propertyPath: m_LocalPosition.y
      value: 0
      objectReference: {fileID: 0}
    - target: {fileID: 1474952065208578152, guid: d8ef235a2b152eb45a3beb5fa4ad5a28, type: 3}
      propertyPath: m_LocalPosition.z
      value: 0
      objectReference: {fileID: 0}
    - target: {fileID: 1474952065208578152, guid: d8ef235a2b152eb45a3beb5fa4ad5a28, type: 3}
      propertyPath: m_LocalRotation.w
      value: 1
      objectReference: {fileID: 0}
    - target: {fileID: 1474952065208578152, guid: d8ef235a2b152eb45a3beb5fa4ad5a28, type: 3}
      propertyPath: m_LocalRotation.x
      value: 0
      objectReference: {fileID: 0}
    - target: {fileID: 1474952065208578152, guid: d8ef235a2b152eb45a3beb5fa4ad5a28, type: 3}
      propertyPath: m_LocalRotation.y
      value: 0
      objectReference: {fileID: 0}
    - target: {fileID: 1474952065208578152, guid: d8ef235a2b152eb45a3beb5fa4ad5a28, type: 3}
      propertyPath: m_LocalRotation.z
      value: 0
      objectReference: {fileID: 0}
    - target: {fileID: 1474952065208578152, guid: d8ef235a2b152eb45a3beb5fa4ad5a28, type: 3}
      propertyPath: m_AnchoredPosition.x
      value: 252.8
      objectReference: {fileID: 0}
    - target: {fileID: 1474952065208578152, guid: d8ef235a2b152eb45a3beb5fa4ad5a28, type: 3}
      propertyPath: m_AnchoredPosition.y
      value: 240.99002
      objectReference: {fileID: 0}
    - target: {fileID: 1474952065208578152, guid: d8ef235a2b152eb45a3beb5fa4ad5a28, type: 3}
      propertyPath: m_LocalEulerAnglesHint.x
      value: 0
      objectReference: {fileID: 0}
    - target: {fileID: 1474952065208578152, guid: d8ef235a2b152eb45a3beb5fa4ad5a28, type: 3}
      propertyPath: m_LocalEulerAnglesHint.y
      value: 0
      objectReference: {fileID: 0}
    - target: {fileID: 1474952065208578152, guid: d8ef235a2b152eb45a3beb5fa4ad5a28, type: 3}
      propertyPath: m_LocalEulerAnglesHint.z
      value: 0
      objectReference: {fileID: 0}
    - target: {fileID: 1881791999735830110, guid: d8ef235a2b152eb45a3beb5fa4ad5a28, type: 3}
      propertyPath: m_Sprite
      value: 
      objectReference: {fileID: 10907, guid: 0000000000000000f000000000000000, type: 0}
    - target: {fileID: 1881791999735830110, guid: d8ef235a2b152eb45a3beb5fa4ad5a28, type: 3}
      propertyPath: m_Color.a
      value: 1
      objectReference: {fileID: 0}
    - target: {fileID: 2558297520395255453, guid: d8ef235a2b152eb45a3beb5fa4ad5a28, type: 3}
      propertyPath: m_Name
      value: HelpPopupPrefab
      objectReference: {fileID: 0}
    - target: {fileID: 4300006832878966614, guid: d8ef235a2b152eb45a3beb5fa4ad5a28, type: 3}
      propertyPath: m_Text
      value: '-- Informations about the UI --


        TBD'
      objectReference: {fileID: 0}
    - target: {fileID: 4300006832878966614, guid: d8ef235a2b152eb45a3beb5fa4ad5a28, type: 3}
      propertyPath: m_FontData.m_MinSize
      value: 2
      objectReference: {fileID: 0}
    - target: {fileID: 4300006832878966614, guid: d8ef235a2b152eb45a3beb5fa4ad5a28, type: 3}
      propertyPath: m_FontData.m_FontSize
      value: 28
      objectReference: {fileID: 0}
    - target: {fileID: 5257985417568312230, guid: d8ef235a2b152eb45a3beb5fa4ad5a28, type: 3}
      propertyPath: m_AnchorMax.y
      value: 0
      objectReference: {fileID: 0}
    - target: {fileID: 5257985417568312230, guid: d8ef235a2b152eb45a3beb5fa4ad5a28, type: 3}
      propertyPath: m_AnchorMin.y
      value: 0
      objectReference: {fileID: 0}
    - target: {fileID: 5257985417568312230, guid: d8ef235a2b152eb45a3beb5fa4ad5a28, type: 3}
      propertyPath: m_SizeDelta.x
      value: 0
      objectReference: {fileID: 0}
    - target: {fileID: 5257985417568312230, guid: d8ef235a2b152eb45a3beb5fa4ad5a28, type: 3}
      propertyPath: m_SizeDelta.y
      value: 0
      objectReference: {fileID: 0}
    - target: {fileID: 5257985417568312230, guid: d8ef235a2b152eb45a3beb5fa4ad5a28, type: 3}
      propertyPath: m_AnchoredPosition.x
      value: 196
      objectReference: {fileID: 0}
    - target: {fileID: 5257985417568312230, guid: d8ef235a2b152eb45a3beb5fa4ad5a28, type: 3}
      propertyPath: m_AnchoredPosition.y
      value: 0
      objectReference: {fileID: 0}
    m_RemovedComponents: []
  m_SourcePrefab: {fileID: 100100000, guid: d8ef235a2b152eb45a3beb5fa4ad5a28, type: 3}
