{
    "id": "2-2",
    "map": "################\n#ggg#ggggg#ggg##\n###g#ggggg###g##\n#ggg#ggggg#ggg##\n#ggg#ggggg#g####\n#ggggggggggg####\n#ggggggggg#g#gg#\n#ggggggggg#g##g#\n#ggggggggg#g##g#\n#ggggggggg#gggg#\n################\n",
    "exits": [
        {
            "pos": [
                1,
                1
            ],
            "color": "green",
            "symbol": "1",
            "locked": false
        },
        {
            "pos": [
                1,
                11
            ],
            "color": "green",
            "symbol": "2",
            "locked": false
        },
        {
            "pos": [
                6,
                13
            ],
            "color": "green",
            "symbol": "3",
            "locked": false
        }
    ],
    "keys": [{"corDoor": "3", "color":"blue", "parts":[{"pos":[6,13], "symbol": "b"}]}],
    "query_points": [4,6,22],
    "vision": "memory",
    "agent": {
        "id": 1,
        "startPos": [
            1,
            5
        ],
        "behavior": {
            "type": "scripted",
            "desire": "3",
            "script": [
                "Down",
                "Down",
                "Down",
                "Down",
                "Left",
                "Left",
                "Up",
                "Up",
                "Up",
                "Up",
                "Down",
                "Down",
                "Down",
                "Down",
                "Right",
                "Right",
                "Right",
                "Right",
                "Right",
                "Right",
                "Right",
                "Right",
                "Up",
                "Up",
                "Right",
                "Right",
                "Up",
                "Up",
                "Down",
                "Down",
                "Left",
                "Left",
                "Down",
                "Down",
                "Down",
                "Down",
                "Down",
                "Down",
                "Right",
                "Right",
                "Right",
                "Up",
                "Up",
                "Up",
                "Left"
            ]
        }
    }
}