belief_epileptic-seizure,belief_psychogenic-seizure,belief_syncope,queried_feature,observed_feature_value,observed_reward,runtime
0.3333333333333333,0.3333333333333333,0.3333333333333333,S-consciousness-drift,no,-1.0,26.69389271736145
0.3886966551326413,0.1441753171856978,0.4671280276816609,S-onset-during-sleep,no,-1.0,28.871275663375854
0.2547576574897082,0.07888809264412362,0.6663542498661681,S-deja-vu,yes,-1.0,33.17481732368469
0.6389138011027384,0.1662874375839069,0.1947987613133548,S-locked-in,yes,-1.0,29.715866565704346
0.7198302803356413,0.201983735662849,0.07818598400150965,S-brief-jerks,no,-1.0,28.27884864807129
0.778739998827567,0.12274864418764969,0.09851135698478329,S-olfactory-hallucination,no,-1.0,35.172022104263306
0.785648091308868,0.09729049770627589,0.11706141098485592,S-leg-automatisms,no,-1.0,32.37578988075256
0.7271012090538655,0.07874497604775774,0.19415381489837685,S-time-in-slow-motion,no,-1.0,31.333662748336792
0.7068346960263745,0.0437274987256773,0.24943780524794812,S-oral-automatisms,yes,-1.0,30.81424045562744
0.9403021617959716,0.04375671328888984,0.015941124915138556,epileptic-seizure,submitted,100.0,5.445578575134277
