belief_epileptic-seizure,belief_psychogenic-seizure,belief_syncope,queried_feature,observed_feature_value,observed_reward,runtime
0.3333333333333333,0.3333333333333333,0.3333333333333333,S-violent-shaking,no,-1.0,25.36845827102661
0.2571854375133063,0.14434745582286562,0.598467106663828,S-deja-vu,no,-1.0,24.261013746261597
0.2535239379610677,0.11495284367940893,0.6315232183595233,S-chest-pain,no,-1.0,29.562061548233032
0.3316661392650155,0.07698803163410069,0.591345829100884,S-locked-in,yes,-1.0,28.077059507369995
0.6009332951414901,0.11279211176934063,0.28627459308916936,S-triggered-by-standing,no,-1.0,29.02429986000061
0.7711229342391049,0.09825919777723652,0.13061786798365857,S-sensation-of-passivity,no,-1.0,28.637964248657227
0.7950391115197122,0.07147907939727917,0.1334818090830087,S-palpitations,yes,-1.0,29.402408599853516
0.4257296517226426,0.1648169447285141,0.40945340354884335,S-consciousness-drift,no,-1.0,29.23760437965393
0.5064382467428884,0.05454259941124936,0.4390191538458622,S-aware-of-shaking,no,-1.0,29.920092821121216
0.5248312181802722,0.024215812576753825,0.4509529692429739,S-triggered-by-stress,no,-1.0,28.69424533843994
0.1950883691469089,0.018148013280722994,0.786763617572368,S-brief-jerks,no,-1.0,29.01432228088379
0.21920982211701268,0.008591261068774824,0.7721989168142126,S-shaking-over-1min,no,-1.0,31.32592463493347
0.13126740214194704,0.002679492640149897,0.866053105217903,S-visual-auditory-awareness,yes,-1.0,28.84546422958374
0.24938005438552013,0.005036931662252174,0.7455830139522277,S-rigid-limbs,no,-1.0,26.95039391517639
0.11505847351024445,0.0020429626247844674,0.8828985638649711,R-poor-coordination,no,-1.0,29.109796047210693
0.12235003848216361,0.001379756323967543,0.8762702051938688,S-olfactory-hallucination,no,-1.0,29.946826457977295
0.13636076095564673,0.0009060811723252005,0.862733157872028,S-like-electricity,no,-1.0,31.03530216217041
0.11492613928275432,0.0003911632996797253,0.884682697417566,S-rapid-head-turning,no,-1.0,29.60365653038025
0.08101861704866596,0.00014958432582912675,0.9188317986255049,S-recall-bad-memories,no,-1.0,34.200451612472534
0.09413606855244905,9.835402822230171e-05,0.9057655774193286,S-limp-limbs,yes,-1.0,38.01842927932739
0.05444898301490215,7.277751233781559e-05,0.94547823947276,S-time-in-slow-motion,no,-1.0,28.561444759368896
0.05490891152626388,3.1442735336743734e-05,0.9450596457383995,S-onset-during-sleep,no,-1.0,23.550067901611328
0.034369635087963465,1.2323037407131074e-05,0.9656180418746295,S-oral-automatisms,no,-1.0,19.505860090255737
0.01020521894033676,5.317838851034671e-06,0.9897894632208122,S-like-knife-through-head,no,-1.0,15.446086645126343
0.011987049767401524,2.692765594826509e-06,0.9880102574670038,S-like-hammer-blow,no,-1.0,10.589167356491089
0.013699457981435244,1.0310915035912211e-06,0.9862995109270611,syncope,submitted,100.0,5.3949315547943115
