belief_epileptic-seizure,belief_psychogenic-seizure,belief_syncope,queried_feature,observed_feature_value,observed_reward,runtime
0.3333333333333333,0.3333333333333333,0.3333333333333333,S-aware-of-shaking,yes,-1.0,29.251404285430908
0.3066385669125395,0.6269757639620653,0.06638566912539515,S-chest-pain,yes,-1.0,28.818868398666382
0.07162134636928405,0.9013774315103372,0.027001222120378858,S-recall-bad-memories,yes,-1.0,27.9561026096344
0.02693345444455907,0.9730664580217965,8.753364440484109e-08,psychogenic-seizure,submitted,100.0,5.517224550247192
