belief_epileptic-seizure,belief_psychogenic-seizure,belief_syncope,queried_feature,observed_feature_value,observed_reward,runtime
0.3333333333333333,0.3333333333333333,0.3333333333333333,S-time-in-slow-motion,no,-1.0,31.018881797790527
0.32433668801463855,0.24702653247941447,0.4286367795059469,S-rapid-head-turning,no,-1.0,32.811288356781006
0.23091750298041322,0.16960702244083897,0.5994754745787478,S-manual-automatisms,no,-1.0,30.33546280860901
0.0862366074181608,0.12810354219588152,0.7856598503859578,S-postictal-relief,no,-1.0,28.646753549575806
0.09367296198334438,0.1280181527256825,0.7783088852909731,S-palpitations,no,-1.0,33.24553346633911
0.13882742278942847,0.17912088743930502,0.6820516897712665,S-visual-auditory-awareness,no,-1.0,26.83571195602417
0.10913445986359689,0.12201547798339311,0.76885006215301,S-consciousness-drift,no,-1.0,35.40150451660156
0.0998058685718687,0.0551858771043623,0.845008254323769,S-rigid-limbs,yes,-1.0,28.712369918823242
0.28215619273588344,0.1964611176634226,0.521382689600694,S-onset-during-sleep,yes,-1.0,34.16448521614075
0.4596276768248356,0.482533081361304,0.05783924181386032,S-want-to-know-what-happens,yes,-1.0,34.41964650154114
0.4071755969492635,0.5444649354213977,0.04835946762933875,S-deja-vu,no,-1.0,33.24373936653137
0.32362769091146515,0.6215117006961345,0.05486060839240031,S-triggered-by-blood,no,-1.0,40.15381598472595
0.2698742366132883,0.689573794543559,0.04055196884315276,S-locked-in,yes,-1.0,31.765201330184937
0.21156929279052067,0.777105190503223,0.011325516706256354,S-feel-hot-cold,yes,-1.0,30.412846326828003
0.07603791647792214,0.9136951991759272,0.010266884346150596,S-pallor,no,-1.0,34.96874237060547
0.05074862827345949,0.9469781931900804,0.0022731785364601756,R-febrile-seizures,no,-1.0,12.294291973114014
0.033964652834002136,0.9642371295188258,0.0017982176471720043,psychogenic-seizure,submitted,-100.0,4.874492883682251
