belief_epileptic-seizure,belief_psychogenic-seizure,belief_syncope,queried_feature,observed_feature_value,observed_reward,runtime
0.3333333333333333,0.3333333333333333,0.3333333333333333,S-frightened-to-death,yes,-1.0,28.69715452194214
0.2239382239382239,0.6126126126126126,0.16344916344916344,S-brief-jerks,no,-1.0,26.361451625823975
0.17169282185868118,0.7217810582403784,0.10652611990094041,S-like-knife-through-head,yes,-1.0,27.67989993095398
0.016387874985841183,0.9820245391191132,0.0015875858950457108,psychogenic-seizure,submitted,100.0,4.692641019821167
