belief_epileptic-seizure,belief_psychogenic-seizure,belief_syncope,queried_feature,observed_feature_value,observed_reward,runtime
0.3333333333333333,0.3333333333333333,0.3333333333333333,S-limp-limbs,no,-1.0,26.829278469085693
0.6611215454789375,0.27770324657901796,0.061175207942044535,S-like-knife-through-head,no,-1.0,28.61851954460144
0.7938288920056101,0.14374738165060744,0.06242372634378243,S-like-hammer-blow,no,-1.0,31.431577682495117
0.8854583146588505,0.053721575908959325,0.06082010943219028,S-leg-automatisms,no,-1.0,26.62512516975403
0.883300918932128,0.03515087921996893,0.08154820184790296,S-recall-bad-memories,no,-1.0,31.937695026397705
0.9083912928318533,0.020456687232438656,0.07115201993570797,S-manual-automatisms,yes,-1.0,29.14035725593567
0.9815863709516308,0.013457522562608121,0.004956106485761087,S-olfactory-hallucination,no,-1.0,12.484495878219604
0.9876167299169064,0.007978191236760511,0.00440507884633316,epileptic-seizure,submitted,100.0,2.9735333919525146
