belief_epileptic-seizure,belief_psychogenic-seizure,belief_syncope,queried_feature,observed_feature_value,observed_reward,runtime
0.3333333333333333,0.3333333333333333,0.3333333333333333,S-onset-during-sleep,no,-1.0,19.592363357543945
0.3068911647283458,0.19215413990626629,0.500954695365388,S-consciousness-drift,no,-1.0,17.35643172264099
0.378003130591404,0.06584186627530837,0.5561550031332877,S-oral-automatisms,yes,-1.0,20.66146206855774
0.8685995439579661,0.08535482541268401,0.046045630629349764,S-recall-bad-memories,no,-1.0,18.151126623153687
0.9086081760379439,0.05052658593681841,0.04086523802523774,S-limp-limbs,no,-1.0,24.746304750442505
0.9732169713595542,0.02273278443227925,0.004050244208166553,epileptic-seizure,submitted,100.0,4.19736385345459
