belief_epileptic-seizure,belief_psychogenic-seizure,belief_syncope,queried_feature,observed_feature_value,observed_reward,runtime
0.3333333333333333,0.3333333333333333,0.3333333333333333,S-like-electricity,yes,-1.0,29.18271017074585
0.38663711209626345,0.565231158961368,0.04813172894236859,S-triggered-by-stress,yes,-1.0,31.159599781036377
0.4375684124363619,0.5289595909774277,0.033471996586210376,S-like-knife-through-head,no,-1.0,29.48460865020752
0.5523594577167251,0.3838048506279089,0.06383569165536598,S-time-in-slow-motion,no,-1.0,30.258342027664185
0.6247813267012199,0.247985046474053,0.12723362682472714,S-chest-pain,no,-1.0,27.158495664596558
0.6535680854890026,0.1770713749928491,0.16936053951814833,S-recall-bad-memories,no,-1.0,29.700873613357544
0.6268526593349675,0.12814349484759835,0.2450038458174342,S-feel-hot-cold,no,-1.0,26.656400680541992
0.7824866323024188,0.06452497078344435,0.15298839691413685,S-unusual-positions,no,-1.0,26.629286527633667
0.6544131593160801,0.0468022909316909,0.29878454975222885,S-palpitations,no,-1.0,26.748902320861816
0.7089205314568578,0.03589943170371038,0.25518003683943186,S-violent-shaking,yes,-1.0,26.30145764350891
0.909527651891295,0.05107301125736043,0.03939933685134448,S-frightened-to-death,yes,-1.0,28.105007886886597
0.8362801523199447,0.12846506809410813,0.03525477958594714,S-locked-in,no,-1.0,31.89637279510498
0.7982016208762903,0.10558568946733264,0.0962126896563771,S-rapid-head-turning,yes,-1.0,29.255093574523926
0.8438639541918674,0.1397991408005383,0.01633690500759441,S-deja-vu,no,-1.0,26.529996871948242
0.8228492096474387,0.14683481704960993,0.030315973302951372,S-visual-auditory-awareness,yes,-1.0,25.72802495956421
0.7904465092048797,0.18609241752583458,0.02346107326928569,S-like-hammer-blow,no,-1.0,28.478140592575073
0.8686113799922922,0.09135409628591919,0.04003452372178859,S-consciousness-drift,yes,-1.0,30.691241025924683
0.7826085540218573,0.18936109864490255,0.028030347333240183,S-sensation-of-passivity,no,-1.0,30.404289484024048
0.7747489879419966,0.17635459929660954,0.048896412761393886,S-pallor,yes,-1.0,29.73711085319519
0.7545466207638901,0.15135810437014335,0.09409527486596658,S-limp-limbs,yes,-1.0,29.78171157836914
0.5739692569489241,0.19638951985666936,0.22964122319440664,S-oral-automatisms,no,-1.0,30.27561926841736
0.2428083391731868,0.16099115366678401,0.5962005071600293,R-poor-coordination,yes,-1.0,29.115604639053345
0.3806647824756757,0.3801942643304192,0.2391409531939051,S-rigid-limbs,yes,-1.0,27.89331841468811
0.4703464876434583,0.4436670568611366,0.08598645549540505,S-triggered-by-blood,no,-1.0,29.471787452697754
0.4635337171101896,0.4363124023719442,0.10015388051786618,R-febrile-seizures,no,-1.0,33.09482264518738
0.41776753766020647,0.442434392188496,0.13979807015129753,S-leg-automatisms,no,-1.0,35.0115180015564
0.36686674298190575,0.33978809280032934,0.29334516421776485,S-brief-jerks,no,-1.0,36.05988359451294
0.362063627616924,0.1883747302275608,0.44956164215551514,S-onset-during-sleep,no,-1.0,36.8168580532074
0.19850665760811373,0.08622176695563913,0.7152715754362471,S-manual-automatisms,yes,-1.0,38.80960464477539
0.5664109098538996,0.1997038523911511,0.23388523775494932,S-triggered-by-standing,no,-1.0,32.179858922958374
0.6328451666675904,0.20197060688164792,0.1651842264507617,S-want-to-know-what-happens,yes,-1.0,31.019508361816406
0.6122419210150317,0.1866561408114252,0.20110193817354305,S-olfactory-hallucination,no,-1.0,25.771522760391235
0.5696811145364792,0.13644863186755002,0.29387025359597074,S-aware-of-shaking,yes,-1.0,19.5127956867218
0.610261981066992,0.2988667867614396,0.09087123217156845,S-postictal-relief,no,-1.0,13.25765085220337
0.6583338604040702,0.22246240268898154,0.1192037369069483,S-shaking-over-1min,yes,-1.0,6.716939210891724
0.6973030296386753,0.2761297960116359,0.026567174349688777,epileptic-seizure,submitted,100.0,0.018829822540283203
