belief_epileptic-seizure,belief_psychogenic-seizure,belief_syncope,queried_feature,observed_feature_value,observed_reward,runtime
0.3333333333333333,0.3333333333333333,0.3333333333333333,S-chest-pain,no,-1.0,25.043991088867188
0.3384025865165848,0.23099030056280684,0.4306071129206084,S-triggered-by-stress,yes,-1.0,26.921947956085205
0.4261952517383031,0.240559578076153,0.33324517018554395,S-like-knife-through-head,no,-1.0,26.482208013534546
0.399084173748197,0.12947642031278023,0.4714394059390229,S-aware-of-shaking,no,-1.0,30.811213970184326
0.30609991572075096,0.05672809194537945,0.6371719923338695,S-like-hammer-blow,no,-1.0,26.19010066986084
0.2317386197222378,0.01918579063812965,0.7490755896396325,S-frightened-to-death,no,-1.0,27.66234040260315
0.17832799480948988,0.009365954658208372,0.8123060505323016,S-manual-automatisms,yes,-1.0,28.184718370437622
0.639125089097972,0.02724779618728292,0.33362711471474504,S-oral-automatisms,no,-1.0,28.93477988243103
0.23330423209896006,0.01927422257560974,0.7474215453254301,S-limp-limbs,no,-1.0,27.639665603637695
0.6356171423957461,0.02940954038289877,0.3349733172213551,S-rapid-head-turning,no,-1.0,31.60433006286621
0.41428991908977153,0.013864292671232705,0.5718457882389958,S-feel-hot-cold,no,-1.0,29.454742670059204
0.5868628855010511,0.007922272825762912,0.40521484167318605,R-poor-coordination,no,-1.0,26.086610555648804
0.46358027616259495,0.00529948058906943,0.5311202432483357,S-want-to-know-what-happens,no,-1.0,27.00407576560974
0.31976624281301946,0.004769221262441315,0.6754645359245391,R-febrile-seizures,no,-1.0,29.706769943237305
0.22915425776817866,0.0039135579826440016,0.7669321842491773,S-time-in-slow-motion,no,-1.0,30.211886167526245
0.144777242960228,0.0014123844636165287,0.8538103725761554,S-triggered-by-standing,no,-1.0,32.186853885650635
0.21111731588159854,0.0018642852152690429,0.7870183989031324,S-onset-during-sleep,no,-1.0,32.71644830703735
0.08456293896103181,0.0006234084216497571,0.9148136526173184,S-olfactory-hallucination,no,-1.0,31.80233883857727
0.05556977888543872,0.0003218469581920159,0.9441083741563693,S-triggered-by-blood,no,-1.0,18.58526372909546
0.04742597428926625,0.0002740967919430148,0.9522999289187908,S-rigid-limbs,yes,-1.0,13.137041568756104
0.14601181223394466,0.0007969885801807874,0.8531911991858746,syncope,submitted,-100.0,9.823478937149048
