belief_epileptic-seizure,belief_psychogenic-seizure,belief_syncope,queried_feature,observed_feature_value,observed_reward,runtime
0.3333333333333333,0.3333333333333333,0.3333333333333333,S-frightened-to-death,no,-1.0,24.216059923171997
0.371569950517319,0.23571749887539364,0.3927125506072875,S-time-in-slow-motion,yes,-1.0,28.92190647125244
0.39589554389808035,0.5135181875828674,0.09058626851905228,S-postictal-relief,no,-1.0,26.760984182357788
0.47535733615164383,0.42544606176871136,0.09919660207964473,S-limp-limbs,yes,-1.0,27.612233638763428
0.3301677476108575,0.5040446735962211,0.1657875787929214,S-aware-of-shaking,no,-1.0,30.32190704345703
0.3943746114315606,0.3439157929334417,0.2617095956349977,S-triggered-by-blood,yes,-1.0,24.726766109466553
0.2638542782024204,0.23802938140326288,0.4981163403943167,S-deja-vu,no,-1.0,28.544053316116333
0.214304983822886,0.2082454028164865,0.5774496133606276,S-locked-in,no,-1.0,27.954134464263916
0.13131947574505284,0.10988324724664311,0.7587972770083041,S-want-to-know-what-happens,yes,-1.0,14.203550100326538
0.13787593717996693,0.1102095778351943,0.7519144849848388,syncope,submitted,100.0,3.337550163269043
