belief_epileptic-seizure,belief_psychogenic-seizure,belief_syncope,queried_feature,observed_feature_value,observed_reward,runtime
0.3333333333333333,0.3333333333333333,0.3333333333333333,S-feel-hot-cold,yes,-1.0,26.907670497894287
0.1673375503162737,0.410580793559517,0.42208165612420934,S-triggered-by-blood,no,-1.0,25.954532861709595
0.07907059683642165,0.47500962893978205,0.4459197742237963,S-rigid-limbs,no,-1.0,28.659202337265015
0.0065729401897072146,0.2780421768370078,0.715384882973285,S-visual-auditory-awareness,no,-1.0,28.80912470817566
5.509589583402452e-05,0.06407145150437471,0.9358734525997913,syncope,submitted,100.0,2.714736223220825
