belief_epileptic-seizure,belief_psychogenic-seizure,belief_syncope,queried_feature,observed_feature_value,observed_reward,runtime
0.3333333333333333,0.3333333333333333,0.3333333333333333,S-leg-automatisms,no,-1.0,32.54406547546387
0.27272740602512513,0.23851429057394455,0.4887583034009303,S-feel-hot-cold,yes,-1.0,26.556457996368408
0.13044408041866232,0.2799079421376994,0.5896479774436384,R-febrile-seizures,no,-1.0,30.750535249710083
0.11374847767485705,0.2785086593442251,0.6077428629809178,R-poor-coordination,no,-1.0,29.67772912979126
0.10240412249800974,0.21307498993921198,0.6845208875627783,S-triggered-by-stress,yes,-1.0,30.44674038887024
0.17237879118472682,0.29658750006518186,0.5310337087500915,S-limp-limbs,yes,-1.0,34.39734649658203
0.08812476515047064,0.258628904799717,0.6532463300498124,S-sensation-of-passivity,no,-1.0,30.87006139755249
0.07376000437624611,0.20364775211507335,0.7225922435086805,S-palpitations,yes,-1.0,31.758250951766968
0.010907872916762082,0.17290796372764994,0.816184163355588,syncope,submitted,100.0,4.6366355419158936
