belief_epileptic-seizure,belief_psychogenic-seizure,belief_syncope,queried_feature,observed_feature_value,observed_reward,runtime
0.3333333333333333,0.3333333333333333,0.3333333333333333,S-like-knife-through-head,no,-1.0,30.295860290527344
0.32408703397378796,0.18628324214276623,0.4896297238834457,S-sensation-of-passivity,no,-1.0,28.447349071502686
0.23792931664772074,0.1286588566845696,0.6334118266677097,S-triggered-by-stress,yes,-1.0,32.3225519657135
0.324359229341655,0.14503471527847675,0.5306060553798683,S-deja-vu,no,-1.0,34.75876212120056
0.21763787431575243,0.10482307761015792,0.6775390480740897,S-frightened-to-death,no,-1.0,33.89141249656677
0.17566677877253087,0.0536739192290661,0.770659301998403,S-visual-auditory-awareness,no,-1.0,35.61187171936035
0.10431450727467335,0.02071389147157959,0.8749716012537471,S-leg-automatisms,no,-1.0,34.9268524646759
0.04713373091842112,0.008185296706541717,0.9446809723750371,R-poor-coordination,no,-1.0,11.460127592086792
0.029067016299644366,0.004274627434582675,0.9666583562657729,syncope,submitted,100.0,3.7179532051086426
