belief_epileptic-seizure,belief_psychogenic-seizure,belief_syncope,queried_feature,observed_feature_value,observed_reward,runtime
0.3333333333333333,0.3333333333333333,0.3333333333333333,S-consciousness-drift,no,-1.0,26.138331413269043
0.3886966551326413,0.1441753171856978,0.4671280276816609,S-triggered-by-stress,yes,-1.0,24.16304922103882
0.537470612749451,0.16484994698425703,0.29767944026629195,S-violent-shaking,yes,-1.0,31.427318572998047
0.719372847630189,0.24466602606118615,0.03596112630862479,epileptic-seizure,submitted,100.0,2.940749406814575
