{
    "R-febrile-seizures": 15,
    "R-poor-coordination": 15,
    "S-chest-pain": 15,
    "S-palpitations": 14,
    "S-brief-jerks": 14,
    "S-onset-during-sleep": 14,
    "S-triggered-by-blood": 13,
    "S-triggered-by-standing": 14,
    "S-triggered-by-stress": 16,
    "S-sensation-of-passivity": 14,
    "S-deja-vu": 11,
    "S-feel-hot-cold": 14,
    "S-olfactory-hallucination": 15,
    "S-visual-auditory-awareness": 15,
    "S-locked-in": 16,
    "S-consciousness-drift": 15,
    "S-aware-of-shaking": 16,
    "S-time-in-slow-motion": 15,
    "S-recall-bad-memories": 14,
    "S-frightened-to-death": 14,
    "S-like-electricity": 13,
    "S-like-hammer-blow": 15,
    "S-like-knife-through-head": 13,
    "S-want-to-know-what-happens": 12,
    "S-postictal-relief": 15,
    "S-oral-automatisms": 16,
    "S-manual-automatisms": 16,
    "S-leg-automatisms": 14,
    "S-rapid-head-turning": 15,
    "S-violent-shaking": 13,
    "S-limp-limbs": 16,
    "S-rigid-limbs": 13,
    "S-shaking-over-1min": 14,
    "S-unusual-positions": 13,
    "S-pallor": 16
}