belief_epileptic-seizure,belief_psychogenic-seizure,belief_syncope,queried_feature,observed_feature_value,observed_reward,runtime
0.3333333333333333,0.3333333333333333,0.3333333333333333,S-visual-auditory-awareness,yes,-1.0,25.444736003875732
0.342053629823414,0.45127534336167424,0.2066710268149117,S-triggered-by-stress,yes,-1.0,23.115893125534058
0.42204850931848337,0.4604301440723734,0.1175213466091433,R-febrile-seizures,no,-1.0,29.372825384140015
0.38851002526629247,0.48362180316979486,0.12786817156391264,S-limp-limbs,no,-1.0,25.161787271499634
0.575446296994304,0.40118697491252336,0.023366728093172515,epileptic-seizure,submitted,-100.0,4.364445209503174
