belief_epileptic-seizure,belief_psychogenic-seizure,belief_syncope,queried_feature,observed_feature_value,observed_reward,runtime
0.3333333333333333,0.3333333333333333,0.3333333333333333,S-deja-vu,no,-1.0,28.177992582321167
0.28535139712108387,0.3073666384419983,0.40728196443691783,S-rigid-limbs,yes,-1.0,30.54875683784485
0.42940138441546627,0.4368341482406597,0.13376446734387404,S-limp-limbs,yes,-1.0,28.204623460769653
0.28695764975369514,0.4979445951704361,0.2150977550758687,S-leg-automatisms,no,-1.0,30.25880241394043
0.2590067920788679,0.3930610338350365,0.34793217408609556,S-like-knife-through-head,yes,-1.0,31.918711185455322
0.15423229941198174,0.7936283736516762,0.052139326936342004,S-oral-automatisms,yes,-1.0,32.483376026153564
0.20462968738581144,0.7920470409768948,0.0033232716372937126,S-palpitations,no,-1.0,34.25765585899353
0.26664702987018485,0.7307923907537736,0.00256057937604148,S-olfactory-hallucination,yes,-1.0,31.834303855895996
0.14196476432381452,0.8580352266479037,9.02828190195761e-09,S-triggered-by-stress,yes,-1.0,30.142629146575928
0.16672790942366092,0.8332720856897947,4.886544349734912e-09,S-unusual-positions,yes,-1.0,32.92134189605713
0.14790929354851723,0.8520907058641602,5.873224468182957e-10,S-recall-bad-memories,no,-1.0,29.028680086135864
0.18702975875699546,0.8129702404028888,8.401157970677051e-10,S-chest-pain,no,-1.0,30.647561073303223
0.2520768532681797,0.7479231456512073,1.0806130178993641e-09,S-time-in-slow-motion,yes,-1.0,31.373920679092407
0.14151003591307243,0.8584899639555951,1.3133244451061176e-10,S-sensation-of-passivity,no,-1.0,26.411860942840576
0.14909220039954996,0.8509077994175841,1.8286604277092573e-10,S-brief-jerks,yes,-1.0,30.513989686965942
0.05381846971754591,0.9461815302680382,1.4415968862586616e-11,psychogenic-seizure,submitted,100.0,4.662122011184692
