belief_epileptic-seizure,belief_psychogenic-seizure,belief_syncope,queried_feature,observed_feature_value,observed_reward,runtime
0.3333333333333333,0.3333333333333333,0.3333333333333333,S-pallor,no,-1.0,28.477238655090332
0.4005736137667304,0.46653919694072654,0.13288718929254303,S-deja-vu,no,-1.0,27.435792446136475
0.36656490293505295,0.45986822635161445,0.1735668707133326,S-palpitations,no,-1.0,27.076538801193237
0.4611969366240108,0.4096791561484492,0.12912390722754008,S-violent-shaking,yes,-1.0,27.157556772232056
0.497441819890862,0.48998782155537146,0.012570358553766465,S-olfactory-hallucination,no,-1.0,10.94427752494812
0.5544398508695537,0.42905757525846117,0.016502573871985175,epileptic-seizure,submitted,-100.0,2.6457037925720215
