belief_epileptic-seizure,belief_psychogenic-seizure,belief_syncope,queried_feature,observed_feature_value,observed_reward,runtime
0.3333333333333333,0.3333333333333333,0.3333333333333333,S-like-electricity,no,-1.0,27.48084831237793
0.30255102040816323,0.2066326530612245,0.49081632653061225,R-poor-coordination,no,-1.0,30.82118010520935
0.2779946529592754,0.16077998305270055,0.561225363988024,S-triggered-by-blood,no,-1.0,26.147305250167847
0.2970313593271534,0.17142524919264396,0.5315433914802027,S-shaking-over-1min,no,-1.0,31.54774832725525
0.17036903108529997,0.06828112188657352,0.7613498470281266,S-limp-limbs,no,-1.0,10.754065990447998
0.5631221206759901,0.12640113255719082,0.310476746766819,S-recall-bad-memories,yes,-1.0,20.915009260177612
0.6081342598940448,0.39186284963923956,2.8904667156005215e-06,epileptic-seizure,submitted,100.0,5.381436824798584
