belief_epileptic-seizure,belief_psychogenic-seizure,belief_syncope,queried_feature,observed_feature_value,observed_reward,runtime
0.3333333333333333,0.3333333333333333,0.3333333333333333,S-want-to-know-what-happens,yes,-1.0,25.751591682434082
0.3107995722941666,0.39586551027682076,0.2933349174290127,S-consciousness-drift,no,-1.0,26.32826828956604
0.3617722239632228,0.22788792892960658,0.41033984710717064,S-aware-of-shaking,no,-1.0,24.697677612304688
0.3357088911932335,0.1610632544012263,0.5032278544055403,S-palpitations,no,-1.0,27.69896364212036
0.42747854638978444,0.19362508353479652,0.378896370075419,S-locked-in,yes,-1.0,28.37971591949463
0.5084209782332733,0.33103857928820657,0.16054044247852034,S-pallor,no,-1.0,25.340341806411743
0.47261998052239307,0.4778721942681496,0.04950782520945746,S-oral-automatisms,yes,-1.0,27.100553035736084
0.49526331750519825,0.5022443553556946,0.002492327139107119,S-frightened-to-death,no,-1.0,28.689507484436035
0.5367442297484485,0.4604010045863095,0.0028547656652420546,S-time-in-slow-motion,no,-1.0,26.613678693771362
0.6022882085366802,0.3934782794455051,0.004233512017814619,S-rapid-head-turning,yes,-1.0,29.078892946243286
0.4780637232619766,0.5215314948363977,0.0004047819016256157,S-triggered-by-stress,yes,-1.0,29.59367084503174
0.4538906717527894,0.5459322131634524,0.00017711508375812166,S-manual-automatisms,yes,-1.0,27.52003765106201
0.43443915179411413,0.5655462778612812,1.457034460477556e-05,S-triggered-by-standing,yes,-1.0,28.657594680786133
0.23036237982329422,0.7695902675221851,4.735265452069637e-05,S-recall-bad-memories,no,-1.0,25.547670364379883
0.22929631426242972,0.7706503673327119,5.3318404858631226e-05,S-olfactory-hallucination,no,-1.0,26.129270315170288
0.2211959695657719,0.7787434476596976,6.058277453053359e-05,S-violent-shaking,yes,-1.0,29.052695512771606
0.1611532576249849,0.8388427585875076,3.983787507517449e-06,S-limp-limbs,no,-1.0,30.186681985855103
0.2046228686777957,0.7953765072366565,6.240855476337339e-07,S-chest-pain,no,-1.0,28.450214385986328
0.22037724600596023,0.7796221125400704,6.414539694723678e-07,S-leg-automatisms,no,-1.0,30.245136260986328
0.19511531448923228,0.8048836677271163,1.017783651338919e-06,S-visual-auditory-awareness,no,-1.0,28.800336122512817
0.21859942274793348,0.7813989421274917,1.6351245747570277e-06,S-like-knife-through-head,no,-1.0,28.841054916381836
0.26741330283357656,0.7325844306846822,2.2664817413755524e-06,S-deja-vu,no,-1.0,28.929889678955078
0.2026540621270623,0.7973434863288621,2.451544075443099e-06,S-triggered-by-blood,no,-1.0,28.79771900177002
0.16038801576434583,0.8396102643804714,1.7198551828002463e-06,S-sensation-of-passivity,no,-1.0,33.97309231758118
0.13216383894289552,0.8678342881080446,1.8729490598985295e-06,R-poor-coordination,no,-1.0,30.968098163604736
0.11884795606857912,0.8811499479592753,2.095972145588482e-06,S-like-electricity,no,-1.0,31.579570531845093
0.1290076155479016,0.8709886935755733,3.6908765250489585e-06,S-unusual-positions,no,-1.0,28.545660734176636
0.1135417061874703,0.8864526045576169,5.68925491290434e-06,S-like-hammer-blow,yes,-1.0,31.73835825920105
0.02580632878515453,0.974193388817538,2.8239730745509647e-07,R-febrile-seizures,no,-1.0,35.6452317237854
0.017054641919274475,0.9829451363135382,2.2176718740568293e-07,S-rigid-limbs,yes,-1.0,31.349534034729004
0.013591116408899628,0.9864088450191177,3.8571982772456637e-08,S-feel-hot-cold,yes,-1.0,27.957701444625854
0.004194004947170833,0.9958059650301917,3.002263740982567e-08,S-postictal-relief,no,-1.0,24.191906690597534
0.004557039096417568,0.9954429311528614,2.9750721033924702e-08,S-shaking-over-1min,no,-1.0,17.472232818603516
0.004919808395008501,0.995080111396542,8.020844953578123e-08,psychogenic-seizure,submitted,-100.0,6.510575294494629
