belief_epileptic-seizure,belief_psychogenic-seizure,belief_syncope,queried_feature,observed_feature_value,observed_reward,runtime
0.3333333333333333,0.3333333333333333,0.3333333333333333,R-febrile-seizures,no,-1.0,24.844523668289185
0.27004575577709633,0.4108062512110269,0.3191479930118768,S-leg-automatisms,no,-1.0,32.07154679298401
0.20442160642290183,0.3626192406237222,0.432959152953376,S-rapid-head-turning,yes,-1.0,33.435792446136475
0.2371215279504085,0.7023820104446276,0.060496461604964066,S-brief-jerks,yes,-1.0,29.230135440826416
0.07563171801690424,0.920154255087566,0.004214026895529742,S-postictal-relief,yes,-1.0,28.487273931503296
0.04482093810796372,0.9524619772050688,0.002717084686967552,psychogenic-seizure,submitted,100.0,2.8069756031036377
