belief_epileptic-seizure,belief_psychogenic-seizure,belief_syncope,queried_feature,observed_feature_value,observed_reward,runtime
0.3333333333333333,0.3333333333333333,0.3333333333333333,R-poor-coordination,no,-1.0,27.040722131729126
0.28522729973373895,0.2415726883660369,0.47320001190022415,S-shaking-over-1min,yes,-1.0,28.09593391418457
0.42705764276766134,0.4238620457822915,0.14908031145004716,S-onset-during-sleep,no,-1.0,27.77025079727173
0.3519104869733259,0.2915911490230752,0.3564983640035989,S-frightened-to-death,no,-1.0,28.288050889968872
0.3386135825145832,0.1779908768065805,0.4833955406788364,S-oral-automatisms,yes,-1.0,27.75711464881897
0.6725677310911409,0.26593155722328476,0.06150071168557444,S-unusual-positions,no,-1.0,26.196603059768677
0.642484025666705,0.2203232771201247,0.13719269721317018,S-chest-pain,no,-1.0,27.225138664245605
0.6641017848892488,0.1554507301396559,0.1804474849710953,S-brief-jerks,no,-1.0,27.578696727752686
0.6437366482818251,0.08464558024830601,0.2716177714698688,S-pallor,no,-1.0,28.957846879959106
0.7463922583907245,0.11430598680162199,0.1393017548076534,S-triggered-by-blood,no,-1.0,29.139819383621216
0.7281208901522443,0.11127107739677133,0.16060803245098437,S-visual-auditory-awareness,no,-1.0,27.900490760803223
0.6574396197686634,0.06529470880044834,0.27726567143088826,S-like-electricity,yes,-1.0,25.781372547149658
0.8349379911491595,0.12122687102949053,0.04383513782134992,S-consciousness-drift,no,-1.0,30.314308881759644
0.8787491477207657,0.04732489968678941,0.07392595259244472,S-rigid-limbs,yes,-1.0,30.47408938407898
0.9299348744796776,0.047299193593686235,0.022765931926636274,S-time-in-slow-motion,no,-1.0,31.227730751037598
0.9326681089766868,0.02709799239853178,0.040233898624781356,S-triggered-by-standing,no,-1.0,28.12751007080078
0.9491555139195129,0.024962221621057417,0.025882264459429653,S-rapid-head-turning,no,-1.0,8.474064350128174
0.9170589833383049,0.017443910314895093,0.06549710634679999,epileptic-seizure,submitted,100.0,4.306365251541138
