belief_epileptic-seizure,belief_psychogenic-seizure,belief_syncope,queried_feature,observed_feature_value,observed_reward,runtime
0.3333333333333333,0.3333333333333333,0.3333333333333333,S-shaking-over-1min,yes,-1.0,25.001788854599
0.4292421193829644,0.5030181086519114,0.06773977196512407,S-consciousness-drift,yes,-1.0,25.788204669952393
0.2639909911049815,0.7117280123492719,0.024280996545746714,psychogenic-seizure,submitted,100.0,4.952563285827637
