belief_epileptic-seizure,belief_psychogenic-seizure,belief_syncope,queried_feature,observed_feature_value,observed_reward,runtime
0.3333333333333333,0.3333333333333333,0.3333333333333333,S-oral-automatisms,no,-1.0,27.038629055023193
0.1326142131979695,0.2569796954314721,0.6104060913705583,R-febrile-seizures,no,-1.0,25.872944831848145
0.03297460239521434,0.14128605716689924,0.8257393404378864,S-rigid-limbs,no,-1.0,28.23235321044922
0.0004611508553089003,0.009923358954614318,0.9896154901900769,S-time-in-slow-motion,no,-1.0,11.846571207046509
1.6430121168537534e-07,4.34591191754079e-05,0.9999563765796129,syncope,submitted,100.0,2.3963303565979004
