belief_epileptic-seizure,belief_psychogenic-seizure,belief_syncope,queried_feature,observed_feature_value,observed_reward,runtime
0.3333333333333333,0.3333333333333333,0.3333333333333333,S-onset-during-sleep,no,-1.0,23.881245613098145
0.3068911647283458,0.19215413990626629,0.500954695365388,R-poor-coordination,no,-1.0,27.35222339630127
0.34232321079615935,0.13613135789728467,0.5215454313065561,S-chest-pain,no,-1.0,25.73953366279602
0.43590378560867493,0.08874293822500205,0.47535327616632295,S-deja-vu,no,-1.0,24.46943688392639
0.42884935990653644,0.07053195421599126,0.5006186858774723,S-violent-shaking,no,-1.0,30.460626363754272
0.26255509050370757,0.024236190266149607,0.7132087192301427,S-limp-limbs,yes,-1.0,30.147329330444336
0.16610270126039456,0.019615164046627432,0.814282134692978,S-like-hammer-blow,no,-1.0,28.870027780532837
0.18791187956415084,0.007434933152108428,0.8046531872837406,S-palpitations,yes,-1.0,32.53008031845093
0.03891045897115547,0.006629284973832609,0.954460256055012,S-brief-jerks,no,-1.0,9.235144853591919
0.044448179952723765,0.0031904615411861496,0.95236135850609,syncope,submitted,100.0,3.0785117149353027
