belief_epileptic-seizure,belief_psychogenic-seizure,belief_syncope,queried_feature,observed_feature_value,observed_reward,runtime
0.3333333333333333,0.3333333333333333,0.3333333333333333,S-like-knife-through-head,no,-1.0,19.656768083572388
0.36929099608525445,0.2122662026968247,0.4184428012179208,S-unusual-positions,no,-1.0,20.314573287963867
0.28287059315706464,0.08105433801747411,0.6360750688254613,S-recall-bad-memories,no,-1.0,22.164358615875244
0.1474523601289343,0.00913486684655114,0.8434127730245145,S-time-in-slow-motion,no,-1.0,18.94299864768982
0.022603643499664948,4.9555084738764375e-05,0.9773468014155964,syncope,submitted,-100.0,4.683374404907227
