belief_epileptic-seizure,belief_psychogenic-seizure,belief_syncope,queried_feature,observed_feature_value,observed_reward,runtime
0.3333333333333333,0.3333333333333333,0.3333333333333333,S-locked-in,yes,-1.0,22.513603925704956
0.410783055198973,0.44287548138639277,0.14634146341463414,S-visual-auditory-awareness,yes,-1.0,28.58569359779358
0.3791280236683174,0.5392652129197116,0.08160676341197098,S-triggered-by-standing,no,-1.0,30.04301142692566
0.4184866387305266,0.5388079378837222,0.04270542338575111,S-unusual-positions,yes,-1.0,27.82771587371826
0.40033157314323425,0.5941335383752112,0.005534888481554498,S-palpitations,yes,-1.0,30.018112659454346
0.10388097186322583,0.8851491761309994,0.010969852005774756,S-time-in-slow-motion,yes,-1.0,30.396551847457886
0.05421488189536841,0.944545662884234,0.0012394552203976131,psychogenic-seizure,submitted,100.0,3.323558807373047
