belief_epileptic-seizure,belief_psychogenic-seizure,belief_syncope,queried_feature,observed_feature_value,observed_reward,runtime
0.3333333333333333,0.3333333333333333,0.3333333333333333,S-violent-shaking,yes,-1.0,25.193776845932007
0.4547231270358306,0.5042345276872965,0.04104234527687296,S-manual-automatisms,yes,-1.0,28.7054705619812
0.5241437386093903,0.4717902171118076,0.004066044278802172,S-rigid-limbs,no,-1.0,26.22470259666443
0.4803993941593944,0.506847357936009,0.012753247904596516,S-like-hammer-blow,yes,-1.0,28.17828607559204
0.20695858031693404,0.7918415443211135,0.001199875361952414,S-deja-vu,no,-1.0,26.864598751068115
0.19494888324794515,0.8034379152179822,0.0016132015340726861,S-like-electricity,yes,-1.0,29.398001670837402
0.14233392246548138,0.8575561097489014,0.00010996778561729839,R-poor-coordination,no,-1.0,29.464660167694092
0.16385207611427818,0.8359903843796382,0.00015753950608370256,S-limp-limbs,no,-1.0,28.27174472808838
0.25922663114642797,0.7407426185061405,3.0750347431575915e-05,S-locked-in,yes,-1.0,30.233628273010254
0.24505029478106857,0.754939349493828,1.0355725103260958e-05,S-triggered-by-stress,yes,-1.0,32.57674765586853
0.2818886832718881,0.7181058267334796,5.48999463232914e-06,S-chest-pain,no,-1.0,30.830746173858643
0.36510959264278586,0.6348836211625833,6.786194630906496e-06,S-palpitations,yes,-1.0,32.385103702545166
0.09104366376228824,0.9089434112979814,1.2924939730457392e-05,S-leg-automatisms,no,-1.0,26.65748143196106
0.10275981608690711,0.8972140401869554,2.6143726137506695e-05,S-oral-automatisms,yes,-1.0,29.800272703170776
0.13214035287643547,0.8678580320706994,1.6150528651715888e-06,S-brief-jerks,no,-1.0,29.387888431549072
0.213248021257103,0.7867489432353635,3.035507533580809e-06,S-onset-during-sleep,yes,-1.0,29.35874104499817
0.1933480400092037,0.8066517725623623,1.874284340312342e-07,S-frightened-to-death,no,-1.0,30.854821920394897
0.2742237319448151,0.7257759871013686,2.8095381653408096e-07,S-recall-bad-memories,no,-1.0,29.418155431747437
0.33367042303740774,0.6663291902441251,3.867184672524595e-07,S-like-knife-through-head,yes,-1.0,29.613574504852295
0.1286806379587779,0.8713193245096242,3.753159786970323e-08,S-postictal-relief,yes,-1.0,28.26984691619873
0.10131464195334398,0.8986853258963612,3.215029472142103e-08,S-triggered-by-blood,no,-1.0,29.174017667770386
0.10150832394013762,0.8984916475069789,2.8552883551518438e-08,S-consciousness-drift,no,-1.0,29.175386428833008
0.2334722784811099,0.7665276425949493,7.892394062336328e-08,S-aware-of-shaking,no,-1.0,30.276111125946045
0.347773794181222,0.6522260504500362,1.5536874177708444e-07,S-pallor,no,-1.0,30.44440984725952
0.3140433268511178,0.6859566266055854,4.6543296752523966e-08,S-time-in-slow-motion,no,-1.0,31.562958240509033
0.44489595056391057,0.555103962295723,8.714036627007364e-08,S-want-to-know-what-happens,yes,-1.0,35.01392197608948
0.45622254306438986,0.5437773725980526,8.433755754890549e-08,R-febrile-seizures,no,-1.0,37.89540076255798
0.4228662513997574,0.5771336557105209,9.288972176342946e-08,S-triggered-by-standing,no,-1.0,39.173890113830566
0.44734627178885333,0.5526536816236229,4.6587523726654395e-08,S-unusual-positions,yes,-1.0,38.80299091339111
0.412535061603595,0.5874649325757177,5.820687273047406e-09,S-visual-auditory-awareness,no,-1.0,35.84318399429321
0.5193525315450497,0.4806474579471122,1.0507838198601728e-08,S-feel-hot-cold,yes,-1.0,31.55785059928894
0.3057401238121515,0.6942598605849016,1.5602946952767263e-08,S-olfactory-hallucination,no,-1.0,26.35782217979431
0.35919915048163914,0.6408008279269326,2.159142823980816e-08,S-sensation-of-passivity,no,-1.0,20.091020822525024
0.3733723599190352,0.6266276104202515,2.9660713285113257e-08,S-rapid-head-turning,no,-1.0,13.808535099029541
0.4517000122073035,0.5482999173054184,7.048727806276153e-08,S-shaking-over-1min,yes,-1.0,6.983721971511841
0.412798316254237,0.5872016735800005,1.0165762399148633e-08,epileptic-seizure,submitted,-100.0,0.0193173885345459
