belief_epileptic-seizure,belief_psychogenic-seizure,belief_syncope,queried_feature,observed_feature_value,observed_reward,runtime
0.3333333333333333,0.3333333333333333,0.3333333333333333,S-triggered-by-blood,no,-1.0,27.579543113708496
0.3108568914310857,0.4135958640413597,0.27554724452755475,S-shaking-over-1min,no,-1.0,28.65389323234558
0.2249458563177579,0.2771213139087999,0.4979328297734423,R-febrile-seizures,no,-1.0,32.99131727218628
0.1821281313390021,0.3413579046268951,0.4765139640341029,S-want-to-know-what-happens,yes,-1.0,28.096566677093506
0.17074728274322895,0.40761859385747956,0.42163412339929146,S-visual-auditory-awareness,yes,-1.0,28.096079111099243
0.14944586913539398,0.6275816533643426,0.22297247750026344,S-frightened-to-death,yes,-1.0,28.406644105911255
0.05745044989414823,0.8799868835549878,0.06256266655086401,S-feel-hot-cold,yes,-1.0,29.57704472541809
0.018567669799300968,0.9304309073769469,0.05100142282375224,S-chest-pain,no,-1.0,32.59840750694275
0.0203137355278475,0.9264357913502433,0.0532504731219092,S-unusual-positions,no,-1.0,26.75191569328308
0.017143921133472705,0.9041461271668972,0.07870995169963008,S-like-hammer-blow,no,-1.0,26.16786789894104
0.026482805127031262,0.8319122252306644,0.14160496964230432,R-poor-coordination,yes,-1.0,28.187336206436157
0.015571459260803057,0.9687276944138286,0.015700846325368292,psychogenic-seizure,submitted,-100.0,3.5874743461608887
