belief_epileptic-seizure,belief_psychogenic-seizure,belief_syncope,queried_feature,observed_feature_value,observed_reward,runtime
0.3333333333333333,0.3333333333333333,0.3333333333333333,S-brief-jerks,no,-1.0,22.274109601974487
0.4357689264046426,0.18359271959905038,0.380638353996307,S-oral-automatisms,yes,-1.0,32.48140907287598
0.7879248514047023,0.1872775592836071,0.024797589311690595,R-febrile-seizures,no,-1.0,27.427665948867798
0.812146110637871,0.16519566183944992,0.0226582275226792,S-violent-shaking,no,-1.0,32.09135675430298
0.8481155930480886,0.09682383429310737,0.05506057265880401,S-leg-automatisms,yes,-1.0,27.847156524658203
0.9097667260544334,0.09023317372549264,1.0022007394318906e-07,S-sensation-of-passivity,yes,-1.0,29.096966981887817
0.9215542050595044,0.07844577845680789,1.6483687746451467e-08,S-aware-of-shaking,no,-1.0,29.158610105514526
0.964814574309134,0.035185408585515825,1.71053501289087e-08,epileptic-seizure,submitted,100.0,4.23374605178833
