belief_epileptic-seizure,belief_psychogenic-seizure,belief_syncope,queried_feature,observed_feature_value,observed_reward,runtime
0.3333333333333333,0.3333333333333333,0.3333333333333333,S-like-electricity,yes,-1.0,24.72759747505188
0.32866756393001345,0.6406460296096904,0.030686406460296096,S-shaking-over-1min,no,-1.0,32.01919436454773
0.3291648964663723,0.5940883713940958,0.0767467321395319,R-poor-coordination,no,-1.0,29.73750400543213
0.3004808222430962,0.6123338094898254,0.08718536826707833,S-chest-pain,no,-1.0,33.49983239173889
0.31932623397027654,0.592249750077888,0.08842401595183529,S-leg-automatisms,no,-1.0,31.284510612487793
0.2733030165229779,0.5910702106073156,0.1356267728697065,S-feel-hot-cold,yes,-1.0,30.560839414596558
0.10721665500106282,0.7585790769589186,0.13420426804001875,S-sensation-of-passivity,no,-1.0,29.636213779449463
0.08673777300340482,0.7697774929460305,0.1434847340505647,S-onset-during-sleep,yes,-1.0,27.73393988609314
0.06899538070927788,0.9232320099041527,0.0077726093865695175,S-locked-in,no,-1.0,29.29444646835327
0.060222712194993464,0.9252286632186866,0.014548624586319999,S-recall-bad-memories,yes,-1.0,25.62721037864685
0.016721028499355334,0.9832789366776092,3.482303543590798e-08,psychogenic-seizure,submitted,-100.0,4.3036110401153564
