belief_epileptic-seizure,belief_psychogenic-seizure,belief_syncope,queried_feature,observed_feature_value,observed_reward,runtime
0.3333333333333333,0.3333333333333333,0.3333333333333333,S-leg-automatisms,no,-1.0,20.52621817588806
0.27272740602512513,0.23851429057394455,0.4887583034009303,S-feel-hot-cold,no,-1.0,18.435035467147827
0.493793146880237,0.17420093403243733,0.33200591908732574,S-like-hammer-blow,no,-1.0,19.513132572174072
0.5152886837300228,0.08120866008914587,0.40350265618083125,S-want-to-know-what-happens,yes,-1.0,21.812633514404297
0.5292100442500485,0.07967247978883044,0.3911174759611212,S-limp-limbs,no,-1.0,22.41135883331299
0.8507016198075465,0.07172918543618874,0.07756919475626468,S-consciousness-drift,yes,-1.0,18.94418954849243
0.8018438379874104,0.1555435829226164,0.04261257908997322,S-palpitations,no,-1.0,20.000481128692627
0.8555959043025422,0.11751841642146768,0.026885679275990147,S-frightened-to-death,no,-1.0,19.4659206867218
0.8925817864303288,0.07777436858361049,0.02964384498606064,S-time-in-slow-motion,yes,-1.0,18.62192130088806
0.8436319654833913,0.15030224829340436,0.00606578622320431,S-olfactory-hallucination,no,-1.0,20.251622438430786
0.8707483210269916,0.12187741644575249,0.0073742625272558955,S-oral-automatisms,no,-1.0,19.958190441131592
0.7632351686600569,0.2070130407471963,0.029751790592746793,S-triggered-by-blood,no,-1.0,18.577058792114258
0.7661611132872654,0.2073654445712363,0.026473442141498337,S-manual-automatisms,no,-1.0,19.266371488571167
0.6528247727515069,0.2680134996945727,0.07916172755392051,R-febrile-seizures,no,-1.0,21.79340958595276
0.6204340616673456,0.2906417098008833,0.08892422853177108,S-triggered-by-standing,yes,-1.0,21.208308696746826
0.35970096931230283,0.3243201990326943,0.3159788316550028,S-pallor,no,-1.0,21.72952175140381
0.42706996018454507,0.4484739412655245,0.12445609854993044,S-triggered-by-stress,yes,-1.0,22.11337375640869
0.49933891269095165,0.4335983055373785,0.06706278177166981,R-poor-coordination,no,-1.0,20.130414724349976
0.5246710908440848,0.38716957970494786,0.0881593294509674,S-chest-pain,no,-1.0,22.96216130256653
0.6009397594444682,0.30269489777656355,0.09636534277896829,S-sensation-of-passivity,no,-1.0,21.664304971694946
0.5931938422450796,0.281093235590665,0.1257129221642553,S-rigid-limbs,yes,-1.0,20.819920301437378
0.6694373084169238,0.29959881351853873,0.030963878064537403,S-like-knife-through-head,no,-1.0,21.941280603408813
0.7635615634403476,0.1964202986542777,0.04001813790537465,S-locked-in,yes,-1.0,22.84207510948181
0.7715987992193675,0.21399467588390023,0.014406524896732206,S-visual-auditory-awareness,yes,-1.0,23.59207797050476
0.7261224836080946,0.2656860251894273,0.008191491202478052,S-recall-bad-memories,no,-1.0,30.41287326812744
0.7758915959757278,0.21420689395896222,0.009901510065310065,S-brief-jerks,no,-1.0,26.883365392684937
0.8547389802655571,0.1325573580175233,0.012703661716919626,S-violent-shaking,yes,-1.0,26.02653193473816
0.8522876958194145,0.14656898693145404,0.0011433172491313688,S-rapid-head-turning,yes,-1.0,26.626803398132324
0.822681875657856,0.17718518567287672,0.00013293866926728548,S-unusual-positions,yes,-1.0,26.846363306045532
0.8011008948885839,0.19888156654018238,1.75385712336399e-05,S-postictal-relief,yes,-1.0,24.668509483337402
0.7545775453466059,0.24540448085910557,1.7973794288472765e-05,S-aware-of-shaking,no,-1.0,21.58626699447632
0.8433078842758551,0.15666556872683252,2.65469973125051e-05,S-deja-vu,no,-1.0,18.25962233543396
0.8332272499144446,0.16673531249541598,3.743759013941562e-05,S-shaking-over-1min,no,-1.0,13.792905807495117
0.8779045578981471,0.12199693922480295,9.850287704997477e-05,S-like-electricity,yes,-1.0,9.25614070892334
0.8311419450990059,0.16884934795201928,8.706948974884772e-06,S-onset-during-sleep,yes,-1.0,4.6685357093811035
0.8131855907029084,0.18681382916101802,5.801360735525041e-07,epileptic-seizure,submitted,100.0,0.012851953506469727
