belief_epileptic-seizure,belief_psychogenic-seizure,belief_syncope,queried_feature,observed_feature_value,observed_reward,runtime
0.3333333333333333,0.3333333333333333,0.3333333333333333,S-rapid-head-turning,no,-1.0,30.11078119277954
0.2545357524012807,0.2454642475987193,0.5000000000000001,S-chest-pain,no,-1.0,23.595847368240356
0.2664977795509123,0.23390087918435984,0.4996013412647278,S-onset-during-sleep,no,-1.0,28.364120721817017
0.16509326190746668,0.16129111388820147,0.6736156242043319,S-palpitations,no,-1.0,26.720269680023193
0.23068275631905258,0.21276975450038565,0.5565474891805618,S-sensation-of-passivity,no,-1.0,27.026084423065186
0.18707666222881478,0.2164375995339085,0.5964857382372766,S-limp-limbs,yes,-1.0,25.728453397750854
0.08846839725730761,0.2327823603633219,0.6787492423793705,S-unusual-positions,no,-1.0,25.237489700317383
0.05720861400371518,0.1740709379584555,0.7687204480378294,S-frightened-to-death,no,-1.0,26.108959913253784
0.05625749266574526,0.14478887435609486,0.7989536329781598,S-pallor,yes,-1.0,27.293055534362793
0.039888354282805266,0.12062393813598292,0.8394877075812118,S-visual-auditory-awareness,yes,-1.0,25.19801354408264
0.05253308251480561,0.2794514761883775,0.6680154412968168,S-locked-in,no,-1.0,23.5818772315979
0.029089587080161714,0.17766791650736705,0.7932424964124712,S-triggered-by-standing,yes,-1.0,25.892097234725952
0.005440510228173943,0.08527464164350426,0.9092848481283218,S-feel-hot-cold,yes,-1.0,28.552597045898438
0.002110412241027535,0.10821601284003664,0.8896735749189358,S-manual-automatisms,no,-1.0,28.010125398635864
0.0006312623232134115,0.06546611952371786,0.9339026181530687,S-rigid-limbs,yes,-1.0,10.126540422439575
0.0022003020344400805,0.2873453562542139,0.710454341711346,S-brief-jerks,no,-1.0,17.14265465736389
0.0021058558771826614,0.20598101679241962,0.7919131273303978,S-postictal-relief,yes,-1.0,26.191791772842407
0.0017211911461131857,0.29406117492821193,0.7042176339256749,S-consciousness-drift,no,-1.0,25.68416118621826
0.0017325096316524063,0.14638719569386363,0.8518802946744839,R-febrile-seizures,no,-1.0,32.154494285583496
0.0014070112613390011,0.18086977873984006,0.817723209998821,S-like-hammer-blow,no,-1.0,27.119356155395508
0.0013254921305647087,0.10149172709511839,0.897182780774317,S-time-in-slow-motion,yes,-1.0,25.906097650527954
0.0028067542295779446,0.5858960747739337,0.4112971709964883,S-deja-vu,no,-1.0,25.34931993484497
0.0019609604672648894,0.5878959953860262,0.41014304414670893,S-triggered-by-stress,no,-1.0,25.893308877944946
0.0004193835204367193,0.45064942488462717,0.5489311915949362,S-oral-automatisms,no,-1.0,31.80889320373535
0.00011360985480564173,0.31542124288714124,0.6844651472580532,S-aware-of-shaking,no,-1.0,32.154582023620605
9.92290756281458e-05,0.20982701588021668,0.7900737550441551,S-like-electricity,no,-1.0,43.670164585113525
6.737089312834542e-05,0.1297280319912123,0.8702045971156593,S-triggered-by-blood,yes,-1.0,49.822632789611816
2.5379071491195717e-05,0.06740610732590274,0.9325685136026061,S-violent-shaking,no,-1.0,16.85914659500122
8.571938722037817e-06,0.022716572698298364,0.9772748553629796,S-shaking-over-1min,no,-1.0,14.927548170089722
3.4823834082373554e-06,0.008545088808983073,0.9914514288076087,syncope,submitted,100.0,7.363199234008789
