belief_epileptic-seizure,belief_psychogenic-seizure,belief_syncope,queried_feature,observed_feature_value,observed_reward,runtime
0.3333333333333333,0.3333333333333333,0.3333333333333333,S-feel-hot-cold,yes,-1.0,28.444803714752197
0.16733755031627373,0.41058079355951704,0.42208165612420934,S-aware-of-shaking,no,-1.0,25.57601046562195
0.1743668059162626,0.2443868439979143,0.5812463500858233,S-triggered-by-blood,no,-1.0,26.093138694763184
0.1867965355474937,0.261252093262072,0.5519513711904342,S-violent-shaking,no,-1.0,27.348693132400513
0.08917092214123915,0.0933288072714615,0.8175002705872992,syncope,submitted,100.0,3.685598134994507
