belief_epileptic-seizure,belief_psychogenic-seizure,belief_syncope,queried_feature,observed_feature_value,observed_reward,runtime
0.3333333333333333,0.3333333333333333,0.3333333333333333,S-brief-jerks,yes,-1.0,24.87572169303894
0.23262032085561496,0.716577540106952,0.05080213903743316,S-unusual-positions,yes,-1.0,26.600798845291138
0.21832164058283862,0.7752185644900162,0.00645979492714517,S-postictal-relief,no,-1.0,22.95613121986389
0.28760068049925347,0.7046385159096815,0.007760803591065061,S-violent-shaking,no,-1.0,23.89002823829651
0.3427931154927858,0.6285069092503847,0.02869997525682969,S-like-knife-through-head,yes,-1.0,27.618315935134888
0.13816108631332927,0.8589279162717925,0.0029109974148782544,psychogenic-seizure,submitted,100.0,4.091301918029785
