belief_epileptic-seizure,belief_psychogenic-seizure,belief_syncope,queried_feature,observed_feature_value,observed_reward,runtime
0.3333333333333333,0.3333333333333333,0.3333333333333333,S-oral-automatisms,yes,-1.0,17.391206979751587
0.5554775280898877,0.41783707865168535,0.02668539325842697,S-like-knife-through-head,no,-1.0,18.557411670684814
0.6725846916547736,0.2908034752998322,0.036611833045394226,S-time-in-slow-motion,yes,-1.0,18.035412788391113
0.5274722552764907,0.4663115919957407,0.0062161527277686405,S-manual-automatisms,yes,-1.0,16.79627561569214
0.5818606009473117,0.4175500432262761,0.0005893558264121523,S-deja-vu,no,-1.0,18.48905634880066
0.5635637295864179,0.43562153453786484,0.0008147358757173241,S-olfactory-hallucination,yes,-1.0,18.459372758865356
0.36973448057400615,0.6302655158861279,3.539865917139577e-09,S-recall-bad-memories,no,-1.0,17.437256574630737
0.43740781055624667,0.5625921847064553,4.737297868257299e-09,S-chest-pain,no,-1.0,19.43217921257019
0.5324970002271516,0.46750299426895386,5.5038946641256834e-09,S-triggered-by-standing,no,-1.0,19.710954666137695
0.5571962507292652,0.44280374654035987,2.7303750204296173e-09,S-want-to-know-what-happens,yes,-1.0,18.233364582061768
0.5684540837555898,0.43154591361539646,2.629013750649731e-09,S-like-hammer-blow,no,-1.0,20.058699131011963
0.7467483797899094,0.2532516161878616,4.0222288854388565e-09,S-onset-during-sleep,yes,-1.0,19.365955114364624
0.7228009156442912,0.27719908409057764,2.6513104482466645e-10,S-sensation-of-passivity,no,-1.0,17.33380937576294
0.7348680517403577,0.2651319479034006,3.562415829055377e-10,S-leg-automatisms,yes,-1.0,15.891980171203613
0.705254945166627,0.2947450548333723,7.734978584906778e-16,S-palpitations,no,-1.0,21.184337615966797
0.7716521653837609,0.22834783461623862,5.004248264084223e-16,S-pallor,yes,-1.0,6.417349100112915
0.7931617293677719,0.2068382706322273,7.622651031877561e-16,epileptic-seizure,submitted,100.0,2.844538927078247
