belief_epileptic-seizure,belief_psychogenic-seizure,belief_syncope,queried_feature,observed_feature_value,observed_reward,runtime
0.3333333333333333,0.3333333333333333,0.3333333333333333,S-sensation-of-passivity,yes,-1.0,16.576654195785522
0.42358078602620075,0.48471615720524014,0.09170305676855894,S-time-in-slow-motion,no,-1.0,17.160803079605103
0.5524986618164361,0.4132782097501592,0.034223128433404686,S-consciousness-drift,no,-1.0,20.823529958724976
0.824979398160301,0.17121656092951404,0.0038040409101848874,R-febrile-seizures,no,-1.0,19.65848159790039
0.9531313584296147,0.04684468841420898,2.3953156176218336e-05,epileptic-seizure,submitted,100.0,2.2220351696014404
