belief_epileptic-seizure,belief_psychogenic-seizure,belief_syncope,queried_feature,observed_feature_value,observed_reward,runtime
0.3333333333333333,0.3333333333333333,0.3333333333333333,S-triggered-by-stress,yes,-1.0,27.248377323150635
0.4096040945356014,0.338702393496914,0.25169351196748463,S-shaking-over-1min,no,-1.0,26.369102239608765
0.2762256863907706,0.1586191234787133,0.5651551901305161,S-aware-of-shaking,no,-1.0,26.707717418670654
0.2027051818777942,0.0664913457971415,0.7308034723250643,S-oral-automatisms,yes,-1.0,28.138050317764282
0.6767404716486469,0.16697940308691656,0.15628012526443644,S-time-in-slow-motion,no,-1.0,27.660717725753784
0.6460493701150655,0.09105740091484682,0.26289322897008777,S-locked-in,no,-1.0,26.583599090576172
0.43766136934366,0.05311864039083617,0.5092199902655038,S-brief-jerks,no,-1.0,26.113945245742798
0.3478332786896745,0.02371470896918957,0.6284520123411358,S-pallor,yes,-1.0,24.708503246307373
0.2159794848810333,0.012976363372974222,0.7710441517459925,S-sensation-of-passivity,no,-1.0,27.332465887069702
0.1361058944270568,0.007693022985429628,0.8562010825875136,S-triggered-by-blood,no,-1.0,24.69331932067871
0.11776803607059419,0.006642391660620644,0.8755895722687852,S-chest-pain,no,-1.0,28.091237545013428
0.09524586826228411,0.003666935426757373,0.9010871963109586,S-rapid-head-turning,no,-1.0,32.84400653839111
0.038749678465637725,0.0010790111594851316,0.9601713103748771,R-febrile-seizures,yes,-1.0,12.239727258682251
0.993681227802346,0.006222981958311433,9.57902393426632e-05,epileptic-seizure,submitted,100.0,5.090153694152832
