belief_epileptic-seizure,belief_psychogenic-seizure,belief_syncope,queried_feature,observed_feature_value,observed_reward,runtime
0.3333333333333333,0.3333333333333333,0.3333333333333333,S-leg-automatisms,no,-1.0,17.539782524108887
0.2727274060251252,0.23851429057394455,0.48875830340093035,S-olfactory-hallucination,no,-1.0,19.239195585250854
0.1857437008607948,0.11161009665238442,0.7026462024868207,S-palpitations,no,-1.0,18.32598567008972
0.10291033961230348,0.02630950772650713,0.8707801526611894,S-triggered-by-stress,yes,-1.0,17.700578451156616
0.029368095785575275,0.001587220213896925,0.9690446840005278,syncope,submitted,-100.0,2.9631757736206055
