belief_epileptic-seizure,belief_psychogenic-seizure,belief_syncope,queried_feature,observed_feature_value,observed_reward,runtime
0.3333333333333333,0.3333333333333333,0.3333333333333333,R-poor-coordination,no,-1.0,18.754703283309937
0.3234969952321205,0.2739851300682296,0.40251787469964995,S-postictal-relief,no,-1.0,16.824214696884155
0.34400685145372856,0.17026667966062234,0.4857264688856491,S-chest-pain,no,-1.0,16.760141372680664
0.32574716898264383,0.05447106537245978,0.6197817656448963,R-febrile-seizures,no,-1.0,17.149179697036743
0.18748767288333693,0.006003052504172251,0.8065092746124908,S-shaking-over-1min,no,-1.0,19.578881978988647
0.021181895296356907,1.507999408907884e-05,0.978803024709554,S-palpitations,no,-1.0,8.245073795318604
0.0007913906287593572,2.8401321176270644e-10,0.9992086090872275,syncope,submitted,-100.0,1.7364308834075928
