belief_epileptic-seizure,belief_psychogenic-seizure,belief_syncope,queried_feature,observed_feature_value,observed_reward,runtime
0.3333333333333333,0.3333333333333333,0.3333333333333333,S-sensation-of-passivity,no,-1.0,26.951037168502808
0.37081589958158995,0.2616370292887029,0.36754707112970714,S-unusual-positions,yes,-1.0,28.78775453567505
0.5845577833932689,0.3565672157340433,0.05887500087268766,S-locked-in,yes,-1.0,29.25896716117859
0.6578365151153918,0.32446086304858596,0.017702621836022312,S-palpitations,yes,-1.0,27.10090446472168
0.30506453926060756,0.6479083454146192,0.04702711532477327,S-onset-during-sleep,yes,-1.0,26.876224517822266
0.35598067895358976,0.6412165107798504,0.0028028102665596773,S-feel-hot-cold,yes,-1.0,31.170806884765625
0.2309682870591503,0.7655915108110342,0.0034402021298155006,S-triggered-by-stress,yes,-1.0,30.04596757888794
0.3267066866194439,0.6716113370181304,0.001681976362425827,S-like-electricity,yes,-1.0,28.296304941177368
0.3072849796287795,0.6926042423386259,0.00011077803259453737,S-shaking-over-1min,yes,-1.0,27.741146087646484
0.33545212701316657,0.6645335594971622,1.4313489671240007e-05,S-limp-limbs,yes,-1.0,30.86640477180481
0.2829354427074478,0.717042769945909,2.1787346643338986e-05,S-violent-shaking,yes,-1.0,28.189854621887207
0.32178299623504353,0.6782153264042284,1.6773607280397206e-06,R-febrile-seizures,no,-1.0,30.05833148956299
0.3566689823701469,0.6433293694833166,1.6481465364611563e-06,S-oral-automatisms,no,-1.0,29.871927499771118
0.2761329024118032,0.7238626926614907,4.4049267060509415e-06,S-triggered-by-blood,no,-1.0,30.721855878829956
0.33762023030489513,0.6623761891773908,3.580517713918977e-06,S-triggered-by-standing,no,-1.0,31.625633478164673
0.4288331668309447,0.5711652161014983,1.6170675568889905e-06,S-chest-pain,yes,-1.0,31.453749179840088
0.1398878138571011,0.8601114972141255,6.88928773264468e-07,S-consciousness-drift,yes,-1.0,30.428049325942993
0.08613907855790395,0.9138607360070031,1.8543509298953942e-07,S-want-to-know-what-happens,yes,-1.0,28.444671869277954
0.11626580344194377,0.8837340193888189,1.7716923724489343e-07,S-frightened-to-death,yes,-1.0,29.105995893478394
0.0602586984583249,0.9397412512759674,5.026570769646049e-08,S-aware-of-shaking,yes,-1.0,11.179730415344238
0.040136162226521235,0.9598638323372627,5.436216215429462e-09,psychogenic-seizure,submitted,100.0,4.7798731327056885
