belief_epileptic-seizure,belief_psychogenic-seizure,belief_syncope,queried_feature,observed_feature_value,observed_reward,runtime
0.3333333333333333,0.3333333333333333,0.3333333333333333,S-shaking-over-1min,yes,-1.0,18.992030143737793
0.500684529630354,0.44005476237042823,0.059260707999217684,S-leg-automatisms,no,-1.0,18.07597041130066
0.5761789470668982,0.33215961225189744,0.0916614406812044,S-rapid-head-turning,yes,-1.0,17.062824010849
0.6427304234020397,0.34803199527152984,0.009237581326430395,R-febrile-seizures,no,-1.0,18.973567724227905
0.6774432259740986,0.31392560897038035,0.008631165055521098,S-oral-automatisms,yes,-1.0,19.658679008483887
0.7924626319722055,0.20717358395037522,0.00036378407741920134,R-poor-coordination,no,-1.0,20.44189953804016
0.856857488721515,0.14277342343266425,0.00036908784582064756,S-want-to-know-what-happens,yes,-1.0,22.556979179382324
0.8931090664352181,0.1066186193832227,0.00027231418155908093,S-time-in-slow-motion,no,-1.0,18.4972825050354
0.9510705770850815,0.048641992232286865,0.00028743068263163436,S-violent-shaking,yes,-1.0,8.53655457496643
0.9591816806763973,0.04079869622229958,1.9623101303085574e-05,epileptic-seizure,submitted,100.0,2.1303133964538574
