belief_epileptic-seizure,belief_psychogenic-seizure,belief_syncope,queried_feature,observed_feature_value,observed_reward,runtime
0.3333333333333333,0.3333333333333333,0.3333333333333333,S-visual-auditory-awareness,yes,-1.0,26.415266752243042
0.40939334637964786,0.40508806262230923,0.18551859099804305,S-like-knife-through-head,no,-1.0,24.447426319122314
0.5519788918205806,0.23545316389606272,0.21256794428335674,S-postictal-relief,yes,-1.0,28.065809965133667
0.5769208727486085,0.2417858445311851,0.1812932827202063,S-aware-of-shaking,no,-1.0,30.599015951156616
0.6706807081098101,0.12042051634882374,0.20889877554136618,S-onset-during-sleep,no,-1.0,30.443167448043823
0.616958274325296,0.06935947931675258,0.31368224635795133,S-deja-vu,no,-1.0,27.481438398361206
0.6115884064068827,0.05554529309466266,0.3328663004984546,S-time-in-slow-motion,yes,-1.0,28.759934902191162
0.8145657447627423,0.1134486680415281,0.07198558719572956,S-sensation-of-passivity,no,-1.0,29.693260192871094
0.8432681660617958,0.08286665847024678,0.07386517546795744,S-oral-automatisms,yes,-1.0,31.692622423171997
0.9446482414425371,0.05237041156853917,0.0029813469889235387,S-rigid-limbs,yes,-1.0,14.50543475151062
0.9617364049054892,0.037766749008930574,0.0004968460855801838,epileptic-seizure,submitted,100.0,3.5813872814178467
