belief_epileptic-seizure,belief_psychogenic-seizure,belief_syncope,queried_feature,observed_feature_value,observed_reward,runtime
0.3333333333333333,0.3333333333333333,0.3333333333333333,S-visual-auditory-awareness,yes,-1.0,24.71695852279663
0.297328027288232,0.5230244457077885,0.17964752700397954,S-feel-hot-cold,yes,-1.0,27.22288155555725
0.12079030014039939,0.6951237998788866,0.18408589998071392,S-triggered-by-stress,yes,-1.0,23.212229013442993
0.1242664015468634,0.78845431305381,0.0872792853993267,S-chest-pain,no,-1.0,27.009845972061157
0.13432029067167525,0.7756454344277558,0.09003427490056891,S-consciousness-drift,no,-1.0,29.499818086624146
0.21452638545280964,0.6126623349076894,0.1728112796395009,S-triggered-by-blood,no,-1.0,28.380005359649658
0.1813628909007057,0.6891354378451428,0.1295016712541515,S-sensation-of-passivity,no,-1.0,28.871234893798828
0.14903363392884073,0.7103277480484119,0.14063861802274724,S-postictal-relief,yes,-1.0,31.100154399871826
0.09660231621693248,0.8042147994171691,0.09918288436589838,S-deja-vu,no,-1.0,32.59031677246094
0.06933939950375374,0.8290487299666786,0.10161187052956766,S-violent-shaking,no,-1.0,28.529412746429443
0.057219036162427836,0.6826227418277244,0.26015822200984773,R-febrile-seizures,no,-1.0,33.723570823669434
0.040775956824384105,0.7400914312815642,0.21913261189405178,S-want-to-know-what-happens,yes,-1.0,24.788235902786255
0.03425832413511777,0.7919806712212998,0.17376100464358257,S-olfactory-hallucination,no,-1.0,31.49230170249939
0.03206120777021262,0.7763994645091479,0.19153932772063953,S-frightened-to-death,no,-1.0,25.83996558189392
0.03597485293767087,0.7368758988043785,0.2271492482579506,S-triggered-by-standing,yes,-1.0,26.15828824043274
0.010838310769257497,0.5697256117853932,0.41943607744534933,S-recall-bad-memories,no,-1.0,28.48971128463745
0.010239544134599298,0.5414982678112458,0.44826218805415496,S-leg-automatisms,no,-1.0,27.962105751037598
0.00708618726634393,0.4369718238581746,0.5559419888754814,R-poor-coordination,no,-1.0,28.81225085258484
0.00591622879247564,0.41337711786627995,0.5807066533412444,S-like-electricity,no,-1.0,30.420820236206055
0.004467086566664856,0.2842267226677323,0.7113061907656028,S-like-knife-through-head,no,-1.0,26.189321756362915
0.00434425037378327,0.21183916418691412,0.7838165854393027,S-rigid-limbs,no,-1.0,30.474363088607788
0.0014395715378182079,0.10970832944404704,0.8888520990181348,S-aware-of-shaking,no,-1.0,33.93377113342285
0.0011428016350461944,0.06633224989637183,0.932524948468582,S-rapid-head-turning,no,-1.0,30.811068296432495
0.0006024491602987826,0.03372203161124041,0.9656755192284608,S-shaking-over-1min,no,-1.0,26.06241250038147
0.0002465685931369382,0.012779307766999596,0.9869741236398636,S-palpitations,no,-1.0,21.790345907211304
0.0004137720824559914,0.020246242071632208,0.9793399858459118,S-onset-during-sleep,no,-1.0,20.216559171676636
0.00019205417831424723,0.010460437128144165,0.9893475086935415,S-manual-automatisms,no,-1.0,15.621195077896118
5.497742775740882e-05,0.0060560993124312654,0.9938889232598114,syncope,submitted,100.0,6.29632568359375
