belief_epileptic-seizure,belief_psychogenic-seizure,belief_syncope,queried_feature,observed_feature_value,observed_reward,runtime
0.3333333333333333,0.3333333333333333,0.3333333333333333,S-onset-during-sleep,yes,-1.0,27.627842903137207
0.3882189239332096,0.585343228200371,0.026437847866419287,S-rapid-head-turning,yes,-1.0,22.50779390335083
0.2836114118967724,0.714062040408028,0.0023265476951995754,S-limp-limbs,yes,-1.0,29.804168701171875
0.14823890898177533,0.8488349771996794,0.002926113818545227,S-visual-auditory-awareness,yes,-1.0,30.606486558914185
0.09021479296719577,0.9087092568698361,0.0010759501629683166,S-aware-of-shaking,no,-1.0,25.873857021331787
0.11510769132031462,0.8830779961573536,0.0018143125223319065,S-oral-automatisms,yes,-1.0,27.62997341156006
0.11500673866754116,0.8849061773752549,8.708395720400288e-05,S-recall-bad-memories,no,-1.0,32.37003993988037
0.11439470097253492,0.8855073121144647,9.798691300045533e-05,S-frightened-to-death,no,-1.0,32.018418312072754
0.13247812406711743,0.8674019424255109,0.00011993350737164438,S-deja-vu,no,-1.0,30.089805841445923
0.096109129970309,0.9037666830153432,0.00012418701434788477,S-postictal-relief,yes,-1.0,36.118901014328
0.05738463579195258,0.9425346897483928,8.067445965457892e-05,psychogenic-seizure,submitted,100.0,3.9451940059661865
