belief_epileptic-seizure,belief_psychogenic-seizure,belief_syncope,queried_feature,observed_feature_value,observed_reward,runtime
0.3333333333333333,0.3333333333333333,0.3333333333333333,S-recall-bad-memories,no,-1.0,28.54558515548706
0.3187501149339357,0.32067319255043003,0.3605766925156343,S-feel-hot-cold,no,-1.0,31.96899914741516
0.508776698215767,0.27529482819835227,0.21592847358588071,S-triggered-by-standing,yes,-1.0,29.574973344802856
0.20040830538474827,0.27828857364409143,0.5213031209711605,S-triggered-by-stress,no,-1.0,41.81566405296326
0.04493251265431843,0.2236331396987331,0.7314343476469484,S-like-hammer-blow,no,-1.0,32.52733278274536
0.04362371651919407,0.1293252044859292,0.8270510789948767,S-consciousness-drift,no,-1.0,31.310938358306885
0.03960332342113495,0.05806454035694105,0.902332136221924,R-poor-coordination,no,-1.0,35.101221799850464
0.032248182072657984,0.05338491306872553,0.9143669048586166,S-aware-of-shaking,no,-1.0,32.8828911781311
0.025168000863075333,0.031732884244398636,0.9430991148925261,syncope,submitted,100.0,7.589669704437256
