belief_epileptic-seizure,belief_psychogenic-seizure,belief_syncope,queried_feature,observed_feature_value,observed_reward,runtime
0.3333333333333333,0.3333333333333333,0.3333333333333333,S-pallor,no,-1.0,27.81200337409973
0.38358254501068045,0.446750076289289,0.16966737870003057,S-shaking-over-1min,yes,-1.0,25.45881414413452
0.4068465883038349,0.5552873333800848,0.03786607831608022,S-manual-automatisms,no,-1.0,28.967867612838745
0.28524266057041425,0.5905345734721584,0.12422276595742726,S-like-hammer-blow,yes,-1.0,26.929040670394897
0.11581336713821869,0.8695001267694865,0.014686506092294853,S-brief-jerks,no,-1.0,30.058603048324585
0.18469398413072216,0.7789357636753534,0.03637025219392439,S-visual-auditory-awareness,yes,-1.0,30.426227807998657
0.14874844461061856,0.8276538309010855,0.02359772448829591,S-consciousness-drift,no,-1.0,33.213921308517456
0.30138225937063995,0.6220053108423889,0.07661242978697126,S-triggered-by-standing,no,-1.0,30.936219453811646
0.3301594486225413,0.6167881327725294,0.053052418604929215,S-rigid-limbs,no,-1.0,31.39080309867859
0.2549128057431919,0.5581875408393847,0.18689965341742343,S-time-in-slow-motion,no,-1.0,28.17548370361328
0.2822636783076727,0.35306305120347503,0.3646732704888523,S-want-to-know-what-happens,no,-1.0,30.25200390815735
0.19944200226066458,0.3254770719976436,0.4750809257416919,S-recall-bad-memories,no,-1.0,28.160870790481567
0.17169825643879572,0.21141861760347955,0.6168831259577247,S-leg-automatisms,no,-1.0,30.99757409095764
0.09379204315889561,0.10100176507627802,0.8052061917648264,S-like-electricity,no,-1.0,32.318777322769165
0.04924903157751038,0.03622104632706512,0.9145299220954245,R-febrile-seizures,no,-1.0,35.51383876800537
0.03215025871446202,0.026980502412012906,0.940869238873525,R-poor-coordination,no,-1.0,14.6280198097229
0.019789833210339926,0.014113334048407577,0.9660968327412525,S-postictal-relief,no,-1.0,8.599222660064697
0.016432619714523575,0.008086179590853637,0.9754812006946227,syncope,submitted,-100.0,4.379217863082886
