belief_epileptic-seizure,belief_psychogenic-seizure,belief_syncope,queried_feature,observed_feature_value,observed_reward,runtime
0.3333333333333333,0.3333333333333333,0.3333333333333333,S-palpitations,no,-1.0,29.865934371948242
0.4349030470914127,0.3079409048938135,0.2571560480147738,S-postictal-relief,no,-1.0,30.952228784561157
0.4931384651143798,0.2409311208063599,0.26593041407926027,S-recall-bad-memories,no,-1.0,33.26353693008423
0.5053927477159791,0.18630589478874712,0.3083013574952739,S-aware-of-shaking,no,-1.0,42.172561168670654
0.4958425560841549,0.10441194273144112,0.39974550118440394,S-unusual-positions,no,-1.0,30.977781295776367
0.38541589889755956,0.0703882557305226,0.5441958453719177,S-sensation-of-passivity,no,-1.0,31.91629958152771
0.3291810321644798,0.05655681950003167,0.6142621483354886,S-consciousness-drift,no,-1.0,29.887645721435547
0.3024539895103322,0.019274787805106615,0.6782712226845612,S-like-electricity,no,-1.0,31.804617166519165
0.21360497469019962,0.00929698180265164,0.7770980435071487,S-like-knife-through-head,no,-1.0,37.60068321228027
0.19427873307626722,0.004860355237848323,0.8008609116858845,R-poor-coordination,no,-1.0,16.886983394622803
0.16257186945333213,0.0034441602941793882,0.8339839702524885,S-frightened-to-death,no,-1.0,6.830595016479492
0.15539346096273807,0.002088439674756456,0.8425180993625054,syncope,submitted,100.0,3.4506027698516846
