belief_epileptic-seizure,belief_psychogenic-seizure,belief_syncope,queried_feature,observed_feature_value,observed_reward,runtime
0.3333333333333333,0.3333333333333333,0.3333333333333333,S-like-electricity,no,-1.0,31.666468143463135
0.28305489260143196,0.25775656324582347,0.4591885441527446,S-oral-automatisms,no,-1.0,30.037070274353027
0.09242263686062664,0.21745274541548323,0.69012461772389,S-visual-auditory-awareness,yes,-1.0,30.575956344604492
0.10362238516404984,0.4288705879499839,0.4675070268859663,S-palpitations,no,-1.0,24.104360342025757
0.1320114985100388,0.5158199170695411,0.35216858442042015,S-like-hammer-blow,yes,-1.0,27.058125972747803
0.04883816596989514,0.9227085404129955,0.028453293617109292,S-triggered-by-blood,no,-1.0,28.56106472015381
0.037518021951380764,0.9431066660370921,0.01937531201152695,S-olfactory-hallucination,no,-1.0,12.70667052268982
0.03579109977400474,0.9424380349321652,0.02177086529383017,psychogenic-seizure,submitted,100.0,3.3127682209014893
