belief_epileptic-seizure,belief_psychogenic-seizure,belief_syncope,queried_feature,observed_feature_value,observed_reward,runtime
0.3333333333333333,0.3333333333333333,0.3333333333333333,S-chest-pain,no,-1.0,26.339874505996704
0.3792270531400966,0.25885668276972623,0.36191626409017713,R-poor-coordination,yes,-1.0,25.45324969291687
0.4522137876878555,0.4649736227071758,0.0828125896049687,S-visual-auditory-awareness,no,-1.0,26.833574056625366
0.5179119362815607,0.3460857775111313,0.13600228620730795,S-sensation-of-passivity,yes,-1.0,25.965050220489502
0.5489890931315007,0.4198003465574389,0.031210560311060512,epileptic-seizure,submitted,-100.0,5.002931356430054
