belief_epileptic-seizure,belief_psychogenic-seizure,belief_syncope,queried_feature,observed_feature_value,observed_reward,runtime
0.3333333333333333,0.3333333333333333,0.3333333333333333,S-brief-jerks,yes,-1.0,27.324104070663452
0.23262032085561496,0.716577540106952,0.05080213903743315,S-aware-of-shaking,no,-1.0,23.941354274749756
0.15423676066361777,0.8360413662385031,0.009721873097879082,S-oral-automatisms,yes,-1.0,29.245380640029907
0.04328702028020217,0.9567047176490506,8.262070747106939e-06,psychogenic-seizure,submitted,100.0,4.662022113800049
