belief_epileptic-seizure,belief_psychogenic-seizure,belief_syncope,queried_feature,observed_feature_value,observed_reward,runtime
0.3333333333333333,0.3333333333333333,0.3333333333333333,S-brief-jerks,no,-1.0,26.183165788650513
0.36678507992895204,0.20603907637655422,0.42717584369449385,S-feel-hot-cold,yes,-1.0,28.115787982940674
0.19247183963539635,0.14902127902499945,0.6585068813396042,S-manual-automatisms,no,-1.0,31.248621463775635
0.023262415737105687,0.021152453713004067,0.9555851305498902,S-unusual-positions,no,-1.0,11.192432880401611
0.00033816822431394027,0.00024249839936454454,0.9994193333763215,syncope,submitted,100.0,2.498426914215088
