belief_epileptic-seizure,belief_psychogenic-seizure,belief_syncope,queried_feature,observed_feature_value,observed_reward,runtime
0.3333333333333333,0.3333333333333333,0.3333333333333333,S-brief-jerks,no,-1.0,28.571796417236328
0.36678507992895204,0.2060390763765542,0.4271758436944938,S-olfactory-hallucination,no,-1.0,28.337804079055786
0.35547843174708926,0.15688063279765566,0.48764093545525505,S-rigid-limbs,no,-1.0,31.890460968017578
0.1609858716458194,0.0832760365418399,0.7557380918123408,S-deja-vu,no,-1.0,30.772016763687134
0.12110105509985145,0.06747718163687884,0.8114217632632698,S-limp-limbs,yes,-1.0,27.30149483680725
0.055330572969513714,0.052587708995263514,0.8920817180352228,S-feel-hot-cold,yes,-1.0,12.34809136390686
0.022727781347320824,0.05300066867912989,0.9242715499735493,syncope,submitted,100.0,2.8485159873962402
