belief_epileptic-seizure,belief_psychogenic-seizure,belief_syncope,queried_feature,observed_feature_value,observed_reward,runtime
0.3333333333333333,0.3333333333333333,0.3333333333333333,S-triggered-by-standing,no,-1.0,26.75637984275818
0.42029657089898054,0.38044485634847075,0.19925857275254863,R-poor-coordination,no,-1.0,29.98246955871582
0.5066988574272405,0.3515740979673383,0.1417270446054212,S-like-hammer-blow,no,-1.0,23.715209484100342
0.7655869035093508,0.1646549179278625,0.06975817856278672,S-palpitations,no,-1.0,24.260026693344116
0.9637059146563591,0.03156311647458194,0.004730968869058976,S-shaking-over-1min,no,-1.0,15.366497039794922
0.9991955478628138,0.0007443183144603468,6.0133822725842946e-05,epileptic-seizure,submitted,-100.0,2.4830472469329834
