belief_epileptic-seizure,belief_psychogenic-seizure,belief_syncope,queried_feature,observed_feature_value,observed_reward,runtime
0.3333333333333333,0.3333333333333333,0.3333333333333333,S-rigid-limbs,yes,-1.0,27.33135175704956
0.534181240063593,0.3783783783783784,0.08744038155802863,S-locked-in,yes,-1.0,28.804967880249023
0.618624320359023,0.35431949598688184,0.027056183654095112,S-pallor,yes,-1.0,26.35570788383484
0.7006922047868555,0.2652469738215301,0.03406082139161443,S-like-hammer-blow,no,-1.0,26.902351140975952
0.8552176718077918,0.10846944058805337,0.03631288760415475,S-leg-automatisms,yes,-1.0,28.116268634796143
0.9007471739830455,0.0992527611197453,6.489720924297362e-08,S-like-electricity,no,-1.0,26.98463797569275
0.9465735495517998,0.0534263674709345,8.297726572949594e-08,epileptic-seizure,submitted,-100.0,5.875739812850952
