belief_epileptic-seizure,belief_psychogenic-seizure,belief_syncope,queried_feature,observed_feature_value,observed_reward,runtime
0.3333333333333333,0.3333333333333333,0.3333333333333333,S-rigid-limbs,no,-1.0,26.48253893852234
0.17875457875457876,0.20952380952380953,0.6117216117216118,S-leg-automatisms,no,-1.0,29.06409215927124
0.12258004029308345,0.12565552517498876,0.7517644345319279,S-shaking-over-1min,yes,-1.0,31.18916940689087
0.3155453534293872,0.37905733820902526,0.3053973083615875,S-brief-jerks,no,-1.0,25.787023544311523
0.35688759356496935,0.24083106344117394,0.4022813429938567,S-limp-limbs,yes,-1.0,26.559293270111084
0.2056195398346971,0.23667670313946293,0.55770375702584,S-want-to-know-what-happens,no,-1.0,27.129698991775513
0.1599394803572887,0.24018910854423314,0.5998714110984782,S-locked-in,yes,-1.0,26.472445726394653
0.25282974862234436,0.40935011736148014,0.33782013401617544,S-like-electricity,no,-1.0,31.24005937576294
0.23400742004140004,0.25875973917762757,0.5072328407809723,R-febrile-seizures,no,-1.0,30.994264602661133
0.20730696133661097,0.26156716535447694,0.5311258733089121,S-palpitations,no,-1.0,28.757816791534424
0.2934005286154503,0.2621230200890696,0.4444764512954802,S-like-knife-through-head,no,-1.0,30.963139057159424
0.3095913816186662,0.1589810149419429,0.531427603439391,R-poor-coordination,no,-1.0,30.995920181274414
0.27901957484033135,0.12176234458492141,0.5992180805747471,S-triggered-by-stress,no,-1.0,32.45970344543457
0.06404991769549412,0.07513701982187597,0.8608130624826298,S-time-in-slow-motion,no,-1.0,9.90346074104309
0.05146211553438914,0.03448512567446171,0.9140527587911491,syncope,submitted,100.0,3.791177988052368
