belief_epileptic-seizure,belief_psychogenic-seizure,belief_syncope,queried_feature,observed_feature_value,observed_reward,runtime
0.3333333333333333,0.3333333333333333,0.3333333333333333,S-triggered-by-standing,no,-1.0,26.286791801452637
0.4202965708989806,0.38044485634847075,0.19925857275254866,S-triggered-by-stress,yes,-1.0,25.724100351333618
0.5083920479019418,0.3805297319945937,0.11107822010346452,S-olfactory-hallucination,no,-1.0,20.684430599212646
0.5418907995543876,0.31865428838869847,0.13945491205691396,S-feel-hot-cold,yes,-1.0,19.818065404891968
0.32342115447989567,0.46663964807074515,0.20993919744935916,S-visual-auditory-awareness,no,-1.0,19.54660701751709
0.3486145149742816,0.326890269479689,0.32449521554602945,S-sensation-of-passivity,yes,-1.0,18.0209743976593
0.4396500531751382,0.4717532515244089,0.0885966953004529,S-deja-vu,no,-1.0,19.73501753807068
0.409260902606144,0.47302571851160485,0.1177133788822511,S-palpitations,no,-1.0,20.264854431152344
0.5029019527609799,0.41156908892544974,0.0855289583135703,S-rapid-head-turning,yes,-1.0,19.186309337615967
0.48889524521923017,0.5010889803566461,0.010015774424123719,psychogenic-seizure,submitted,-100.0,3.409172773361206
