belief_epileptic-seizure,belief_psychogenic-seizure,belief_syncope,queried_feature,observed_feature_value,observed_reward,runtime
0.3333333333333333,0.3333333333333333,0.3333333333333333,S-postictal-relief,yes,-1.0,18.19016146659851
0.260778859527121,0.4554937413073713,0.28372739916550765,S-time-in-slow-motion,no,-1.0,21.45563817024231
0.26537847686977656,0.3530394631644194,0.38158205996580397,S-sensation-of-passivity,no,-1.0,22.83816647529602
0.21886808492694554,0.3652231771321229,0.41590873794093147,R-poor-coordination,no,-1.0,30.4261474609375
0.190514853514714,0.3589538998430145,0.4505312466422714,S-locked-in,yes,-1.0,24.499144077301025
0.2197370609423032,0.5951425475275909,0.18512039153010598,S-feel-hot-cold,yes,-1.0,23.66423988342285
0.08343383159280583,0.7392712826425233,0.17729488576467092,S-leg-automatisms,no,-1.0,26.10255718231201
0.06604917241429749,0.6824225789943362,0.25152824859136635,S-deja-vu,yes,-1.0,23.491857767105103
0.07678990910283635,0.8891230315676573,0.034087059329506446,S-triggered-by-blood,no,-1.0,23.484617233276367
0.05952773137008909,0.9170493889555722,0.02342287967433867,S-triggered-by-stress,yes,-1.0,23.39635157585144
0.05504680015143251,0.9349710972558068,0.009982102592760653,psychogenic-seizure,submitted,100.0,3.6477932929992676
