belief_epileptic-seizure,belief_psychogenic-seizure,belief_syncope,queried_feature,observed_feature_value,observed_reward,runtime
0.3333333333333333,0.3333333333333333,0.3333333333333333,S-triggered-by-stress,yes,-1.0,27.839004516601562
0.508693213684801,0.3154795288839035,0.17582725743129554,S-pallor,yes,-1.0,25.63066577911377
0.5573954252898579,0.22847239364629904,0.21413218106384302,S-consciousness-drift,no,-1.0,27.72817587852478
0.6847954263641144,0.07808588886786193,0.23711868476802367,S-visual-auditory-awareness,no,-1.0,29.10964560508728
0.7002924838125616,0.03892205397202793,0.26078546221541044,S-unusual-positions,no,-1.0,28.123839616775513
0.6556032144832923,0.023701881452918943,0.32069490406378875,S-palpitations,no,-1.0,27.59247899055481
0.8089780813695465,0.015531546339242298,0.17549037229121123,S-frightened-to-death,no,-1.0,29.750216722488403
0.8466765986471612,0.007734068270074157,0.1455893330827648,S-triggered-by-blood,yes,-1.0,26.949464321136475
0.7278170932862877,0.005158188586936387,0.267024718126776,S-shaking-over-1min,no,-1.0,29.631340742111206
0.5914237255957709,0.002183094216734064,0.406393180187495,S-like-hammer-blow,no,-1.0,31.05191683769226
0.6244349812022567,0.0007722688953850826,0.3747927499023582,S-violent-shaking,no,-1.0,29.06554365158081
0.41712251161266717,0.00028953942465298406,0.5825879489626798,S-limp-limbs,yes,-1.0,29.06659507751465
0.2839727636709939,0.0002521692375595991,0.7157750670914466,S-feel-hot-cold,yes,-1.0,26.973806381225586
0.17331199292013794,0.0002832112622899514,0.8264047958175721,S-aware-of-shaking,no,-1.0,31.038975954055786
0.17461230076100143,0.00012224378536259585,0.8252654554536359,S-deja-vu,no,-1.0,32.06160569190979
0.16501862737342948,9.333035392194914e-05,0.8348880422726486,R-febrile-seizures,no,-1.0,33.92253303527832
0.18229934549780397,8.823453047526553e-05,0.8176124199717208,S-manual-automatisms,no,-1.0,32.495429277420044
0.07809346166720231,4.300046669896553e-05,0.9218635378660988,S-onset-during-sleep,no,-1.0,16.83997869491577
0.04933484585565438,1.7008954940643275e-05,0.9506481451894049,S-locked-in,no,-1.0,8.883877754211426
0.03125812058690985,6.95996689243956e-06,0.9687349194461977,syncope,submitted,100.0,4.497513055801392
