belief_epileptic-seizure,belief_psychogenic-seizure,belief_syncope,queried_feature,observed_feature_value,observed_reward,runtime
0.3333333333333333,0.3333333333333333,0.3333333333333333,S-rapid-head-turning,yes,-1.0,27.825073957443237
0.42143432715551976,0.5278001611603546,0.0507655116841257,S-sensation-of-passivity,no,-1.0,30.899053812026978
0.42782642205179733,0.5040653126777528,0.06810826527044972,S-like-hammer-blow,no,-1.0,29.80323624610901
0.5841986707805082,0.3074865283807135,0.10831480083877819,S-recall-bad-memories,no,-1.0,29.74896788597107
0.6223268697197692,0.2471483128912378,0.1305248173889929,S-manual-automatisms,yes,-1.0,32.23046684265137
0.746048956813773,0.24050240084429403,0.013448642341932913,S-like-electricity,no,-1.0,28.40269684791565
0.8003773025345386,0.17621674819565478,0.023405949269806475,S-chest-pain,no,-1.0,35.206836223602295
0.8487576256577086,0.12755461548022287,0.023687758862068614,S-olfactory-hallucination,no,-1.0,33.52509307861328
0.8688550013104043,0.10258360043825597,0.028561398251339788,S-deja-vu,no,-1.0,32.08039307594299
0.8517194796097332,0.10831882406970149,0.039961696320565294,S-brief-jerks,yes,-1.0,32.95009160041809
0.7132620930816214,0.2794293635713405,0.0073085433470381446,S-onset-during-sleep,yes,-1.0,31.094233989715576
0.6926587222938235,0.3068579403206691,0.0004833373855073125,S-limp-limbs,no,-1.0,27.71829867362976
0.8011517059856299,0.19877932107680396,6.8972937566222e-05,S-leg-automatisms,yes,-1.0,29.698972940444946
0.7767524247110984,0.22324757513760665,1.5129490726634673e-10,R-febrile-seizures,no,-1.0,29.741281747817993
0.753040930912886,0.24695906891374708,1.733668710517255e-10,S-rigid-limbs,yes,-1.0,33.31214427947998
0.7635163356470215,0.23648366431461418,3.836436467487788e-11,S-want-to-know-what-happens,yes,-1.0,34.37949848175049
0.7716781264393511,0.2283218735240533,3.6595629126106947e-11,S-locked-in,yes,-1.0,33.17600345611572
0.7581544357393541,0.24184556424783715,1.2808715538263834e-11,S-palpitations,no,-1.0,33.564083099365234
0.8157482823440694,0.1842517176477816,8.149075863808918e-12,S-triggered-by-standing,no,-1.0,30.56954526901245
0.8302531320128989,0.169746867983169,3.9320939324135456e-12,S-consciousness-drift,yes,-1.0,31.79960036277771
0.6801032836236023,0.31989671637452033,1.877259167968453e-12,S-triggered-by-stress,yes,-1.0,32.96314263343811
0.7199705909976266,0.28002940900145745,9.15868482328231e-13,S-oral-automatisms,yes,-1.0,33.15392351150513
0.7736526611703192,0.22634733882963368,4.727934963653211e-14,R-poor-coordination,yes,-1.0,32.995155811309814
0.6970779641883885,0.3029220358116034,8.033153448233261e-15,S-feel-hot-cold,yes,-1.0,32.792911767959595
0.48397101977317875,0.5160289802268072,1.4067830807881791e-14,S-pallor,yes,-1.0,34.186485290527344
0.5155670254905037,0.48443297450947403,2.220853606290947e-14,S-frightened-to-death,no,-1.0,33.82575535774231
0.6265375681692262,0.3734624318307451,2.85243733474454e-14,S-postictal-relief,yes,-1.0,33.671860456466675
0.561527631035012,0.4384723689649601,2.781435682654335e-14,S-like-knife-through-head,yes,-1.0,35.83824801445007
0.27414748811795925,0.7258525118820373,3.4173448844817645e-15,S-aware-of-shaking,no,-1.0,34.212677001953125
0.3980223536359257,0.6019776463640677,6.557002646848491e-15,S-shaking-over-1min,yes,-1.0,37.855862855911255
0.3607023211717512,0.6392976788282478,9.377525037117156e-16,S-triggered-by-blood,no,-1.0,33.292216777801514
0.36119257504613983,0.6388074249538593,8.323647540442468e-16,S-unusual-positions,yes,-1.0,27.822525024414062
0.3290933560490531,0.670906643950947,1.0274994050790609e-16,S-visual-auditory-awareness,no,-1.0,20.736342430114746
0.4301242248811259,0.569875775118874,1.925724209390098e-16,S-time-in-slow-motion,no,-1.0,14.49472427368164
0.5692088770805093,0.4307911229194903,3.3679466807933234e-16,S-violent-shaking,yes,-1.0,7.434518814086914
0.5437060076813391,0.4562939923186609,2.903640207121642e-17,epileptic-seizure,submitted,-100.0,0.020238637924194336
