belief_epileptic-seizure,belief_psychogenic-seizure,belief_syncope,queried_feature,observed_feature_value,observed_reward,runtime
0.3333333333333333,0.3333333333333333,0.3333333333333333,S-shaking-over-1min,yes,-1.0,23.802743673324585
0.4292421193829644,0.5030181086519114,0.06773977196512407,S-manual-automatisms,no,-1.0,25.371660947799683
0.3001754888303731,0.5335809031614339,0.166243608008193,S-chest-pain,yes,-1.0,25.95767831802368
0.07748561590617305,0.8477862395717827,0.07472814452204433,R-febrile-seizures,no,-1.0,31.019773483276367
0.06837933279606925,0.8536746722455004,0.07794599495843041,S-limp-limbs,yes,-1.0,27.26895236968994
0.03993945706687842,0.8505106771445641,0.10954986578855766,S-recall-bad-memories,yes,-1.0,31.130716800689697
0.016094932946092703,0.9839046864783645,3.8057554280992937e-07,psychogenic-seizure,submitted,100.0,5.149263143539429
