belief_epileptic-seizure,belief_psychogenic-seizure,belief_syncope,queried_feature,observed_feature_value,observed_reward,runtime
0.3333333333333333,0.3333333333333333,0.3333333333333333,S-leg-automatisms,no,-1.0,25.95119309425354
0.2345196046621489,0.20509958257191513,0.560380812765936,S-consciousness-drift,yes,-1.0,28.197465419769287
0.2053866889806837,0.4132392647213438,0.3813740462979724,S-frightened-to-death,yes,-1.0,30.352279663085938
0.12032005545478405,0.6622546467568502,0.21742529778836567,S-like-hammer-blow,no,-1.0,25.712876081466675
0.15961757036822993,0.39247681411324176,0.44790561551852837,S-olfactory-hallucination,no,-1.0,30.77851176261902
0.136264192211668,0.2632286760084775,0.6005071317798545,S-limp-limbs,yes,-1.0,31.587055683135986
0.05424771661983973,0.17874874103734906,0.7670035423428112,S-rapid-head-turning,yes,-1.0,30.972740173339844
0.13517971275846327,0.5578438626477811,0.3069764245937557,S-triggered-by-stress,no,-1.0,30.621856927871704
0.03221481040700801,0.3573664516187317,0.6104187379742603,S-triggered-by-blood,no,-1.0,30.839526414871216
0.029015404798121758,0.3211913086393047,0.6497932865625735,S-want-to-know-what-happens,yes,-1.0,31.935836791992188
0.0251531894873399,0.2659847454315772,0.7088620650810828,S-time-in-slow-motion,yes,-1.0,28.68153977394104
0.03251340766206639,0.7029915966155086,0.26449499572242513,S-sensation-of-passivity,no,-1.0,29.65049695968628
0.028030510099061125,0.5701619670263882,0.40180752287455057,S-aware-of-shaking,no,-1.0,26.201884746551514
0.026400291705782127,0.30675013078052515,0.6668495775136928,S-deja-vu,no,-1.0,31.959319353103638
0.016237584611841153,0.203223619605896,0.7805387957822628,S-palpitations,yes,-1.0,29.169389009475708
0.0017781057205385484,0.12776931730350122,0.8704525769759603,R-febrile-seizures,no,-1.0,29.358673810958862
0.0011702953246560503,0.09595480537755764,0.9028748992977863,S-like-electricity,yes,-1.0,33.11889386177063
0.004610267859286458,0.5526115710163019,0.4427781611244117,S-oral-automatisms,no,-1.0,27.646926641464233
0.0012155118378786185,0.28233306658361357,0.7164514215785078,S-violent-shaking,no,-1.0,31.994288444519043
0.00038267434506228577,0.06651711372289976,0.9331002119320378,S-postictal-relief,no,-1.0,19.933257579803467
0.00032404508206455303,0.0388649912351791,0.9608109636827563,R-poor-coordination,yes,-1.0,10.983487606048584
0.0010814906041333105,0.19266198641085727,0.8062565229850094,S-recall-bad-memories,yes,-1.0,29.622594356536865
0.001951573041241141,0.998031703887198,1.672307156085579e-05,psychogenic-seizure,submitted,100.0,6.898746728897095
