belief_epileptic-seizure,belief_psychogenic-seizure,belief_syncope,queried_feature,observed_feature_value,observed_reward,runtime
0.3333333333333333,0.3333333333333333,0.3333333333333333,S-like-hammer-blow,no,-1.0,26.077204704284668
0.45278881732218723,0.1517061806221735,0.39550500205563927,S-frightened-to-death,no,-1.0,23.491254329681396
0.540014189425366,0.0860845585670956,0.3739012520075385,S-chest-pain,yes,-1.0,29.931333780288696
0.37876034586591584,0.27873151522061007,0.3425081389134741,S-locked-in,no,-1.0,26.74577522277832
0.34133571561899795,0.1622272329657659,0.4964370514152362,S-onset-during-sleep,yes,-1.0,30.900033950805664
0.676878363441717,0.27284065495672366,0.05028098160155944,S-postictal-relief,yes,-1.0,27.84436011314392
0.6865076019604153,0.271879436506529,0.041612961533055756,S-brief-jerks,no,-1.0,31.511815071105957
0.8198076572129115,0.13678616620832698,0.043406176578761675,S-shaking-over-1min,yes,-1.0,28.961281776428223
0.8673676809832235,0.1271967444057159,0.00543557461106067,S-oral-automatisms,yes,-1.0,29.59665584564209
0.9233968614739831,0.07639464191691518,0.00020849660910174367,S-visual-auditory-awareness,no,-1.0,14.64932370185852
0.9610133498314001,0.03875328340203729,0.00023336676656253222,epileptic-seizure,submitted,-100.0,3.4704394340515137
