belief_epileptic-seizure,belief_psychogenic-seizure,belief_syncope,queried_feature,observed_feature_value,observed_reward,runtime
0.3333333333333333,0.3333333333333333,0.3333333333333333,R-febrile-seizures,no,-1.0,28.890730142593384
0.26905533576772683,0.30697468343003226,0.423969980802241,S-triggered-by-standing,no,-1.0,32.76503920555115
0.33016027594248365,0.34097429483771863,0.3288654292197978,S-shaking-over-1min,yes,-1.0,34.47011637687683
0.4132487802447895,0.5001378131599681,0.0866134065952425,R-poor-coordination,no,-1.0,29.810161113739014
0.42050044499351846,0.432480466397064,0.14701908860941756,S-chest-pain,yes,-1.0,34.94934296607971
0.12281519925707042,0.7774856404668693,0.09969916027606023,S-like-electricity,no,-1.0,38.295607805252075
0.14125399366724475,0.6107188500235758,0.2480271563091795,S-palpitations,no,-1.0,37.15424871444702
0.18363098957876653,0.5621620123042683,0.2542069981169652,S-brief-jerks,no,-1.0,40.76245045661926
0.20536451923623802,0.3531659837728289,0.44146949699093313,S-pallor,yes,-1.0,33.905532360076904
0.1478623975102565,0.22408099595777997,0.6280566065319635,S-time-in-slow-motion,yes,-1.0,32.14130187034607
0.18780241835066766,0.5819322681426767,0.23026531350665577,S-like-hammer-blow,no,-1.0,28.682863235473633
0.2331962240641837,0.3228041369906049,0.44399963894521155,S-locked-in,yes,-1.0,30.16073966026306
0.2943953455351969,0.4393570849193335,0.2662475695454696,S-frightened-to-death,no,-1.0,34.107592821121216
0.3104413925545981,0.29391216186078234,0.39564644558461953,S-deja-vu,no,-1.0,34.358967304229736
0.22496231112148687,0.22941638044695697,0.5456213084315562,S-olfactory-hallucination,no,-1.0,36.67846393585205
0.1782469082665991,0.14280874671416977,0.6789443450192312,S-oral-automatisms,yes,-1.0,33.795475244522095
0.5415230673264051,0.32635498094986837,0.13212195172372657,S-rigid-limbs,yes,-1.0,36.82682132720947
0.6096891128807178,0.3470229046784619,0.04328798244082019,S-violent-shaking,yes,-1.0,32.39614295959473
0.60986829923206,0.3849207277109247,0.005210973057015234,S-consciousness-drift,yes,-1.0,36.91124892234802
0.40672215502925513,0.5905772756121341,0.0027005693586108688,S-manual-automatisms,no,-1.0,34.939807176589966
0.3092525560164975,0.6811393361258292,0.009608107857673194,S-triggered-by-stress,no,-1.0,36.73719906806946
0.1392751511268639,0.8246190479753935,0.03610580089774266,S-limp-limbs,yes,-1.0,33.92328977584839
0.08381529489448818,0.8464729358016662,0.06971176930384566,S-postictal-relief,yes,-1.0,29.741897106170654
0.06478109465202687,0.8570563512433607,0.07816255410461252,S-like-knife-through-head,no,-1.0,37.791820764541626
0.09590101260991536,0.7292835539763305,0.17481543341375402,S-visual-auditory-awareness,yes,-1.0,38.32905888557434
0.07999176020641272,0.802538512041805,0.11746972775178233,S-triggered-by-blood,no,-1.0,41.4875226020813
0.07844930667791236,0.7853923910130172,0.13615830230907056,S-sensation-of-passivity,no,-1.0,41.36894106864929
0.07420186340112801,0.6988629066259976,0.2269352299728743,S-feel-hot-cold,yes,-1.0,44.2516565322876
0.02907428954470347,0.6718796888654042,0.29904602158989224,S-unusual-positions,no,-1.0,45.46919822692871
0.022192053320435185,0.4447788083986837,0.5330291382808812,S-leg-automatisms,yes,-1.0,43.96185874938965
0.04129425935468639,0.9587027486589369,2.991986376709815e-06,S-want-to-know-what-happens,yes,-1.0,34.24221181869507
0.04314415055390659,0.9568519156310182,3.933815075200053e-06,S-aware-of-shaking,no,-1.0,27.72649908065796
0.0731590582224438,0.9268291876008334,1.175417672286673e-05,S-onset-during-sleep,yes,-1.0,22.565812587738037
0.06524828093836274,0.9347507671835742,9.518780629714403e-07,S-recall-bad-memories,no,-1.0,13.727862358093262
0.08467837473974511,0.9153197620116904,1.8632485644445076e-06,S-rapid-head-turning,yes,-1.0,7.124233245849609
0.06878738518811589,0.9312123717120405,2.4309984367365754e-07,psychogenic-seizure,submitted,100.0,0.020073413848876953
