belief_epileptic-seizure,belief_psychogenic-seizure,belief_syncope,queried_feature,observed_feature_value,observed_reward,runtime
0.3333333333333333,0.3333333333333333,0.3333333333333333,S-feel-hot-cold,yes,-1.0,28.51082420349121
0.21132897603485842,0.3888888888888889,0.3997821350762527,S-like-knife-through-head,yes,-1.0,29.268754959106445
0.16565116219891826,0.7752026532233666,0.05914618457771506,S-manual-automatisms,no,-1.0,28.853107929229736
0.13767239463578915,0.7329471407374499,0.12938046462676092,S-olfactory-hallucination,no,-1.0,29.24405026435852
0.20132399345246307,0.6315398098524483,0.16713619669508864,S-sensation-of-passivity,yes,-1.0,29.35727596282959
0.2612970145137507,0.7034806418094078,0.035222343676841426,S-rigid-limbs,yes,-1.0,29.20970129966736
0.3414034553809002,0.6510634204307831,0.007533124188316608,S-shaking-over-1min,no,-1.0,30.387518644332886
0.4915052867049543,0.4881826583498645,0.020312054945181263,S-unusual-positions,no,-1.0,30.045182466506958
0.588112768209669,0.3799620521537488,0.03192517963658228,S-onset-during-sleep,no,-1.0,27.41458821296692
0.6697315962775966,0.27092293069736595,0.05934547302503744,S-rapid-head-turning,yes,-1.0,31.021750688552856
0.7204753973953482,0.2737568571358731,0.0057677454687787635,S-triggered-by-blood,no,-1.0,31.875414609909058
0.7753787490335143,0.22049460072307903,0.004126650243406658,S-like-hammer-blow,yes,-1.0,27.49859309196472
0.5635994958301896,0.43590920053725907,0.0004913036325513233,S-triggered-by-stress,yes,-1.0,33.3348753452301
0.6756897221647102,0.3241066875971658,0.00020359023812403202,S-locked-in,no,-1.0,29.596071481704712
0.7632013971490783,0.23642875350324238,0.00036984934767945625,S-time-in-slow-motion,no,-1.0,28.18795108795166
0.8824577362158609,0.11711839226710302,0.0004238715170360417,S-violent-shaking,yes,-1.0,29.788392782211304
0.9005687748478801,0.0994019429594162,2.9282192703666313e-05,S-want-to-know-what-happens,yes,-1.0,30.627197980880737
0.9266954110500188,0.07328326005598916,2.132889399201637e-05,S-chest-pain,no,-1.0,16.89817190170288
0.9610754781036881,0.038908689054525755,1.5832841786050198e-05,S-triggered-by-standing,no,-1.0,10.049363851547241
0.9732452391526222,0.026749059912297198,5.700935080525666e-06,epileptic-seizure,submitted,-100.0,5.0145041942596436
