belief_epileptic-seizure,belief_psychogenic-seizure,belief_syncope,queried_feature,observed_feature_value,observed_reward,runtime
0.3333333333333333,0.3333333333333333,0.3333333333333333,S-aware-of-shaking,yes,-1.0,24.895535230636597
0.3066385669125395,0.6269757639620652,0.06638566912539516,S-time-in-slow-motion,yes,-1.0,27.90716052055359
0.10462119017491653,0.894317206334885,0.0010616034901984636,S-recall-bad-memories,no,-1.0,27.48490071296692
0.017814561803174218,0.9821833632460053,2.0749508202767205e-06,psychogenic-seizure,submitted,100.0,6.136905193328857
