belief_epileptic-seizure,belief_psychogenic-seizure,belief_syncope,queried_feature,observed_feature_value,observed_reward,runtime
0.3333333333333333,0.3333333333333333,0.3333333333333333,S-limp-limbs,yes,-1.0,26.108277797698975
0.24485891917742708,0.31324725011956,0.44189383070301286,S-deja-vu,no,-1.0,26.77946925163269
0.2521832956190125,0.2606307432431198,0.4871859611378677,S-rigid-limbs,no,-1.0,28.940828561782837
0.14562640783722416,0.13230825258040155,0.7220653395823743,R-poor-coordination,no,-1.0,25.7385094165802
0.16116362972375095,0.09299729280189276,0.7458390774743563,S-consciousness-drift,no,-1.0,26.102625846862793
0.18755536348481547,0.03010746081838149,0.7823371756968029,S-shaking-over-1min,no,-1.0,28.596251487731934
0.11241033102866368,0.009398307268851628,0.8781913617024847,S-like-electricity,no,-1.0,26.62466526031494
0.0948038183794209,0.004060044894644899,0.9011361367259342,S-manual-automatisms,no,-1.0,25.90284824371338
0.03836295837744649,0.001869055175320085,0.9597679864472334,syncope,submitted,100.0,2.987546443939209
