belief_epileptic-seizure,belief_psychogenic-seizure,belief_syncope,queried_feature,observed_feature_value,observed_reward,runtime
0.3333333333333333,0.3333333333333333,0.3333333333333333,S-postictal-relief,yes,-1.0,23.86223602294922
0.35733428622476326,0.3510809362158299,0.29158477755940687,S-rigid-limbs,no,-1.0,27.328590154647827
0.2526491270532595,0.2182166233288852,0.5291342496178554,S-like-knife-through-head,no,-1.0,30.454936504364014
0.31724219629484934,0.11812297387085408,0.5646348298342966,S-palpitations,no,-1.0,27.052314043045044
0.5032627736143431,0.09951176419145576,0.3972254621942011,S-triggered-by-stress,yes,-1.0,27.655214071273804
0.7166161685106361,0.08787826242643243,0.1955055690629314,S-manual-automatisms,no,-1.0,27.988993167877197
0.5383375632716612,0.07510253013832816,0.3865599065900106,S-time-in-slow-motion,no,-1.0,25.358458757400513
0.5644931835573491,0.03373872274137714,0.4017680937012736,S-violent-shaking,no,-1.0,28.002482175827026
0.37178352388879204,0.012471618982519903,0.6157448571286882,S-like-electricity,no,-1.0,28.746620178222656
0.32978671590123787,0.005666663787585087,0.6645466203111771,S-like-hammer-blow,no,-1.0,28.861164808273315
0.361545626478854,0.0020814452065497217,0.6363729283145962,S-chest-pain,no,-1.0,32.31948661804199
0.44193099625086407,0.0013024998055360063,0.5567665039436,S-deja-vu,no,-1.0,32.820899963378906
0.42534765350306936,0.0010127569512104228,0.5736395895457201,R-febrile-seizures,no,-1.0,29.944115161895752
0.45504760009688155,0.0009272173443236702,0.5440251825587947,R-poor-coordination,no,-1.0,30.28614854812622
0.47100794706739924,0.0006116967081087153,0.5283803562244921,S-consciousness-drift,no,-1.0,33.7335090637207
0.49714484621447214,0.00017961070832291892,0.5026755430772051,S-onset-during-sleep,no,-1.0,32.66355490684509
0.3772532939457827,8.533902656510225e-05,0.6226613670276522,S-brief-jerks,no,-1.0,32.24615263938904
0.4095345875509094,3.903052806933853e-05,0.5904263819210211,S-sensation-of-passivity,no,-1.0,34.23230814933777
0.4116820188064627,2.7683219837690036e-05,0.5882902979736996,S-frightened-to-death,no,-1.0,37.345223903656006
0.46887623464285516,1.5001180157948925e-05,0.5311087641769869,S-rapid-head-turning,no,-1.0,35.47939896583557
0.37469595191293176,6.502916636018966e-06,0.6252975451704321,S-leg-automatisms,no,-1.0,37.537617921829224
0.3083528834553894,3.51013715056546e-06,0.69164360640746,S-want-to-know-what-happens,yes,-1.0,36.5235059261322
0.3864365976856112,3.1516944110312483e-06,0.6135602506199778,S-feel-hot-cold,yes,-1.0,38.89496994018555
0.24977374604039085,3.748686526721441e-06,0.7502225052730824,S-triggered-by-blood,no,-1.0,38.88752460479736
0.3336851668914874,3.7480679332486654e-06,0.6663110850405792,S-visual-auditory-awareness,no,-1.0,40.466057777404785
0.31770894756339174,1.739420468471621e-06,0.6822893130161398,S-olfactory-hallucination,no,-1.0,46.17942523956299
0.34517131410961005,1.113497466868455e-06,0.6548275723929231,S-unusual-positions,no,-1.0,44.05255722999573
0.2863727667650984,6.009131594570645e-07,0.7136266323217422,S-pallor,yes,-1.0,42.09519577026367
0.26527529639674713,3.6790178907535844e-07,0.7347243357014637,S-aware-of-shaking,no,-1.0,39.49283504486084
0.26700467937464856,1.5864413292183356e-07,0.7329951619812186,S-locked-in,no,-1.0,36.201128244400024
0.18466262838420444,7.08605651892239e-08,0.8153373007552304,S-limp-limbs,yes,-1.0,31.56445050239563
0.11150507086277577,5.473833161040696e-08,0.8884948743988927,S-shaking-over-1min,yes,-1.0,25.567509412765503
0.5146384315241953,2.220453617850596e-07,0.4853613464304429,S-triggered-by-standing,yes,-1.0,19.473963260650635
0.1874319197102558,1.167385756683645e-07,0.8125679635511684,S-recall-bad-memories,no,-1.0,13.071296453475952
0.21376152700901824,7.534166478145441e-08,0.7862383976493169,S-oral-automatisms,no,-1.0,6.792707443237305
0.07300656032383607,3.739706824934859e-08,0.9269934022790958,syncope,submitted,100.0,0.018417835235595703
