belief_epileptic-seizure,belief_psychogenic-seizure,belief_syncope,queried_feature,observed_feature_value,observed_reward,runtime
0.3333333333333333,0.3333333333333333,0.3333333333333333,S-olfactory-hallucination,no,-1.0,25.528990745544434
0.3100427182140176,0.32477187757950493,0.3651854042064775,S-triggered-by-stress,yes,-1.0,28.46247673034668
0.3706806237216049,0.4281041898912321,0.20121518638716296,S-oral-automatisms,no,-1.0,29.436731338500977
0.1542603492166061,0.4603110252445106,0.38542862553888324,S-recall-bad-memories,no,-1.0,28.6338152885437
0.14644692103647944,0.4396323253185941,0.4139207536449264,S-leg-automatisms,no,-1.0,29.961498022079468
0.1045391287306034,0.36594229575651144,0.5295185755128851,R-febrile-seizures,no,-1.0,24.637853622436523
0.08121721373484822,0.4325365569368475,0.48624622932830436,S-time-in-slow-motion,no,-1.0,30.26516819000244
0.07710989253721107,0.3127752320907926,0.6101148753719963,S-palpitations,no,-1.0,30.708996057510376
0.10517528796079526,0.40276306266457484,0.49206164937462993,S-like-knife-through-head,no,-1.0,30.73993682861328
0.10827146603783395,0.31776115879608585,0.5739673751660802,S-shaking-over-1min,no,-1.0,28.82890796661377
0.0589772059014213,0.16026815278232218,0.7807546413162565,S-locked-in,yes,-1.0,28.26138424873352
0.10392339856409143,0.40596092366923164,0.4901156777666769,S-frightened-to-death,no,-1.0,28.69726252555847
0.1076584590106883,0.3557206085074962,0.5366209324818155,S-onset-during-sleep,no,-1.0,25.88133692741394
0.06440603216290898,0.23688100960538744,0.6987129582317035,S-want-to-know-what-happens,yes,-1.0,30.72468852996826
0.06280011609196838,0.2941923669752453,0.6430075169327863,S-visual-auditory-awareness,no,-1.0,33.67017674446106
0.05065447762460934,0.2056226000208621,0.7437229223545285,S-like-hammer-blow,no,-1.0,29.392642736434937
0.04873866065099814,0.11784513309930242,0.8334162062496995,S-rigid-limbs,no,-1.0,31.70987844467163
0.015798739422926898,0.05970015246356936,0.9245011081135038,S-chest-pain,no,-1.0,30.803166389465332
0.016587770733229364,0.0570479227094868,0.926364306557284,S-deja-vu,no,-1.0,36.06286954879761
0.011675611955865504,0.05766959802328668,0.9306547900208479,S-unusual-positions,no,-1.0,34.66407251358032
0.006834579972990034,0.03903750352476539,0.9541279165022446,S-like-electricity,yes,-1.0,24.2019681930542
0.03973349644006998,0.44237266509405937,0.5178938384658706,S-consciousness-drift,no,-1.0,26.333303689956665
0.04510516406613558,0.2483571202777486,0.7065377156561158,S-brief-jerks,no,-1.0,26.25083827972412
0.04279464591687321,0.17648851782977157,0.7807168362533552,R-poor-coordination,yes,-1.0,28.647419691085815
0.07931700917094363,0.6478168327846805,0.27286615804437586,S-feel-hot-cold,no,-1.0,25.47692561149597
0.14962196064600647,0.6572638927818347,0.1931141465721587,S-limp-limbs,no,-1.0,28.06322932243347
0.22524551035735546,0.7388864392589499,0.035868050383694484,S-triggered-by-blood,no,-1.0,29.519439220428467
0.18163061969870725,0.7927318453618896,0.025637534939403135,S-pallor,yes,-1.0,31.63155198097229
0.15779255981537255,0.809200843896554,0.03300659628807346,S-postictal-relief,yes,-1.0,33.231571435928345
0.09818417422322238,0.879470607220021,0.02234521855675656,S-violent-shaking,yes,-1.0,33.700984477996826
0.07010615861542266,0.9284537686994082,0.001440072685168974,S-rapid-head-turning,yes,-1.0,31.31682300567627
0.04325774778701085,0.9566352159330914,0.00010703627989778516,S-aware-of-shaking,no,-1.0,25.665363550186157
0.056032834795144516,0.9437839324746187,0.0001832327302369068,S-sensation-of-passivity,yes,-1.0,19.413946866989136
0.03745328261713357,0.9625202019997664,2.6515383100147064e-05,S-triggered-by-standing,no,-1.0,13.1749906539917
0.03123344334340923,0.9687560735729009,1.0483083689674893e-05,S-manual-automatisms,yes,-1.0,6.746800661087036
0.02892711707617167,0.9710720484534686,8.344703597045786e-07,psychogenic-seizure,submitted,-100.0,0.018435001373291016
