belief_epileptic-seizure,belief_psychogenic-seizure,belief_syncope,queried_feature,observed_feature_value,observed_reward,runtime
0.3333333333333333,0.3333333333333333,0.3333333333333333,R-poor-coordination,no,-1.0,26.598096132278442
0.29642498274759616,0.3347420579915948,0.36883295926080895,S-rigid-limbs,yes,-1.0,27.585671186447144
0.3712499331669789,0.5279308190848309,0.10081924774819019,S-shaking-over-1min,yes,-1.0,29.4450626373291
0.30629858961911827,0.6805744714328802,0.013126938948001494,S-unusual-positions,yes,-1.0,28.40283989906311
0.22620688837043404,0.7724796666323711,0.0013134449971948891,S-oral-automatisms,no,-1.0,29.193400859832764
0.10152306435696277,0.8957636246849676,0.0027133109580696575,S-limp-limbs,yes,-1.0,31.542042016983032
0.047323654276529785,0.9496329819225314,0.0030433638009387688,psychogenic-seizure,submitted,100.0,4.684351444244385
