belief_epileptic-seizure,belief_psychogenic-seizure,belief_syncope,queried_feature,observed_feature_value,observed_reward,runtime
0.3333333333333333,0.3333333333333333,0.3333333333333333,S-triggered-by-stress,no,-1.0,25.97013235092163
0.10054054054054055,0.2702702702702703,0.6291891891891892,S-onset-during-sleep,no,-1.0,28.136571168899536
0.059295482084126716,0.1330707979920374,0.8076337199238359,S-pallor,yes,-1.0,31.460187435150146
0.04317367654063578,0.08538351292306909,0.8714428105362951,syncope,submitted,100.0,3.3421449661254883
