belief_epileptic-seizure,belief_psychogenic-seizure,belief_syncope,queried_feature,observed_feature_value,observed_reward,runtime
0.3333333333333333,0.3333333333333333,0.3333333333333333,S-like-hammer-blow,no,-1.0,31.14866542816162
0.3333781783936499,0.14893044531144894,0.5176913762949011,S-recall-bad-memories,no,-1.0,27.61616063117981
0.27179472264418036,0.09161380216678756,0.636591475189032,S-oral-automatisms,no,-1.0,30.117655038833618
0.062392785758373565,0.04075332065301357,0.8968538935886129,S-chest-pain,no,-1.0,30.82612109184265
0.050666928035241816,0.02258984591132901,0.9267432260534292,S-limp-limbs,yes,-1.0,27.698946237564087
0.01654430156972472,0.012581928370930508,0.9708737700593448,S-deja-vu,no,-1.0,11.460531234741211
0.008810779893718935,0.007217550758884252,0.9839716693473968,syncope,submitted,100.0,3.5478227138519287
