belief_epileptic-seizure,belief_psychogenic-seizure,belief_syncope,queried_feature,observed_feature_value,observed_reward,runtime
0.3333333333333333,0.3333333333333333,0.3333333333333333,S-like-electricity,no,-1.0,23.21061658859253
0.3025510204081633,0.2066326530612245,0.49081632653061225,S-unusual-positions,no,-1.0,26.89217448234558
0.16628548747665162,0.06726965589959173,0.7664448566237567,S-feel-hot-cold,no,-1.0,26.040200233459473
0.11066145043634393,0.0073054314950378035,0.8820331180686183,S-postictal-relief,yes,-1.0,25.14271116256714
0.014260033059991063,8.141245607353428e-05,0.9856585544839354,syncope,submitted,100.0,4.976926803588867
