belief_epileptic-seizure,belief_psychogenic-seizure,belief_syncope,queried_feature,observed_feature_value,observed_reward,runtime
0.3333333333333333,0.3333333333333333,0.3333333333333333,S-shaking-over-1min,no,-1.0,28.363933086395264
0.29465930018416203,0.1534683855125844,0.5518723143032536,S-consciousness-drift,no,-1.0,26.51820731163025
0.35298064727302486,0.05114357023035065,0.5958757824966245,S-limp-limbs,no,-1.0,27.2113037109375
0.8216470764453161,0.0500063443798002,0.12834657917488368,S-oral-automatisms,no,-1.0,27.572089910507202
0.6143634324406814,0.054341941643457466,0.3312946259158612,R-poor-coordination,no,-1.0,29.40371870994568
0.6412383830187931,0.03602348899426063,0.3227381279869462,S-triggered-by-standing,yes,-1.0,26.059119939804077
0.294579223239574,0.02388909632280629,0.6815316804376198,S-olfactory-hallucination,no,-1.0,28.336397409439087
0.323459496750959,0.015455993359460013,0.661084509889581,S-like-knife-through-head,no,-1.0,29.977799654006958
0.36265221420417537,0.007470346469084605,0.6298774393267399,S-sensation-of-passivity,no,-1.0,32.69458270072937
0.36548545789712483,0.005312040468774438,0.6292025016341007,S-rapid-head-turning,no,-1.0,28.191250801086426
0.2821513649686448,0.002224515357027688,0.7156241196743275,S-chest-pain,yes,-1.0,31.333072185516357
0.22994277723354742,0.008369018175349591,0.761688204591103,S-like-hammer-blow,no,-1.0,28.90751051902771
0.25604066793090746,0.003122275867130175,0.7408370562019625,S-locked-in,yes,-1.0,28.962711811065674
0.5608682083467825,0.00553036155201309,0.43360143010120433,S-like-electricity,no,-1.0,31.481021404266357
0.5139631140474,0.002595889764390849,0.4834409961882091,S-pallor,yes,-1.0,27.39151382446289
0.48809539055471757,0.0016293489028407291,0.5102752605424417,S-triggered-by-stress,no,-1.0,31.09928250312805
0.16910283930633582,0.0011380952463013318,0.8297590654473629,S-rigid-limbs,yes,-1.0,27.798199892044067
0.553106909445241,0.002636783504446629,0.4442563070503123,S-leg-automatisms,no,-1.0,30.337881088256836
0.4801464864459478,0.0015013641139333595,0.5183521494401189,S-manual-automatisms,no,-1.0,27.00339674949646
0.26007721136506556,0.0009251658656467573,0.7389976227692876,S-visual-auditory-awareness,yes,-1.0,28.425187587738037
0.43646414748374657,0.0015362947326929373,0.5619995577835606,S-feel-hot-cold,yes,-1.0,28.341363668441772
0.29050057629398834,0.0018816526255295042,0.7076177710804823,S-brief-jerks,yes,-1.0,29.77449107170105
0.7072429541009067,0.010583708913058877,0.2821733369860344,S-frightened-to-death,no,-1.0,25.41950821876526
0.7556414504435364,0.005380189014000709,0.23897836054246302,S-onset-during-sleep,no,-1.0,27.096746921539307
0.6575900496089084,0.0029315840732149663,0.33947836631787676,S-palpitations,no,-1.0,30.186625719070435
0.8121445775165932,0.0019227227459391873,0.18593269973746762,S-postictal-relief,yes,-1.0,35.90820074081421
0.840942889098872,0.001956060921317794,0.15710104997981023,S-time-in-slow-motion,yes,-1.0,37.697412967681885
0.9672111495902674,0.003450026321755707,0.029338824087976847,S-triggered-by-blood,no,-1.0,26.599741458892822
0.9776743302285983,0.0026099581343178736,0.01971571163708396,S-recall-bad-memories,no,-1.0,21.806146144866943
0.9817205866670914,0.0014830713968776825,0.01679634193603086,S-want-to-know-what-happens,no,-1.0,17.38084125518799
0.9811403021363618,0.0014503507410037581,0.017409347122634294,epileptic-seizure,submitted,-100.0,6.075991153717041
