belief_epileptic-seizure,belief_psychogenic-seizure,belief_syncope,queried_feature,observed_feature_value,observed_reward,runtime
0.3333333333333333,0.3333333333333333,0.3333333333333333,S-onset-during-sleep,yes,-1.0,26.93162441253662
0.3882189239332096,0.585343228200371,0.026437847866419287,S-like-hammer-blow,no,-1.0,30.405136346817017
0.5057142857142857,0.4541759929778364,0.04010972130787798,S-palpitations,no,-1.0,33.47285294532776
0.527767445267735,0.44748163666498797,0.02475091806727704,S-brief-jerks,no,-1.0,33.98403739929199
0.5918311900913157,0.37584358251200756,0.032325227396676766,S-violent-shaking,yes,-1.0,31.682915449142456
0.5144401948655496,0.4830237203970859,0.0025360847373645263,S-aware-of-shaking,no,-1.0,36.06442832946777
0.5808419678783343,0.41537377871847253,0.0037842534031931013,S-locked-in,no,-1.0,28.83323049545288
0.5449475153994128,0.44743885581255183,0.0076136287880354345,S-like-knife-through-head,no,-1.0,39.52207851409912
0.6078692896774031,0.38250761902254465,0.009623091300052313,S-olfactory-hallucination,no,-1.0,31.456603288650513
0.5960185011541219,0.3928678666481649,0.011113632197712994,S-limp-limbs,no,-1.0,33.14789700508118
0.6691085625880648,0.32935212863186847,0.0015393087800666372,S-recall-bad-memories,no,-1.0,29.860307693481445
0.6676470628019274,0.330615442842554,0.0017374943555186061,S-consciousness-drift,no,-1.0,34.444406270980835
0.8012621104943354,0.19623191765310039,0.002505971852564219,S-oral-automatisms,yes,-1.0,28.461415767669678
0.8027123939420182,0.19716700012748128,0.0001206059305005109,S-want-to-know-what-happens,yes,-1.0,27.369683265686035
0.7616171393079112,0.23827485944901008,0.00010800124307886006,S-rigid-limbs,no,-1.0,31.23371648788452
0.671399461673487,0.32827472437036953,0.00032581395614339205,S-deja-vu,yes,-1.0,34.378000259399414
0.645998818375631,0.35396464012067713,3.654150369171752e-05,S-visual-auditory-awareness,yes,-1.0,30.662472009658813
0.5091922113909775,0.4907903857005176,1.740290850497566e-05,S-sensation-of-passivity,no,-1.0,31.342745065689087
0.45268065978226785,0.5472988934162355,2.0446801496663598e-05,S-leg-automatisms,no,-1.0,39.22868585586548
0.4149585469886989,0.5850078635126594,3.358949864173011e-05,S-frightened-to-death,no,-1.0,34.08591938018799
0.45608906928463905,0.5438719111284179,3.901958694305248e-05,S-triggered-by-standing,no,-1.0,40.67853021621704
0.40996343003880054,0.5900199419889777,1.662797222161379e-05,S-pallor,no,-1.0,35.87583780288696
0.3091233405636886,0.6908725000740458,4.159362265589992e-06,S-shaking-over-1min,yes,-1.0,38.28352880477905
0.22261314075065822,0.7773863865476612,4.7270168050683423e-07,S-triggered-by-blood,yes,-1.0,32.43138313293457
0.1719190889966817,0.8280798724796443,1.038523674079951e-06,S-triggered-by-stress,yes,-1.0,32.16700744628906
0.15846431223756136,0.841535246605855,4.4115658353868273e-07,R-febrile-seizures,no,-1.0,39.48667931556702
0.11013878032302012,0.8898608572609538,3.6241602617468394e-07,R-poor-coordination,no,-1.0,35.49723553657532
0.09847685731122738,0.9015227372770505,4.054117221807307e-07,S-unusual-positions,no,-1.0,41.104573488235474
0.08630855101247599,0.913690826684723,6.223028009546405e-07,S-feel-hot-cold,no,-1.0,37.95579385757446
0.14939139767409806,0.8506081982072254,4.0411867658905536e-07,S-rapid-head-turning,yes,-1.0,31.697371244430542
0.09516694367599983,0.9048330253135326,3.10104675503269e-08,S-chest-pain,no,-1.0,32.24635910987854
0.10359164978573279,0.8964083179994456,3.2214821611756225e-08,S-time-in-slow-motion,no,-1.0,29.993609189987183
0.1317409099560978,0.868259035900568,5.41433340988003e-08,S-like-electricity,yes,-1.0,20.546387672424316
0.07221962585766076,0.9277803713711336,2.7712056669498583e-09,S-postictal-relief,no,-1.0,16.318179607391357
0.07800969497893295,0.9219903022911029,2.7299641404484264e-09,S-manual-automatisms,no,-1.0,8.346218824386597
0.04015510673782576,0.9598448883306919,4.931482278118704e-09,psychogenic-seizure,submitted,-100.0,0.021577119827270508
