belief_epileptic-seizure,belief_psychogenic-seizure,belief_syncope,queried_feature,observed_feature_value,observed_reward,runtime
0.3333333333333333,0.3333333333333333,0.3333333333333333,S-deja-vu,no,-1.0,27.932973623275757
0.25124254473161034,0.2706262425447316,0.4781312127236581,R-poor-coordination,no,-1.0,31.821528673171997
0.19724339464916796,0.17991791043232092,0.6228386949185112,S-like-electricity,no,-1.0,31.177772283554077
0.11829897421371006,0.07369758198332617,0.8080034438029637,S-like-knife-through-head,no,-1.0,32.471598625183105
0.08563769289302062,0.030665450597458614,0.8836968565095207,S-triggered-by-stress,yes,-1.0,30.184443473815918
0.13094267660092884,0.03877212304006027,0.830285200359011,S-palpitations,yes,-1.0,27.641583681106567
0.0148644846789692,0.025269954841625458,0.9598655604794054,S-triggered-by-standing,yes,-1.0,11.502089262008667
0.0018797802711524548,0.006150802437212498,0.991969417291635,syncope,submitted,100.0,2.902578353881836
