belief_epileptic-seizure,belief_psychogenic-seizure,belief_syncope,queried_feature,observed_feature_value,observed_reward,runtime
0.3333333333333333,0.3333333333333333,0.3333333333333333,R-poor-coordination,yes,-1.0,19.597724437713623
0.3706172599845549,0.558288396350645,0.07109434366480011,S-pallor,no,-1.0,19.94782328605652
0.3548517772398347,0.622566494849384,0.02258172791078122,S-limp-limbs,no,-1.0,20.152201175689697
0.5023984015627053,0.4936571043023476,0.003944494134947157,S-visual-auditory-awareness,no,-1.0,22.554625988006592
0.6061171507836393,0.38705887524872856,0.006823973967632189,S-like-electricity,yes,-1.0,21.66837215423584
0.5168992892980894,0.48255736540682675,0.0005433452950838144,S-consciousness-drift,no,-1.0,19.265142679214478
0.7420930806702062,0.2569694577449737,0.0009374615848202005,S-palpitations,no,-1.0,19.856935739517212
0.8026105312451719,0.1967899479698578,0.000599520784970319,R-febrile-seizures,no,-1.0,20.10172986984253
0.7832495688647092,0.2160708507221721,0.0006795804131186419,S-onset-during-sleep,no,-1.0,24.325777053833008
0.8115620498940813,0.1869053980968573,0.0015325520090614386,S-violent-shaking,yes,-1.0,22.220162630081177
0.7964638792523725,0.20340036922705737,0.00013575152057011537,S-aware-of-shaking,no,-1.0,21.236334323883057
0.8725205490272924,0.1272829124724033,0.00019653850030441357,S-oral-automatisms,yes,-1.0,19.43132519721985
0.9011093473411176,0.09888090149216545,9.75116671696294e-06,S-rapid-head-turning,no,-1.0,23.576727628707886
0.9264513728418076,0.07352893365725639,1.96935009360969e-05,S-brief-jerks,no,-1.0,7.4191179275512695
0.9572967198043342,0.042679580547739016,2.3699647926748693e-05,epileptic-seizure,submitted,100.0,2.7415883541107178
