belief_epileptic-seizure,belief_psychogenic-seizure,belief_syncope,queried_feature,observed_feature_value,observed_reward,runtime
0.3333333333333333,0.3333333333333333,0.3333333333333333,S-deja-vu,no,-1.0,27.98648762702942
0.34742268041237123,0.28067010309278356,0.37190721649484537,R-febrile-seizures,no,-1.0,25.679279565811157
0.3787439640677104,0.2618467784540729,0.35940925747821667,S-chest-pain,no,-1.0,29.977648735046387
0.4918453641532033,0.1740810231612373,0.3340736126855595,S-manual-automatisms,no,-1.0,25.722230434417725
0.31344176241725324,0.1262073750591139,0.5603508625236329,R-poor-coordination,no,-1.0,28.776241302490234
0.3408176653678626,0.08746477042889633,0.5717175642032409,S-feel-hot-cold,yes,-1.0,29.588339805603027
0.2152552038247926,0.1016555768132958,0.6830892193619116,S-brief-jerks,no,-1.0,28.665921449661255
0.2518332837474043,0.05010601622048283,0.6980607000321127,S-like-hammer-blow,no,-1.0,30.646640062332153
0.2867059112202371,0.019112653026854318,0.6941814357529086,S-leg-automatisms,no,-1.0,30.79218077659607
0.23266280829342717,0.010173214011087213,0.7571639776954856,S-time-in-slow-motion,no,-1.0,29.32236909866333
0.23560537313534993,0.004413533800497522,0.7599810930641526,S-palpitations,no,-1.0,28.09581708908081
0.40976342863720566,0.004076342396582934,0.5861602289662113,S-frightened-to-death,no,-1.0,31.74905562400818
0.4675861739372077,0.0022131539491023573,0.5302006721136898,S-triggered-by-standing,yes,-1.0,26.359068155288696
0.16079339105612772,0.0010986250673015998,0.8381079838765707,S-sensation-of-passivity,no,-1.0,28.869717121124268
0.16204299921643556,0.0007811823902674552,0.8371758183932969,S-triggered-by-blood,no,-1.0,30.211588144302368
0.22531332648589258,0.000812918983635739,0.7738737545304717,S-aware-of-shaking,no,-1.0,32.105921030044556
0.22696712819050927,0.0003508273152971271,0.7726820444941935,S-olfactory-hallucination,no,-1.0,36.361786127090454
0.2494817393914762,0.0002272210737633805,0.7502910395347605,S-oral-automatisms,no,-1.0,35.49139165878296
0.08784780123670824,0.00011628153092868033,0.912035917232363,S-rigid-limbs,no,-1.0,34.98245143890381
0.03616951899357817,4.208817053272367e-05,0.9637883928358891,S-consciousness-drift,no,-1.0,28.33700156211853
0.03997171931729727,1.2939321978153042e-05,0.9600153413607245,S-pallor,yes,-1.0,20.012497901916504
0.03610862786445204,7.725467470099083e-06,0.9638836466680778,S-onset-during-sleep,no,-1.0,15.50724744796753
0.022434522396028278,3.0053563283787966e-06,0.9775624722476434,S-triggered-by-stress,no,-1.0,10.432640314102173
0.004865775830773432,1.314163991662178e-06,0.9951329100052348,syncope,submitted,100.0,5.144923448562622
