belief_epileptic-seizure,belief_psychogenic-seizure,belief_syncope,queried_feature,observed_feature_value,observed_reward,runtime
0.3333333333333333,0.3333333333333333,0.3333333333333333,S-like-hammer-blow,yes,-1.0,29.73138999938965
0.1651898734177215,0.7987341772151899,0.036075949367088606,S-aware-of-shaking,no,-1.0,31.08016324043274
0.20115377340646862,0.7407890531753227,0.0580571734182086,S-olfactory-hallucination,yes,-1.0,30.516528606414795
0.08454083005233586,0.9154590083566285,1.6159103562529494e-07,S-deja-vu,yes,-1.0,31.36055612564087
0.0761317705795418,0.9238682124582386,1.6962219679171303e-08,psychogenic-seizure,submitted,-100.0,5.229910373687744
