belief_epileptic-seizure,belief_psychogenic-seizure,belief_syncope,queried_feature,observed_feature_value,observed_reward,runtime
0.3333333333333333,0.3333333333333333,0.3333333333333333,S-triggered-by-stress,yes,-1.0,29.482197761535645
0.4371084337349398,0.3614457831325301,0.2014457831325301,S-locked-in,no,-1.0,28.353830337524414
0.3703233240635307,0.2636903492734622,0.36598632666300707,S-leg-automatisms,yes,-1.0,32.91419768333435
0.5479976262444021,0.45200114846189327,1.2252937046711954e-06,S-manual-automatisms,no,-1.0,28.069600582122803
0.44421855607046534,0.5557779582572716,3.4856722629734966e-06,S-brief-jerks,no,-1.0,31.58277201652527
0.587258847977455,0.4127357852344467,5.3667880984866575e-06,S-feel-hot-cold,yes,-1.0,29.720400094985962
0.3670449670427012,0.6329465722392321,8.460718066755157e-06,S-sensation-of-passivity,yes,-1.0,29.57269787788391
0.3363230397080585,0.6636752819048523,1.6783870892644223e-06,S-pallor,yes,-1.0,25.41863751411438
0.3650993569336077,0.6348979430052569,2.70006113526638e-06,S-triggered-by-blood,no,-1.0,30.329407453536987
0.36559227964555274,0.6344053237568569,2.396597590340537e-06,S-triggered-by-standing,no,-1.0,36.48117733001709
0.3889918328977319,0.6110069581761676,1.2089261004642029e-06,S-time-in-slow-motion,yes,-1.0,32.24118947982788
0.23743599620344175,0.7625638440419511,1.597546071615315e-07,S-rigid-limbs,yes,-1.0,12.49290156364441
0.24793991695496914,0.7520600466354709,3.640956006722124e-08,psychogenic-seizure,submitted,100.0,6.1116883754730225
