belief_epileptic-seizure,belief_psychogenic-seizure,belief_syncope,queried_feature,observed_feature_value,observed_reward,runtime
0.3333333333333333,0.3333333333333333,0.3333333333333333,S-aware-of-shaking,no,-1.0,26.845932960510254
0.29999999999999993,0.1713681241184767,0.5286318758815233,S-rigid-limbs,yes,-1.0,29.706267833709717
0.48726425585788474,0.26287528612925376,0.24986045801286152,S-deja-vu,yes,-1.0,27.79232907295227
0.6522585012033509,0.2957589632793843,0.05198253551726472,S-like-electricity,no,-1.0,27.05091094970703
0.6747329843108345,0.20895387914732114,0.11631313654184439,S-violent-shaking,no,-1.0,27.628122806549072
0.5141707201588032,0.11915913306798012,0.36667014677321674,S-leg-automatisms,no,-1.0,28.014440298080444
0.34403414590854303,0.06972799304679682,0.5862378610446601,S-like-knife-through-head,no,-1.0,26.669122219085693
0.2709357421629545,0.031563419640935085,0.6975008381961104,R-poor-coordination,yes,-1.0,29.8245952129364
0.5452130560663482,0.09567719668790113,0.35910974724575057,S-brief-jerks,no,-1.0,26.197460412979126
0.4713896152501547,0.04646865891305847,0.48214172583678677,S-limp-limbs,yes,-1.0,31.05259418487549
0.224736227295972,0.03778881643076438,0.7374749562732636,S-olfactory-hallucination,no,-1.0,29.745840311050415
0.1590930015022824,0.021016453097582412,0.8198905454001352,R-febrile-seizures,no,-1.0,33.57991671562195
0.10952739587132088,0.01627905047732815,0.874193553651351,S-oral-automatisms,yes,-1.0,31.357515573501587
0.6161246537389085,0.06888352719409586,0.31499181906699564,S-triggered-by-blood,no,-1.0,27.923844575881958
0.5828192958000438,0.06502160158998252,0.35215910260997363,S-frightened-to-death,no,-1.0,27.835973501205444
0.520220713484927,0.0368182057980461,0.44296108071702683,S-pallor,yes,-1.0,29.933587789535522
0.3643219661471934,0.022722398187920316,0.6129556356648863,S-postictal-relief,no,-1.0,31.39837121963501
0.3237397412175585,0.013932014413034466,0.6623282443694071,S-manual-automatisms,no,-1.0,27.719781637191772
0.09400090944642445,0.006136118203227649,0.8998629723503478,S-consciousness-drift,yes,-1.0,28.696150541305542
0.1164245350879461,0.017484363922318308,0.8660911009897356,S-chest-pain,no,-1.0,27.382988691329956
0.09462070192222355,0.009699549429977618,0.8956797486477989,S-want-to-know-what-happens,yes,-1.0,31.27761197090149
0.07686374663174037,0.007526888132656947,0.9156093652356027,S-shaking-over-1min,yes,-1.0,32.06857943534851
0.276146799736485,0.031689487499560846,0.6921637127639542,S-time-in-slow-motion,no,-1.0,27.689512491226196
0.1824057853666455,0.011957010147151033,0.8056372044862036,S-unusual-positions,yes,-1.0,32.67415952682495
0.5337826568232198,0.04033297757020113,0.42588436560657905,S-onset-during-sleep,no,-1.0,24.421427011489868
0.29599437881173285,0.018671679590533525,0.6853339415977335,S-sensation-of-passivity,no,-1.0,35.62129354476929
0.19458065384991918,0.011547266255338712,0.7938720798947422,S-recall-bad-memories,no,-1.0,38.82253909111023
0.13891811721058228,0.006220309281705025,0.8548615735077127,S-like-hammer-blow,no,-1.0,39.6112425327301
0.09455475449783553,0.001891397368735997,0.9035538481334284,S-triggered-by-standing,no,-1.0,39.682865619659424
0.14167166808186174,0.002565182607567514,0.8557631493105707,S-locked-in,yes,-1.0,36.12297248840332
0.25715248352033326,0.005019900614808065,0.7378276158648587,S-rapid-head-turning,no,-1.0,30.597257137298584
0.11724655756617929,0.0016554086203731555,0.8810980338134475,S-visual-auditory-awareness,yes,-1.0,25.744975805282593
0.14138854215501134,0.002633702587387565,0.855977755257601,S-triggered-by-stress,yes,-1.0,19.50082802772522
0.21117028046676217,0.0032526646286200455,0.7855770549046178,S-palpitations,no,-1.0,13.192513704299927
0.25356137526517375,0.0027654417808034423,0.7436731829540227,S-feel-hot-cold,no,-1.0,6.744653940200806
0.4046052341534232,0.0017800521089991186,0.5936147137375777,epileptic-seizure,submitted,100.0,0.018830299377441406
