belief_epileptic-seizure,belief_psychogenic-seizure,belief_syncope,queried_feature,observed_feature_value,observed_reward,runtime
0.3333333333333333,0.3333333333333333,0.3333333333333333,S-chest-pain,no,-1.0,25.68794584274292
0.3792270531400966,0.25885668276972623,0.36191626409017713,S-palpitations,no,-1.0,31.052248001098633
0.5352016778045373,0.17656821948901388,0.2882301027064488,S-postictal-relief,no,-1.0,25.216171741485596
0.746487178854254,0.05606109632102045,0.19745172482472548,S-leg-automatisms,no,-1.0,26.772266149520874
0.8847078911274171,0.004363791490302196,0.11092831738228057,S-pallor,yes,-1.0,29.7555730342865
0.9772123010823182,2.095129799476109e-05,0.022766747619687146,epileptic-seizure,submitted,-100.0,3.5290751457214355
