belief_epileptic-seizure,belief_psychogenic-seizure,belief_syncope,queried_feature,observed_feature_value,observed_reward,runtime
0.3333333333333333,0.3333333333333333,0.3333333333333333,S-aware-of-shaking,yes,-1.0,26.30695652961731
0.3066385669125395,0.6269757639620653,0.06638566912539515,S-feel-hot-cold,yes,-1.0,30.45107626914978
0.15237164711661474,0.7644223243059417,0.08320602857744358,psychogenic-seizure,submitted,100.0,3.13332200050354
