belief_epileptic-seizure,belief_psychogenic-seizure,belief_syncope,queried_feature,observed_feature_value,observed_reward,runtime
0.3333333333333333,0.3333333333333333,0.3333333333333333,R-febrile-seizures,no,-1.0,22.761189222335815
0.27004575577709633,0.4108062512110269,0.3191479930118768,S-feel-hot-cold,yes,-1.0,26.912240028381348
0.11163584174410135,0.555580888982007,0.3327832692738916,S-unusual-positions,no,-1.0,30.174747228622437
0.08350106065418021,0.480549991818644,0.43594894752717583,S-deja-vu,yes,-1.0,25.194846630096436
0.12410099048077856,0.8003750265304019,0.07552398298881946,S-rapid-head-turning,yes,-1.0,26.563881158828735
0.08443924459823657,0.9093707242018811,0.006190031199882237,S-postictal-relief,yes,-1.0,28.78079843521118
0.050275175148966005,0.9457149484504953,0.004009876400538755,psychogenic-seizure,submitted,100.0,2.534045696258545
