belief_epileptic-seizure,belief_psychogenic-seizure,belief_syncope,queried_feature,observed_feature_value,observed_reward,runtime
0.3333333333333333,0.3333333333333333,0.3333333333333333,S-onset-during-sleep,no,-1.0,30.41256856918335
0.24929498025944724,0.20812182741116753,0.5425831923293852,S-consciousness-drift,yes,-1.0,28.572991371154785
0.238712306708503,0.45848229521124145,0.30280539808025553,S-rigid-limbs,no,-1.0,27.365620613098145
0.1317139899409227,0.2965212844667945,0.5717647255922829,S-triggered-by-blood,no,-1.0,26.950486660003662
0.14095729736750875,0.31665655451288416,0.5423861481196072,S-locked-in,no,-1.0,27.573989868164062
0.0893973245516017,0.17293569053647392,0.7376669849119245,R-febrile-seizures,no,-1.0,28.85109043121338
0.07715821757672527,0.17031173024172397,0.7525300521815508,S-sensation-of-passivity,no,-1.0,26.06706666946411
0.06263302971091425,0.13006049225376612,0.8073064780353196,S-unusual-positions,no,-1.0,29.400712490081787
0.039407922202771443,0.07097243553017256,0.8896196422670559,S-brief-jerks,no,-1.0,30.18120241165161
0.0353316794142702,0.03574443084644015,0.9289238897392896,S-violent-shaking,no,-1.0,29.361133813858032
0.012000411701276251,0.009085351767616476,0.9789142365311073,S-olfactory-hallucination,no,-1.0,9.902211427688599
0.010237885165203351,0.006089392932735811,0.9836727219020609,syncope,submitted,100.0,3.3120768070220947
