belief_epileptic-seizure,belief_psychogenic-seizure,belief_syncope,queried_feature,observed_feature_value,observed_reward,runtime
0.3333333333333333,0.3333333333333333,0.3333333333333333,S-want-to-know-what-happens,yes,-1.0,28.651028871536255
0.3111692637088141,0.2972522897585345,0.39157844653265134,S-leg-automatisms,yes,-1.0,26.956127882003784
0.47470601223317443,0.5252921857315578,1.8020352676782049e-06,S-limp-limbs,yes,-1.0,27.294256687164307
0.3463192382552919,0.6536765438604794,4.2178842286005945e-06,S-time-in-slow-motion,yes,-1.0,31.27457046508789
0.2057901609824286,0.7942091155335539,7.234840175563981e-07,S-feel-hot-cold,yes,-1.0,27.982227325439453
0.09551773790662962,0.9044811327391712,1.1293541991186546e-06,S-frightened-to-death,yes,-1.0,29.93374752998352
0.037168654495146794,0.9628309178275611,4.2767729190882447e-07,psychogenic-seizure,submitted,100.0,5.22528338432312
