belief_epileptic-seizure,belief_psychogenic-seizure,belief_syncope,queried_feature,observed_feature_value,observed_reward,runtime
0.3333333333333333,0.3333333333333333,0.3333333333333333,S-locked-in,yes,-1.0,19.45858120918274
0.410783055198973,0.44287548138639277,0.14634146341463414,S-visual-auditory-awareness,no,-1.0,17.164461612701416
0.45217824069959656,0.31682693162226055,0.230994827678143,S-chest-pain,no,-1.0,21.23563003540039
0.5086989190406942,0.24329507433968695,0.24800600661961889,S-like-electricity,yes,-1.0,17.01138734817505
0.5731616373213356,0.4007487466980355,0.026089615980628856,S-triggered-by-standing,no,-1.0,21.08989691734314
0.604421728733957,0.38253484134384497,0.013043429922197924,S-sensation-of-passivity,no,-1.0,21.19725227355957
0.6157931096147481,0.3666446498376017,0.01756224054765014,S-rapid-head-turning,no,-1.0,20.70028591156006
0.6726488034950332,0.2896673972058895,0.03768379929907737,S-aware-of-shaking,no,-1.0,19.23960542678833
0.7575583621964,0.18635288794892074,0.05608874985467916,S-leg-automatisms,yes,-1.0,23.61764669418335
0.778240670008904,0.2217591996290052,1.3036209080995405e-07,S-frightened-to-death,no,-1.0,24.251689195632935
0.846907066689651,0.15309278337385632,1.4993649265567834e-07,S-shaking-over-1min,yes,-1.0,19.658985376358032
0.8251939882450698,0.1748059886997222,2.3055208069133625e-08,S-triggered-by-blood,no,-1.0,21.585055351257324
0.8255003649450329,0.174499614610969,2.0443998147322995e-08,S-like-hammer-blow,no,-1.0,21.08439302444458
0.913715162445546,0.08628481119997591,2.63544780732352e-08,S-limp-limbs,yes,-1.0,23.06091570854187
0.8612692522525662,0.1387306879719255,5.977550830578826e-08,S-violent-shaking,yes,-1.0,20.292051792144775
0.8484531195111692,0.1515468751739036,5.314927105264111e-09,S-triggered-by-stress,yes,-1.0,21.011642456054688
0.8713097373062276,0.12869026017834934,2.5154229788433546e-09,S-rigid-limbs,yes,-1.0,23.064682722091675
0.8775839896965056,0.1224160097505399,5.529543726170573e-10,S-pallor,yes,-1.0,23.3924298286438
0.890530719213481,0.10946927995499155,8.315273330536974e-10,S-feel-hot-cold,yes,-1.0,22.86333394050598
0.7682781183328139,0.2317218798577254,1.8094607173196178e-09,S-recall-bad-memories,no,-1.0,22.252209663391113
0.8146150123459358,0.18538498548371096,2.1703531457777283e-09,S-postictal-relief,yes,-1.0,23.14193296432495
0.7703438550397632,0.22965614272722246,2.2330143490479024e-09,S-want-to-know-what-happens,yes,-1.0,25.643770694732666
0.7783384167690014,0.22166158110159145,2.129407150650772e-09,S-olfactory-hallucination,no,-1.0,23.263073444366455
0.8171682575119025,0.18283173985483833,2.6332591702994045e-09,S-brief-jerks,no,-1.0,23.637563705444336
0.8883492168288849,0.11165077983715152,3.3339636886814808e-09,S-deja-vu,yes,-1.0,24.669323682785034
0.9044569896387125,0.09554300996561951,3.956681182693434e-10,R-poor-coordination,no,-1.0,21.587355375289917
0.917889862076684,0.08211013742361042,4.997055585016156e-10,S-oral-automatisms,yes,-1.0,25.347747325897217
0.9369529907275863,0.06304700924790915,2.4504651028987978e-11,R-febrile-seizures,no,-1.0,24.179245710372925
0.928461539379832,0.07153846059131343,2.8854595878461224e-11,S-onset-during-sleep,yes,-1.0,22.41749119758606
0.9198526620404743,0.08014733795757888,1.946788379242168e-12,S-unusual-positions,no,-1.0,20.68175745010376
0.9297417445300687,0.07025825546648516,3.4462645709658035e-12,S-consciousness-drift,no,-1.0,17.83122444152832
0.9727347445003387,0.027265255495328197,4.333171073519148e-12,S-palpitations,no,-1.0,16.646281719207764
0.980539448441434,0.01946055155598322,2.5827404827152843e-12,S-manual-automatisms,no,-1.0,12.14681077003479
0.9707751371779443,0.02922486281308218,8.973516665680087e-12,epileptic-seizure,submitted,100.0,4.514723777770996
