belief_epileptic-seizure,belief_psychogenic-seizure,belief_syncope,queried_feature,observed_feature_value,observed_reward,runtime
0.3333333333333333,0.3333333333333333,0.3333333333333333,S-deja-vu,yes,-1.0,25.57343602180481
0.44698354661791595,0.5009140767824498,0.05210237659963437,S-triggered-by-standing,no,-1.0,23.801358461380005
0.415318576996633,0.5617300578606631,0.022951365142703923,R-febrile-seizures,yes,-1.0,26.85855221748352
0.7114489866725497,0.28855089861098815,1.1471646205619108e-07,S-consciousness-drift,no,-1.0,30.68404221534729
0.8329274474259817,0.16707239117002506,1.6140399328633097e-07,S-violent-shaking,yes,-1.0,29.424776315689087
0.7712679185835896,0.22873206792685952,1.3489551035530188e-08,S-chest-pain,no,-1.0,33.3670072555542
0.7874567438359292,0.21254324302006544,1.314400525961836e-08,S-triggered-by-blood,no,-1.0,30.822348833084106
0.7357716774371132,0.26422831167660293,1.0886283912204403e-08,S-frightened-to-death,no,-1.0,32.9255313873291
0.7670141037229665,0.23298588428275474,1.1994278712255509e-08,S-like-hammer-blow,no,-1.0,29.981250524520874
0.8467900098315116,0.15320997474645856,1.5422029766402108e-08,S-brief-jerks,yes,-1.0,36.07876110076904
0.5736802264468653,0.42631977127137427,2.2817604100414494e-09,S-triggered-by-stress,yes,-1.0,28.61888599395752
0.5496532075380306,0.4503467914544398,1.0075298482230007e-09,S-leg-automatisms,yes,-1.0,29.581942081451416
0.44141355087902634,0.5585864491209718,1.8305961573503106e-15,S-palpitations,no,-1.0,31.70439076423645
0.4556434038520088,0.54435659614799,1.1173166355950685e-15,S-locked-in,yes,-1.0,33.25271534919739
0.3680016087408738,0.6319983912591258,3.2148133834024514e-16,R-poor-coordination,no,-1.0,34.08206272125244
0.33565274089487096,0.6643472591051286,3.568024076454449e-16,S-aware-of-shaking,no,-1.0,34.98395133018494
0.3988062648353285,0.6011937351646708,5.602642431316389e-16,S-unusual-positions,yes,-1.0,39.59950923919678
0.3014883845032687,0.6985116154967312,5.73837750381162e-17,S-rigid-limbs,yes,-1.0,30.494667053222656
0.25526162613569253,0.7447383738643074,1.0603914342631392e-17,S-like-knife-through-head,no,-1.0,32.91780877113342
0.3090248281640859,0.6909751718359141,1.4545928038998994e-17,S-limp-limbs,yes,-1.0,26.308439254760742
0.16433002375558237,0.8356699762444176,1.8612543509908008e-17,S-postictal-relief,no,-1.0,31.53187870979309
0.17610315318251,0.82389684681749,1.819075725573773e-17,S-sensation-of-passivity,no,-1.0,32.296584129333496
0.1455930741825285,0.8544069258174716,1.987548422821439e-17,S-visual-auditory-awareness,no,-1.0,31.146762371063232
0.1643337505418797,0.8356662494581202,3.216929118602349e-17,S-shaking-over-1min,yes,-1.0,33.57373380661011
0.11178693203589328,0.8882130679641067,3.4534022027894017e-18,S-olfactory-hallucination,no,-1.0,31.963680028915405
0.10726092602962894,0.892739073970371,3.902919034817424e-18,S-feel-hot-cold,no,-1.0,33.63416290283203
0.18259736196373652,0.8174026380362635,2.4927452665667767e-18,S-manual-automatisms,yes,-1.0,29.638799905776978
0.17108656763842522,0.8289134323615748,2.0074091053281113e-19,S-pallor,no,-1.0,30.35457491874695
0.11731843402628024,0.8826815659737198,4.5665373155528585e-20,S-oral-automatisms,yes,-1.0,34.96923089027405
0.11701375589856046,0.8829862441014396,2.18808800888288e-21,S-onset-during-sleep,no,-1.0,43.25071740150452
0.10638723291116513,0.893612767088835,4.329823393141828e-21,S-want-to-know-what-happens,yes,-1.0,38.82370042800903
0.08548028608856134,0.9145197139114387,3.2834468192893225e-21,S-recall-bad-memories,no,-1.0,26.14744520187378
0.08501123960576482,0.9149887603942352,3.693921561873264e-21,S-like-electricity,no,-1.0,21.024725675582886
0.09258245550533528,0.9074175444946647,6.5262002274918336e-21,S-time-in-slow-motion,no,-1.0,14.817832946777344
0.11813440493971301,0.8818655950602869,1.1005289025881237e-20,S-rapid-head-turning,yes,-1.0,8.603470087051392
0.07426470701815809,0.925735292981842,8.33386358438572e-22,psychogenic-seizure,submitted,-100.0,0.021515607833862305
