belief_epileptic-seizure,belief_psychogenic-seizure,belief_syncope,queried_feature,observed_feature_value,observed_reward,runtime
0.3333333333333333,0.3333333333333333,0.3333333333333333,R-febrile-seizures,no,-1.0,25.214635610580444
0.300954225018599,0.3433692466585037,0.3556765283228973,S-consciousness-drift,no,-1.0,26.152718782424927
0.35167990451715636,0.14882936060513227,0.49949073487771123,S-manual-automatisms,yes,-1.0,26.69355821609497
0.6823173362474133,0.23439074539438678,0.08329191835819993,S-rigid-limbs,no,-1.0,13.995352983474731
0.5493300746359526,0.22118905714072376,0.22948086822332361,S-triggered-by-standing,no,-1.0,23.011277675628662
0.6399904213208037,0.2332596421641901,0.12674993651500613,S-triggered-by-blood,no,-1.0,28.438284397125244
0.6496655850054104,0.23628325401875905,0.11405116097583051,S-deja-vu,no,-1.0,30.118147134780884
0.608891988032226,0.23853936870915454,0.15256864325861944,R-poor-coordination,no,-1.0,31.46700644493103
0.6073825792962756,0.20221066808804578,0.1904067526156786,S-brief-jerks,no,-1.0,31.855520248413086
0.6442804616593323,0.12049100505867437,0.23522853328199345,S-want-to-know-what-happens,yes,-1.0,29.927246570587158
0.6564959137465105,0.11728438894573973,0.2262196973077498,S-olfactory-hallucination,no,-1.0,34.116289138793945
0.6467353223414738,0.09077220956858606,0.26249246808994003,S-violent-shaking,yes,-1.0,31.090797424316406
0.8387362686683868,0.13053810000472715,0.030725631326886212,S-shaking-over-1min,no,-1.0,11.1391761302948
0.8336373621342393,0.09010036339711094,0.07626227446864968,epileptic-seizure,submitted,100.0,3.8555281162261963
