belief_epileptic-seizure,belief_psychogenic-seizure,belief_syncope,queried_feature,observed_feature_value,observed_reward,runtime
0.3333333333333333,0.3333333333333333,0.3333333333333333,S-manual-automatisms,no,-1.0,26.659233808517456
0.15309633027522937,0.3096330275229358,0.5372706422018348,S-sensation-of-passivity,no,-1.0,25.90416646003723
0.12232732282528341,0.3103303883911725,0.5673422887835442,S-visual-auditory-awareness,no,-1.0,33.697871923446655
0.10153461830266722,0.22320145725119342,0.6752639244461395,S-frightened-to-death,no,-1.0,31.804481506347656
0.10112858350256898,0.18803850325442842,0.7108329132430026,S-violent-shaking,no,-1.0,30.952381372451782
0.04054522223817993,0.0752233688970514,0.8842314088647686,S-time-in-slow-motion,no,-1.0,34.13486051559448
0.03201561233043844,0.04523998283431293,0.9227444048352486,S-olfactory-hallucination,no,-1.0,34.39190912246704
0.027451427378083575,0.04063333141159501,0.9319152412103214,S-recall-bad-memories,no,-1.0,31.190825700759888
0.024454925834537913,0.03641632822616487,0.9391287459392972,S-rigid-limbs,no,-1.0,12.991872310638428
0.0074214017208086985,0.017271525125202875,0.9753070731539883,R-poor-coordination,no,-1.0,8.637215614318848
0.005981855759927783,0.01571862769264962,0.9782995165474226,syncope,submitted,100.0,4.064513683319092
