belief_epileptic-seizure,belief_psychogenic-seizure,belief_syncope,queried_feature,observed_feature_value,observed_reward,runtime
0.3333333333333333,0.3333333333333333,0.3333333333333333,S-onset-during-sleep,no,-1.0,28.091232299804688
0.21111288011463142,0.17624582072918324,0.6126412991561854,S-palpitations,yes,-1.0,25.52476453781128
0.028291388896484512,0.13560465725672208,0.8361039538467934,S-visual-auditory-awareness,yes,-1.0,27.01124119758606
0.03212124373911691,0.20312346271709752,0.7647552935437856,S-deja-vu,no,-1.0,30.195826530456543
0.018825130304458492,0.12822787754310164,0.8529469921524399,S-leg-automatisms,no,-1.0,27.00445818901062
0.008678894165950581,0.0517004684616763,0.9396206373723731,S-triggered-by-standing,no,-1.0,16.668389320373535
0.013363848893306943,0.07206054000234023,0.9145756111043528,syncope,submitted,100.0,11.510998010635376
