belief_epileptic-seizure,belief_psychogenic-seizure,belief_syncope,queried_feature,observed_feature_value,observed_reward,runtime
0.3333333333333333,0.3333333333333333,0.3333333333333333,R-febrile-seizures,no,-1.0,25.375556230545044
0.300954225018599,0.3433692466585037,0.35567652832289737,S-brief-jerks,yes,-1.0,33.531200885772705
0.18814792458099525,0.7544611399528952,0.05739093546610948,S-want-to-know-what-happens,yes,-1.0,29.4742693901062
0.0607967541004025,0.9338643495822427,0.005338896317354847,S-sensation-of-passivity,no,-1.0,15.750877380371094
0.004484784269243423,0.9954695093219108,4.5706408845736636e-05,psychogenic-seizure,submitted,100.0,2.4183707237243652
