belief_epileptic-seizure,belief_psychogenic-seizure,belief_syncope,queried_feature,observed_feature_value,observed_reward,runtime
0.3333333333333333,0.3333333333333333,0.3333333333333333,S-like-electricity,no,-1.0,24.025283336639404
0.3025510204081633,0.2066326530612245,0.49081632653061225,S-rigid-limbs,no,-1.0,27.099987983703613
0.09476114621286887,0.05180923405137993,0.8534296197357512,S-violent-shaking,no,-1.0,27.302143573760986
0.00395444801913368,0.0008845881155556613,0.9951609638653107,syncope,submitted,100.0,4.803507328033447
