belief_epileptic-seizure,belief_psychogenic-seizure,belief_syncope,queried_feature,observed_feature_value,observed_reward,runtime
0.3333333333333333,0.3333333333333333,0.3333333333333333,S-postictal-relief,no,-1.0,30.57555890083313
0.3843197540353574,0.2651806302843966,0.35049961568024596,S-like-knife-through-head,no,-1.0,27.141648292541504
0.41152383057433023,0.16321355033096402,0.42526261909470575,S-oral-automatisms,yes,-1.0,26.864104509353638
0.7418521041195507,0.22131917239882923,0.03682872348161993,S-manual-automatisms,yes,-1.0,25.013944625854492
0.8022889706640768,0.19428779420923342,0.0034232351266896225,S-recall-bad-memories,no,-1.0,12.03852128982544
0.8420714748757825,0.1538640715742157,0.00406445355000172,epileptic-seizure,submitted,100.0,2.681236505508423
