belief_epileptic-seizure,belief_psychogenic-seizure,belief_syncope,queried_feature,observed_feature_value,observed_reward,runtime
0.3333333333333333,0.3333333333333333,0.3333333333333333,S-pallor,yes,-1.0,22.860944986343384
0.29733879222108495,0.26202661207778916,0.4406345957011259,S-frightened-to-death,yes,-1.0,31.6402530670166
0.2225989919696666,0.5366297261055195,0.2407712819248139,S-like-electricity,yes,-1.0,25.495539665222168
0.21620228070668449,0.7619638377325173,0.021833881560798227,S-oral-automatisms,no,-1.0,28.128827333450317
0.1205655968082261,0.8233912108942009,0.05604319229757309,S-triggered-by-stress,yes,-1.0,28.34166932106018
0.14574133429482433,0.8230373499843324,0.031221315720843138,S-manual-automatisms,no,-1.0,15.850934028625488
0.0969195137602737,0.8302173239385895,0.07286316230113675,psychogenic-seizure,submitted,100.0,18.285955905914307
