belief_epileptic-seizure,belief_psychogenic-seizure,belief_syncope,queried_feature,observed_feature_value,observed_reward,runtime
0.3333333333333333,0.3333333333333333,0.3333333333333333,S-onset-during-sleep,no,-1.0,37.53521418571472
0.24929498025944724,0.20812182741116753,0.5425831923293852,S-consciousness-drift,yes,-1.0,28.59520983695984
0.238712306708503,0.45848229521124145,0.30280539808025553,S-want-to-know-what-happens,yes,-1.0,37.238330602645874
0.2480181862729719,0.45505071787978846,0.2969310958472397,S-pallor,yes,-1.0,37.44385862350464
0.2277366114688057,0.36821625752980636,0.40404713100138784,S-feel-hot-cold,yes,-1.0,30.856712579727173
0.1059073560566173,0.42014718116082866,0.47394546278255395,S-postictal-relief,no,-1.0,31.02627730369568
0.12790014807752165,0.3501027047895163,0.5219971471329621,S-palpitations,yes,-1.0,29.362615823745728
0.020881824620494985,0.32817772692546693,0.6509404484540381,S-like-electricity,no,-1.0,27.063211917877197
0.016050457828138787,0.17227744148751212,0.8116721006843491,syncope,submitted,100.0,5.460456371307373
