belief_epileptic-seizure,belief_psychogenic-seizure,belief_syncope,queried_feature,observed_feature_value,observed_reward,runtime
0.3333333333333333,0.3333333333333333,0.3333333333333333,S-like-knife-through-head,no,-1.0,27.441153049468994
0.34488828706838187,0.26431956668923495,0.39079214624238323,R-poor-coordination,no,-1.0,29.694873571395874
0.30530348324601364,0.2641901188742437,0.43050639787974265,S-rigid-limbs,yes,-1.0,33.11797499656677
0.4171114241539096,0.4545190064919664,0.12836956935412394,S-sensation-of-passivity,no,-1.0,34.22196435928345
0.36054624901419813,0.49280973797652267,0.1466440130092792,S-aware-of-shaking,no,-1.0,29.70787763595581
0.3878135397417967,0.4037279266451814,0.20845853361302197,S-brief-jerks,no,-1.0,30.0064435005188
0.41567045313832607,0.3241094162566064,0.26022013060506755,S-triggered-by-standing,no,-1.0,29.166321277618408
0.44685707046990775,0.4205191079153509,0.13262382161474137,S-time-in-slow-motion,no,-1.0,34.8940794467926
0.4741628999962476,0.3398538510213132,0.18598324898243918,S-palpitations,no,-1.0,31.124460458755493
0.5239446009593078,0.35453871171255386,0.12151668732813826,S-unusual-positions,no,-1.0,31.831266164779663
0.45689408666598996,0.3575170557879476,0.18558885754606239,R-febrile-seizures,no,-1.0,30.586430311203003
0.3735036716382596,0.4462146493369141,0.18028167902482634,S-deja-vu,no,-1.0,30.007250547409058
0.2937102523771658,0.5039454356005892,0.20234431202224498,S-feel-hot-cold,yes,-1.0,31.14032483100891
0.11974796073049504,0.6721659292981514,0.20808610997135357,S-violent-shaking,no,-1.0,28.28348159790039
0.08338714340703572,0.4670331396160185,0.44957971697694576,S-chest-pain,no,-1.0,28.274627685546875
0.08894619232976274,0.4533929572159373,0.45766085045429994,S-rapid-head-turning,no,-1.0,34.01786923408508
0.06240999672817779,0.3067898739176788,0.6308001293541434,S-limp-limbs,yes,-1.0,30.821561098098755
0.027396757045668733,0.30629142034968204,0.6663118226046492,S-oral-automatisms,no,-1.0,29.03710436820984
0.007050627523630068,0.2036624289858243,0.7892869434905456,S-onset-during-sleep,yes,-1.0,30.640201091766357
0.019165740559029178,0.8347235164177755,0.14611074302319538,S-olfactory-hallucination,no,-1.0,28.309126615524292
0.017985164732640002,0.8205184374377635,0.16149639782959646,S-visual-auditory-awareness,no,-1.0,29.35772705078125
0.01872350350338827,0.7401897929285758,0.2410867035680361,S-want-to-know-what-happens,yes,-1.0,29.278523683547974
0.01574670180988956,0.7928898022811621,0.19136349590894833,S-shaking-over-1min,no,-1.0,30.1952965259552
0.012825333279319751,0.5979544920064219,0.3892201747142584,S-triggered-by-stress,no,-1.0,28.286900758743286
0.0027930971384124248,0.46674675780510794,0.5304601450564796,S-pallor,no,-1.0,28.847848892211914
0.0030911388034427843,0.8021550326118612,0.1947538285846961,S-locked-in,no,-1.0,23.43355703353882
0.0023038581354418064,0.6864255942396367,0.3112705476249214,S-frightened-to-death,no,-1.0,28.138890504837036
0.0025264524966885664,0.6367058622025482,0.3607676853007632,S-like-electricity,no,-1.0,33.9772264957428
0.002163827594558444,0.49658023874054064,0.501255933664901,S-triggered-by-blood,no,-1.0,36.69023537635803
0.001954351795502428,0.596740079193217,0.40130556901128056,S-consciousness-drift,no,-1.0,35.65031170845032
0.0025076393331376003,0.3786747849697822,0.6188175756970803,S-recall-bad-memories,no,-1.0,30.272534132003784
0.002314417374183784,0.35160520908448395,0.6460803735413323,S-leg-automatisms,no,-1.0,25.69698452949524
0.001474001512527654,0.2611174576124806,0.7374085408749917,S-manual-automatisms,no,-1.0,19.608186721801758
0.0004728287099953124,0.16940425587244332,0.8301229154175613,S-like-hammer-blow,no,-1.0,13.221399784088135
0.0004426494016299479,0.09446380060812455,0.9050935499902455,S-postictal-relief,no,-1.0,6.842828989028931
0.0004849386387814152,0.09520947046433278,0.9043055908968858,epileptic-seizure,submitted,-100.0,0.019080638885498047
