belief_epileptic-seizure,belief_psychogenic-seizure,belief_syncope,queried_feature,observed_feature_value,observed_reward,runtime
0.3333333333333333,0.3333333333333333,0.3333333333333333,S-triggered-by-stress,no,-1.0,25.95380401611328
0.08310991957104558,0.22341376228775692,0.6934763181411975,S-consciousness-drift,no,-1.0,28.856302499771118
0.06507263859676807,0.06488369727031688,0.870043664132915,S-brief-jerks,no,-1.0,33.792683362960815
0.0447979363943674,0.02509187493837132,0.9301101886672613,S-like-knife-through-head,no,-1.0,30.619306325912476
0.030590734074899886,0.009848659799859811,0.9595606061252403,syncope,submitted,100.0,3.3658435344696045
