belief_epileptic-seizure,belief_psychogenic-seizure,belief_syncope,queried_feature,observed_feature_value,observed_reward,runtime
0.3333333333333333,0.3333333333333333,0.3333333333333333,S-want-to-know-what-happens,no,-1.0,27.461063385009766
0.2711864406779661,0.3538135593220339,0.375,S-pallor,yes,-1.0,28.379318237304688
0.18748527870606277,0.2812380022500745,0.5312767190438626,S-oral-automatisms,no,-1.0,27.78052830696106
0.02362909593363078,0.10303137739183513,0.8733395266745341,S-triggered-by-standing,no,-1.0,27.585095643997192
0.0015018413651114266,0.02584667800731845,0.9726514806275701,syncope,submitted,100.0,2.7934768199920654
