belief_epileptic-seizure,belief_psychogenic-seizure,belief_syncope,queried_feature,observed_feature_value,observed_reward,runtime
0.3333333333333333,0.3333333333333333,0.3333333333333333,S-like-knife-through-head,no,-1.0,35.67802691459656
0.32408703397378796,0.18628324214276623,0.4896297238834457,S-manual-automatisms,no,-1.0,34.98840641975403
0.1118427389497331,0.0975132626885353,0.7906439983617316,S-triggered-by-blood,yes,-1.0,28.12831735610962
0.034823391378258794,0.03140871829063008,0.9337678903311112,S-triggered-by-stress,no,-1.0,30.980214595794678
0.00440206470386171,0.010673150473700673,0.9849247848224376,syncope,submitted,100.0,6.429263353347778
