belief_epileptic-seizure,belief_psychogenic-seizure,belief_syncope,queried_feature,observed_feature_value,observed_reward,runtime
0.3333333333333333,0.3333333333333333,0.3333333333333333,S-postictal-relief,yes,-1.0,28.061088800430298
0.2942907592701589,0.38552089464390815,0.32018834608593294,S-brief-jerks,yes,-1.0,26.580719232559204
0.1896449497767857,0.7652936662946429,0.04506138392857143,S-triggered-by-stress,no,-1.0,27.721644163131714
0.07499158603858534,0.8134978997165538,0.11151051424486078,S-shaking-over-1min,yes,-1.0,28.739706993103027
0.07170003871682455,0.9114746127316945,0.0168253485514809,S-time-in-slow-motion,yes,-1.0,27.955302476882935
0.03697764024809613,0.9611437722313932,0.001878587520510675,psychogenic-seizure,submitted,100.0,3.215318202972412
