belief_epileptic-seizure,belief_psychogenic-seizure,belief_syncope,queried_feature,observed_feature_value,observed_reward,runtime
0.3333333333333333,0.3333333333333333,0.3333333333333333,S-postictal-relief,no,-1.0,24.754345178604126
0.3441156228492774,0.23743977976600136,0.4184445973847213,S-like-electricity,yes,-1.0,26.986785650253296
0.46294154803710513,0.4669794902865688,0.07007896167632614,S-sensation-of-passivity,no,-1.0,26.108508586883545
0.45132247041646495,0.42829026463220493,0.12038726495133018,S-aware-of-shaking,no,-1.0,29.83119535446167
0.4969917258605504,0.26940719643930305,0.23360107770014657,S-triggered-by-blood,no,-1.0,25.68249487876892
0.4769978996618154,0.2580200479181238,0.26498205242006095,S-like-hammer-blow,no,-1.0,28.215391159057617
0.47521824260687484,0.11483556396121256,0.40994619343191263,S-visual-auditory-awareness,no,-1.0,27.97053027153015
0.3563301712949146,0.05596019447067829,0.5877096342344071,S-feel-hot-cold,no,-1.0,27.28314208984375
0.5295466576084394,0.03354676509217585,0.4369065772993848,S-shaking-over-1min,yes,-1.0,27.139516592025757
0.8013821280407387,0.059493204025148516,0.13912466793411266,S-deja-vu,no,-1.0,29.184757232666016
0.7090441737262364,0.056699303329733275,0.2342565229440303,S-palpitations,no,-1.0,28.688724994659424
0.7592475582710787,0.04298953672600322,0.1977629050029181,S-brief-jerks,no,-1.0,28.919691801071167
0.6962407119399185,0.022145052230034865,0.2816142358300466,S-onset-during-sleep,yes,-1.0,28.845964670181274
0.9322318683573556,0.03353021975989584,0.0342379118827486,S-frightened-to-death,no,-1.0,26.38829493522644
0.9306024264910449,0.021233807453365804,0.04816376605558941,S-rapid-head-turning,yes,-1.0,28.518488883972168
0.9644236973415027,0.027559490127853064,0.008016812530644209,S-like-knife-through-head,no,-1.0,17.428398847579956
0.9718324621956898,0.015962717908941024,0.012204819895369203,S-manual-automatisms,yes,-1.0,8.405654668807983
0.9854428437646295,0.013138926049674251,0.0014182301856962309,epileptic-seizure,submitted,100.0,4.351284027099609
