belief_epileptic-seizure,belief_psychogenic-seizure,belief_syncope,queried_feature,observed_feature_value,observed_reward,runtime
0.3333333333333333,0.3333333333333333,0.3333333333333333,S-feel-hot-cold,yes,-1.0,26.065560340881348
0.21132897603485842,0.3888888888888889,0.3997821350762527,S-oral-automatisms,yes,-1.0,27.913471460342407
0.4747594359652224,0.4928807277289254,0.03235983630585219,S-unusual-positions,no,-1.0,29.30009126663208
0.5666275983518441,0.382640924636671,0.05073147701148495,S-want-to-know-what-happens,yes,-1.0,26.77769112586975
0.646330709070271,0.31270747630793705,0.04096181462179192,S-limp-limbs,yes,-1.0,31.08742070198059
0.5769266205815468,0.35708811130608153,0.06598526811237168,S-leg-automatisms,yes,-1.0,28.823180675506592
0.6503094011694173,0.34969047262300446,1.26207578296326e-07,R-febrile-seizures,no,-1.0,28.139319896697998
0.6848472140884985,0.3151526680895546,1.1782194682027725e-07,S-olfactory-hallucination,no,-1.0,31.793994903564453
0.786690247578148,0.21330963286088844,1.195609635166259e-07,S-consciousness-drift,no,-1.0,28.8645339012146
0.9298598993054362,0.07013997331799524,1.2737656840998159e-07,epileptic-seizure,submitted,-100.0,4.5230185985565186
