belief_epileptic-seizure,belief_psychogenic-seizure,belief_syncope,queried_feature,observed_feature_value,observed_reward,runtime
0.3333333333333333,0.3333333333333333,0.3333333333333333,S-visual-auditory-awareness,no,-1.0,29.69973850250244
0.2807533843437316,0.18246027074749854,0.5367863449087699,S-shaking-over-1min,no,-1.0,30.311094760894775
0.12791976186006596,0.05773224752012062,0.8143479906198133,S-rigid-limbs,no,-1.0,32.17046356201172
0.03270492393172075,0.017300958836597092,0.949994117231682,S-recall-bad-memories,no,-1.0,12.000028848648071
0.02211840401325848,0.008828448439932633,0.9690531475468089,syncope,submitted,100.0,2.702138662338257
