belief_epileptic-seizure,belief_psychogenic-seizure,belief_syncope,queried_feature,observed_feature_value,observed_reward,runtime
0.3333333333333333,0.3333333333333333,0.3333333333333333,S-oral-automatisms,yes,-1.0,24.46466088294983
0.5554775280898877,0.41783707865168535,0.02668539325842697,S-onset-during-sleep,yes,-1.0,33.06088209152222
0.5394058418584644,0.4588294529780621,0.0017647051634735364,S-feel-hot-cold,yes,-1.0,29.080631494522095
0.32306623371767895,0.6742678214968996,0.002665944785421498,S-sensation-of-passivity,no,-1.0,27.87185025215149
0.3362069526884589,0.6601264802914237,0.0036665670201172936,S-manual-automatisms,yes,-1.0,33.915006160736084
0.38539566625297783,0.6142430933266572,0.00036124042036501957,S-postictal-relief,yes,-1.0,31.504810094833374
0.3237402574922258,0.6759295896085141,0.00033015289926000425,S-locked-in,no,-1.0,32.69167160987854
0.3571326093130257,0.6420863696820291,0.0007810210049452215,S-frightened-to-death,yes,-1.0,30.166804790496826
0.16891973742195954,0.8308106326613579,0.00026962991668251686,S-violent-shaking,yes,-1.0,32.801756143569946
0.15494160849347446,0.8450360691075133,2.2322399012306076e-05,S-like-knife-through-head,yes,-1.0,29.88128685951233
0.05130117487588341,0.9486969651505711,1.85997354538315e-06,psychogenic-seizure,submitted,100.0,4.646945238113403
