belief_epileptic-seizure,belief_psychogenic-seizure,belief_syncope,queried_feature,observed_feature_value,observed_reward,runtime
0.3333333333333333,0.3333333333333333,0.3333333333333333,S-visual-auditory-awareness,yes,-1.0,27.307674407958984
0.342053629823414,0.45127534336167424,0.2066710268149117,S-aware-of-shaking,no,-1.0,24.98081922531128
0.3918290186812687,0.29529275140566535,0.3128782299130659,S-unusual-positions,yes,-1.0,28.98322367668152
0.5058472822953792,0.4394277181035333,0.05472499960108753,S-like-knife-through-head,yes,-1.0,30.01189875602722
0.2517155056726163,0.7414314591003457,0.00685303522703792,psychogenic-seizure,submitted,100.0,4.858943223953247
