belief_epileptic-seizure,belief_psychogenic-seizure,belief_syncope,queried_feature,observed_feature_value,observed_reward,runtime
0.3333333333333333,0.3333333333333333,0.3333333333333333,S-onset-during-sleep,yes,-1.0,27.025253534317017
0.45476772616136923,0.5142624286878565,0.030969845150774247,psychogenic-seizure,submitted,100.0,4.749038934707642
