belief_epileptic-seizure,belief_psychogenic-seizure,belief_syncope,queried_feature,observed_feature_value,observed_reward,runtime
0.3333333333333333,0.3333333333333333,0.3333333333333333,S-aware-of-shaking,yes,-1.0,27.437344551086426
0.3066385669125395,0.6269757639620653,0.06638566912539515,S-rapid-head-turning,no,-1.0,25.728732585906982
0.3443376919126895,0.5092244606351073,0.14643784745220326,S-consciousness-drift,yes,-1.0,27.788553476333618
0.21504794751218095,0.7316504734444187,0.05330157904340046,S-locked-in,yes,-1.0,29.6668643951416
0.21024442959251163,0.771191032472921,0.01856453793456727,S-limp-limbs,yes,-1.0,28.755622148513794
0.13388308773695673,0.8376705908380775,0.028446321424965743,R-febrile-seizures,no,-1.0,28.58151149749756
0.1191846992164753,0.8508839212079384,0.029931379575586343,S-frightened-to-death,yes,-1.0,25.980924367904663
0.04827760845316571,0.9428731418323624,0.008849249714471891,psychogenic-seizure,submitted,100.0,4.328468322753906
