NCTId	Publication: Year and Author	CTDesign	Precondition	Gender	Arm1 (drug,dose,unit,frequency,delivery method)	Arm2 (drug,dose,unit,frequency,delivery method)	N.Participants Arm1 started	N.Participants Arm2 started	N.Participants Arm1 completed	N.Participants Arm2 completed	N.Participants Arm1 left	N.Participants Arm2 left	avg. Age Arm1	avg. Age Arm2
NCT01072175	Study Director	None (Open Label)	Cancer	All	label: Arm Part A	label: Arm Part B	8	0	0	0	8	0	52.8	48.2
	2013	Non-Randomized			true	true								
														
Primary Outcome (Id, EndpointDescription, aggregation method)	Baseline (units)	ChangeValue (SD) Arm1, changeDirection	ChangeValue (SD) Arm2, changeDirection	Adverse effect1 (aggregation unit)	numberAffected Arm1	numberAffected Arm2	Adverse effect2 (aggregation unit)	numberAffected Arm1	numberAffected Arm2	"	"	"	"	"	"	"	"	"	"
file:///C:/Users/tobia/bachelorthesis/ct2rdf/resources/NCT01072175_outcome_0_9_1	Participants	19.0	16.0	Diarrhoea	0	0	Urinary tract infection	0	0					
file:///C:/Users/tobia/bachelorthesis/ct2rdf/resources/NCT01072175_outcome_1_9_1		+	+											
Best overall response is defined as complete response (CR: the disappearance of all target lesions. Any pathological lymph nodes must be <10 mm in the short axis.) or partial reponse (PR: at least a 30% decrease in the sum of the diameters of target lesions, taking as a reference, the Baseline sum of the diameters [e.g., percent change from Baseline]). Participants with unknown or missing responses were considered as non-responders. To be assigned a status of PR or CR, a confirmatory disease assessment should have been performed no less than 28 days after the criteria for response were first met. Response was evaluated by BICR as per RECIST, version 1.1.														
Unconditional exact method														
