NCTId	Publication: Year and Author	CTDesign	Precondition	Gender	Arm1 (drug,dose,unit,frequency,delivery method)	Arm2 (drug,dose,unit,frequency,delivery method)	N.Participants Arm1 started	N.Participants Arm2 started	N.Participants Arm1 completed	N.Participants Arm2 completed	N.Participants Arm1 left	N.Participants Arm2 left	avg. Age Arm1	avg. Age Arm2
NCT01689519	Medical Communications	Randomized	Malignant Melanoma	All	label: Cobimetinib + Vemurafenib	label: Placebo + Vemurafenib	247	248	109	82	138	166	54.9	55.3
	2015	Triple			true	true								
		Investigator												
		Outcomes Assessor												
		Participant												
														
Primary Outcome (Id, EndpointDescription, aggregation method)	Baseline (units)	ChangeValue (SD) Arm1, changeDirection	ChangeValue (SD) Arm2, changeDirection	Adverse effect1 (aggregation unit)	numberAffected Arm1	numberAffected Arm2	Adverse effect2 (aggregation unit)	numberAffected Arm1	numberAffected Arm2	"	"	"	"	"	"	"	"	"	"
file:///C:/Users/tobia/bachelorthesis/ct2rdf/resources/NCT01689519_outcome_1_0_0	Months			Diarrhoea	3	0	Hypertension	1	0					
file:///C:/Users/tobia/bachelorthesis/ct2rdf/resources/NCT01689519_outcome_0_0_0														
Progression-free survival was defined as the time from randomization to the first occurrence of disease progression, as determined by the investigator using Response Evaluation Criteria in Solid Tumors v1.1, or death from any cause, whichever came first. Disease progression was defined as: (1) at least a 20% increase in the sum (the increase in the sum must be at least 5 mm) of diameters of target lesions, taking as reference the smallest sum during the study; (2) unequivocal progression of existing non-target lesions; or (3) the appearance of 1 or more new lesions.														
Hazard Ratio (HR)														
