<?xml version="1.0" encoding="UTF-8" standalone="no"?>
<svg
   width="551.32855pt"
   height="378.11438pt"
   viewBox="0 0 551.32855 378.11438"
   version="1.1"
   id="svg397"
   sodipodi:docname="figure_S4.svg"
   inkscape:export-filename="figure_S4.tiff"
   inkscape:export-xdpi="300"
   inkscape:export-ydpi="300"
   inkscape:version="1.3 (0e150ed6c4, 2023-07-21)"
   xmlns:inkscape="http://www.inkscape.org/namespaces/inkscape"
   xmlns:sodipodi="http://sodipodi.sourceforge.net/DTD/sodipodi-0.dtd"
   xmlns:xlink="http://www.w3.org/1999/xlink"
   xmlns="http://www.w3.org/2000/svg"
   xmlns:svg="http://www.w3.org/2000/svg"
   xmlns:rdf="http://www.w3.org/1999/02/22-rdf-syntax-ns#"
   xmlns:cc="http://creativecommons.org/ns#"
   xmlns:dc="http://purl.org/dc/elements/1.1/">
  <sodipodi:namedview
     id="namedview397"
     pagecolor="#ffffff"
     bordercolor="#000000"
     borderopacity="0.25"
     inkscape:showpageshadow="2"
     inkscape:pageopacity="0.0"
     inkscape:pagecheckerboard="0"
     inkscape:deskcolor="#d1d1d1"
     inkscape:document-units="pt"
     inkscape:zoom="0.99189815"
     inkscape:cx="382.09568"
     inkscape:cy="238.43174"
     inkscape:window-width="1680"
     inkscape:window-height="987"
     inkscape:window-x="1672"
     inkscape:window-y="-8"
     inkscape:window-maximized="1"
     inkscape:current-layer="svg397" />
  <metadata
     id="metadata1">
    <rdf:RDF>
      <cc:Work>
        <dc:type
           rdf:resource="http://purl.org/dc/dcmitype/StillImage" />
        <dc:date>2024-01-03T11:58:56.234493</dc:date>
        <dc:format>image/svg+xml</dc:format>
        <dc:creator>
          <cc:Agent>
            <dc:title>Matplotlib v3.6.2, https://matplotlib.org/</dc:title>
          </cc:Agent>
        </dc:creator>
      </cc:Work>
    </rdf:RDF>
  </metadata>
  <defs
     id="defs1">
    <style
       type="text/css"
       id="style1">*{stroke-linejoin: round; stroke-linecap: butt}</style>
  </defs>
  <g
     id="figure_1"
     transform="translate(-38.034375,-36.721875)">
    <g
       id="axes_1">
      <g
         id="patch_2">
        <path
           d="M 81,203.04 H 309.27273 V 51.84 H 81 Z"
           style="fill:#ffffff"
           id="path2" />
      </g>
      <g
         id="matplotlib.axis_1">
        <g
           id="xtick_1">
          <g
             id="line2d_1">
            <defs
               id="defs2">
              <path
                 id="mdd724a0be8"
                 d="M 0,0 V 3.5"
                 style="stroke:#000000;stroke-width:0.8" />
            </defs>
            <g
               id="g2">
              <use
                 xlink:href="#mdd724a0be8"
                 x="91.37603"
                 y="203.03999"
                 style="stroke:#000000;stroke-width:0.8"
                 id="use2" />
            </g>
          </g>
        </g>
        <g
           id="xtick_2">
          <g
             id="line2d_2">
            <g
               id="g3">
              <use
                 xlink:href="#mdd724a0be8"
                 x="132.88016"
                 y="203.03999"
                 style="stroke:#000000;stroke-width:0.8"
                 id="use3" />
            </g>
          </g>
        </g>
        <g
           id="xtick_3">
          <g
             id="line2d_3">
            <g
               id="g4">
              <use
                 xlink:href="#mdd724a0be8"
                 x="174.38429"
                 y="203.03999"
                 style="stroke:#000000;stroke-width:0.8"
                 id="use4" />
            </g>
          </g>
        </g>
        <g
           id="xtick_4">
          <g
             id="line2d_4">
            <g
               id="g5">
              <use
                 xlink:href="#mdd724a0be8"
                 x="215.88843"
                 y="203.03999"
                 style="stroke:#000000;stroke-width:0.8"
                 id="use5" />
            </g>
          </g>
        </g>
        <g
           id="xtick_5">
          <g
             id="line2d_5">
            <g
               id="g6">
              <use
                 xlink:href="#mdd724a0be8"
                 x="257.39255"
                 y="203.03999"
                 style="stroke:#000000;stroke-width:0.8"
                 id="use6" />
            </g>
          </g>
        </g>
        <g
           id="xtick_6">
          <g
             id="line2d_6">
            <g
               id="g7">
              <use
                 xlink:href="#mdd724a0be8"
                 x="298.8967"
                 y="203.03999"
                 style="stroke:#000000;stroke-width:0.8"
                 id="use7" />
            </g>
          </g>
        </g>
      </g>
      <g
         id="matplotlib.axis_2">
        <g
           id="ytick_1">
          <g
             id="line2d_7">
            <defs
               id="defs7">
              <path
                 id="m246a095773"
                 d="M 0,0 H -3.5"
                 style="stroke:#000000;stroke-width:0.8" />
            </defs>
            <g
               id="g8">
              <use
                 xlink:href="#m246a095773"
                 x="81"
                 y="178.13763"
                 style="stroke:#000000;stroke-width:0.8"
                 id="use8" />
            </g>
          </g>
          <g
             id="text_1">
            <!-- 22.5 -->
            <g
               transform="matrix(0.1,0,0,-0.1,51.734375,181.93685)"
               id="g12">
              <defs
                 id="defs8">
                <path
                   id="DejaVuSans-32"
                   d="M 1228,531 H 3431 V 0 H 469 v 531 q 359,372 979,998 621,627 780,809 303,340 423,576 121,236 121,464 0,372 -261,606 -261,235 -680,235 -297,0 -627,-103 -329,-103 -704,-313 v 638 q 381,153 712,231 332,78 607,78 725,0 1156,-363 431,-362 431,-968 0,-288 -108,-546 -107,-257 -392,-607 -78,-91 -497,-524 Q 1991,1309 1228,531 Z"
                   transform="scale(0.015625)" />
                <path
                   id="DejaVuSans-2e"
                   d="m 684,794 h 660 V 0 H 684 Z"
                   transform="scale(0.015625)" />
                <path
                   id="DejaVuSans-35"
                   d="M 691,4666 H 3169 V 4134 H 1269 V 2991 q 137,47 274,70 138,23 276,23 781,0 1237,-428 457,-428 457,-1159 Q 3513,744 3044,326 2575,-91 1722,-91 1428,-91 1123,-41 819,9 494,109 v 635 q 281,-153 581,-228 300,-75 634,-75 541,0 856,284 316,284 316,772 0,487 -316,771 -315,285 -856,285 -253,0 -505,-56 -251,-56 -513,-175 z"
                   transform="scale(0.015625)" />
              </defs>
              <use
                 xlink:href="#DejaVuSans-32"
                 id="use9" />
              <use
                 xlink:href="#DejaVuSans-32"
                 x="63.623047"
                 id="use10" />
              <use
                 xlink:href="#DejaVuSans-2e"
                 x="127.24609"
                 id="use11" />
              <use
                 xlink:href="#DejaVuSans-35"
                 x="159.0332"
                 id="use12" />
            </g>
          </g>
        </g>
        <g
           id="ytick_2">
          <g
             id="line2d_8">
            <g
               id="g13">
              <use
                 xlink:href="#m246a095773"
                 x="81"
                 y="151.58432"
                 style="stroke:#000000;stroke-width:0.8"
                 id="use13" />
            </g>
          </g>
          <g
             id="text_2">
            <!-- 25.0 -->
            <g
               transform="matrix(0.1,0,0,-0.1,51.734375,155.38353)"
               id="g17">
              <defs
                 id="defs13">
                <path
                   id="DejaVuSans-30"
                   d="m 2034,4250 q -487,0 -733,-480 -245,-479 -245,-1442 0,-959 245,-1439 246,-480 733,-480 491,0 736,480 246,480 246,1439 0,963 -246,1442 -245,480 -736,480 z m 0,500 q 785,0 1199,-621 414,-620 414,-1801 0,-1178 -414,-1799 -414,-620 -1199,-620 -784,0 -1198,620 -414,621 -414,1799 0,1181 414,1801 414,621 1198,621 z"
                   transform="scale(0.015625)" />
              </defs>
              <use
                 xlink:href="#DejaVuSans-32"
                 id="use14" />
              <use
                 xlink:href="#DejaVuSans-35"
                 x="63.623047"
                 id="use15" />
              <use
                 xlink:href="#DejaVuSans-2e"
                 x="127.24609"
                 id="use16" />
              <use
                 xlink:href="#DejaVuSans-30"
                 x="159.0332"
                 id="use17" />
            </g>
          </g>
        </g>
        <g
           id="ytick_3">
          <g
             id="line2d_9">
            <g
               id="g18">
              <use
                 xlink:href="#m246a095773"
                 x="81"
                 y="125.03099"
                 style="stroke:#000000;stroke-width:0.8"
                 id="use18" />
            </g>
          </g>
          <g
             id="text_3">
            <!-- 27.5 -->
            <g
               transform="matrix(0.1,0,0,-0.1,51.734375,128.83021)"
               id="g22">
              <defs
                 id="defs18">
                <path
                   id="DejaVuSans-37"
                   d="M 525,4666 H 3525 V 4397 L 1831,0 H 1172 L 2766,4134 H 525 Z"
                   transform="scale(0.015625)" />
              </defs>
              <use
                 xlink:href="#DejaVuSans-32"
                 id="use19" />
              <use
                 xlink:href="#DejaVuSans-37"
                 x="63.623047"
                 id="use20" />
              <use
                 xlink:href="#DejaVuSans-2e"
                 x="127.24609"
                 id="use21" />
              <use
                 xlink:href="#DejaVuSans-35"
                 x="159.0332"
                 id="use22" />
            </g>
          </g>
        </g>
        <g
           id="ytick_4">
          <g
             id="line2d_10">
            <g
               id="g23">
              <use
                 xlink:href="#m246a095773"
                 x="81"
                 y="98.477676"
                 style="stroke:#000000;stroke-width:0.8"
                 id="use23" />
            </g>
          </g>
          <g
             id="text_4">
            <!-- 30.0 -->
            <g
               transform="matrix(0.1,0,0,-0.1,51.734375,102.27689)"
               id="g27">
              <defs
                 id="defs23">
                <path
                   id="DejaVuSans-33"
                   d="m 2597,2516 q 453,-97 707,-404 255,-306 255,-756 0,-690 -475,-1069 -475,-378 -1350,-378 -293,0 -604,58 -311,58 -642,174 v 609 q 262,-153 574,-231 313,-78 654,-78 593,0 904,234 311,234 311,681 0,413 -289,645 -289,233 -804,233 h -544 v 519 h 569 q 465,0 712,186 247,186 247,536 0,359 -255,551 -254,193 -729,193 -260,0 -557,-57 -297,-56 -653,-174 v 562 q 360,100 674,150 314,50 592,50 719,0 1137,-327 419,-326 419,-882 0,-388 -222,-655 -222,-267 -631,-370 z"
                   transform="scale(0.015625)" />
              </defs>
              <use
                 xlink:href="#DejaVuSans-33"
                 id="use24" />
              <use
                 xlink:href="#DejaVuSans-30"
                 x="63.623047"
                 id="use25" />
              <use
                 xlink:href="#DejaVuSans-2e"
                 x="127.24609"
                 id="use26" />
              <use
                 xlink:href="#DejaVuSans-30"
                 x="159.0332"
                 id="use27" />
            </g>
          </g>
        </g>
        <g
           id="ytick_5">
          <g
             id="line2d_11">
            <g
               id="g28">
              <use
                 xlink:href="#m246a095773"
                 x="81"
                 y="71.924355"
                 style="stroke:#000000;stroke-width:0.8"
                 id="use28" />
            </g>
          </g>
          <g
             id="text_5">
            <!-- 32.5 -->
            <g
               transform="matrix(0.1,0,0,-0.1,51.734375,75.723574)"
               id="g32">
              <use
                 xlink:href="#DejaVuSans-33"
                 id="use29" />
              <use
                 xlink:href="#DejaVuSans-32"
                 x="63.623047"
                 id="use30" />
              <use
                 xlink:href="#DejaVuSans-2e"
                 x="127.24609"
                 id="use31" />
              <use
                 xlink:href="#DejaVuSans-35"
                 x="159.0332"
                 id="use32" />
            </g>
          </g>
        </g>
        <g
           id="text_6">
          <!-- $\mu$ [vm] -->
          <g
             transform="matrix(0,-0.1,-0.1,0,45.634375,143.99)"
             id="g38">
            <defs
               id="defs32">
              <path
                 id="DejaVuSans-Oblique-3bc"
                 d="m -84,-1331 940,4831 h 578 L 1009,1322 q -12,-66 -22,-147 -9,-81 -9,-162 0,-291 183,-448 183,-156 523,-156 463,0 747,262 285,263 385,788 l 397,2041 h 575 L 3266,809 q -13,-59 -18,-103 -4,-43 -4,-78 0,-97 39,-142 39,-45 123,-45 32,0 86,15 55,16 155,57 L 3559,50 Q 3422,-19 3297,-55 3172,-91 3053,-91 2847,-91 2730,40 2613,172 2613,403 2438,153 2195,31 1953,-91 1625,-91 1334,-91 1117,43 900,178 831,397 L 494,-1331 Z"
                 transform="scale(0.015625)" />
              <path
                 id="DejaVuSans-20"
                 transform="scale(0.015625)"
                 d="" />
              <path
                 id="DejaVuSans-5b"
                 d="M 550,4863 H 1875 V 4416 H 1125 V -397 h 750 V -844 H 550 Z"
                 transform="scale(0.015625)" />
              <path
                 id="DejaVuSans-76"
                 d="M 191,3500 H 800 L 1894,563 2988,3500 h 609 L 2284,0 h -781 z"
                 transform="scale(0.015625)" />
              <path
                 id="DejaVuSans-6d"
                 d="m 3328,2828 q 216,388 516,572 300,184 706,184 547,0 844,-383 297,-382 297,-1088 V 0 h -578 v 2094 q 0,503 -179,746 -178,244 -543,244 -447,0 -707,-297 -259,-296 -259,-809 V 0 h -578 v 2094 q 0,506 -178,748 -178,242 -550,242 -441,0 -701,-298 -259,-298 -259,-808 V 0 H 581 v 3500 h 578 v -544 q 197,322 472,475 275,153 653,153 382,0 649,-194 267,-193 395,-562 z"
                 transform="scale(0.015625)" />
              <path
                 id="DejaVuSans-5d"
                 d="M 1947,4863 V -844 H 622 v 447 h 747 V 4416 H 622 v 447 z"
                 transform="scale(0.015625)" />
            </defs>
            <use
               xlink:href="#DejaVuSans-Oblique-3bc"
               transform="translate(0,0.015625)"
               id="use33" />
            <use
               xlink:href="#DejaVuSans-20"
               transform="translate(63.623047,0.015625)"
               id="use34" />
            <use
               xlink:href="#DejaVuSans-5b"
               transform="translate(95.410156,0.015625)"
               id="use35" />
            <use
               xlink:href="#DejaVuSans-76"
               transform="translate(134.42383,0.015625)"
               id="use36" />
            <use
               xlink:href="#DejaVuSans-6d"
               transform="translate(193.60352,0.015625)"
               id="use37" />
            <use
               xlink:href="#DejaVuSans-5d"
               transform="translate(291.01562,0.015625)"
               id="use38" />
          </g>
        </g>
      </g>
      <g
         id="LineCollection_1">
        <path
           d="M 91.376033,138.22965 V 74.901252"
           clip-path="url(#p04fb4f05d8)"
           style="fill:none;stroke:#000000;stroke-width:2.5"
           id="path38" />
        <path
           d="M 132.88016,194.43369 V 165.94307"
           clip-path="url(#p04fb4f05d8)"
           style="fill:none;stroke:#000000;stroke-width:2.5"
           id="path39" />
        <path
           d="M 174.3843,148.77938 V 127.37561"
           clip-path="url(#p04fb4f05d8)"
           style="fill:none;stroke:#000000;stroke-width:2.5"
           id="path40" />
        <path
           d="M 215.88843,169.09787 V 153.15303"
           clip-path="url(#p04fb4f05d8)"
           style="fill:none;stroke:#000000;stroke-width:2.5"
           id="path41" />
        <path
           d="M 257.39256,196.16727 V 182.98219"
           clip-path="url(#p04fb4f05d8)"
           style="fill:none;stroke:#000000;stroke-width:2.5"
           id="path42" />
        <path
           d="M 298.89669,131.42281 V 58.712727"
           clip-path="url(#p04fb4f05d8)"
           style="fill:none;stroke:#000000;stroke-width:2.5"
           id="path43" />
      </g>
      <g
         id="line2d_12">
        <defs
           id="defs43">
          <path
             id="m176cfbef69"
             d="M 6,0 H -6"
             style="stroke:#000000" />
        </defs>
        <g
           clip-path="url(#p04fb4f05d8)"
           id="g48">
          <use
             xlink:href="#m176cfbef69"
             x="91.37603"
             y="138.22964"
             style="stroke:#000000"
             id="use43" />
          <use
             xlink:href="#m176cfbef69"
             x="132.88016"
             y="194.4337"
             style="stroke:#000000"
             id="use44" />
          <use
             xlink:href="#m176cfbef69"
             x="174.38429"
             y="148.77937"
             style="stroke:#000000"
             id="use45" />
          <use
             xlink:href="#m176cfbef69"
             x="215.88843"
             y="169.09787"
             style="stroke:#000000"
             id="use46" />
          <use
             xlink:href="#m176cfbef69"
             x="257.39255"
             y="196.16727"
             style="stroke:#000000"
             id="use47" />
          <use
             xlink:href="#m176cfbef69"
             x="298.8967"
             y="131.42282"
             style="stroke:#000000"
             id="use48" />
        </g>
      </g>
      <g
         id="line2d_13">
        <g
           clip-path="url(#p04fb4f05d8)"
           id="g54">
          <use
             xlink:href="#m176cfbef69"
             x="91.37603"
             y="74.901253"
             style="stroke:#000000"
             id="use49" />
          <use
             xlink:href="#m176cfbef69"
             x="132.88016"
             y="165.94307"
             style="stroke:#000000"
             id="use50" />
          <use
             xlink:href="#m176cfbef69"
             x="174.38429"
             y="127.37561"
             style="stroke:#000000"
             id="use51" />
          <use
             xlink:href="#m176cfbef69"
             x="215.88843"
             y="153.15303"
             style="stroke:#000000"
             id="use52" />
          <use
             xlink:href="#m176cfbef69"
             x="257.39255"
             y="182.98219"
             style="stroke:#000000"
             id="use53" />
          <use
             xlink:href="#m176cfbef69"
             x="298.8967"
             y="58.712727"
             style="stroke:#000000"
             id="use54" />
        </g>
      </g>
      <g
         id="line2d_14">
        <path
           d="M 81,151.58431 H 309.27273"
           clip-path="url(#p04fb4f05d8)"
           style="fill:none;stroke:#ff0000;stroke-width:1.5;stroke-dasharray:5.55, 2.4;stroke-dashoffset:0"
           id="path54" />
      </g>
      <g
         id="line2d_15">
        <defs
           id="defs54">
          <path
             id="mc77a1e649d"
             d="M 0,4 C 1.060812,4 2.078319,3.578535 2.828427,2.828427 3.578535,2.078319 4,1.060812 4,0 4,-1.060812 3.578535,-2.078319 2.828427,-2.828427 2.078319,-3.578535 1.060812,-4 0,-4 -1.060812,-4 -2.078319,-3.578535 -2.828427,-2.828427 -3.578535,-2.078319 -4,-1.060812 -4,0 -4,1.060812 -3.578535,2.078319 -2.828427,2.828427 -2.078319,3.578535 -1.060812,4 0,4 Z"
             style="stroke:#000000" />
        </defs>
        <g
           clip-path="url(#p04fb4f05d8)"
           id="g60">
          <use
             xlink:href="#mc77a1e649d"
             x="91.37603"
             y="105.10612"
             style="stroke:#000000"
             id="use55" />
          <use
             xlink:href="#mc77a1e649d"
             x="132.88016"
             y="180.14867"
             style="stroke:#000000"
             id="use56" />
          <use
             xlink:href="#mc77a1e649d"
             x="174.38429"
             y="138.16696"
             style="stroke:#000000"
             id="use57" />
          <use
             xlink:href="#mc77a1e649d"
             x="215.88843"
             y="161.12762"
             style="stroke:#000000"
             id="use58" />
          <use
             xlink:href="#mc77a1e649d"
             x="257.39255"
             y="189.39362"
             style="stroke:#000000"
             id="use59" />
          <use
             xlink:href="#mc77a1e649d"
             x="298.8967"
             y="87.277985"
             style="stroke:#000000"
             id="use60" />
        </g>
      </g>
      <g
         id="patch_3">
        <path
           d="M 81,203.04 V 51.84"
           style="fill:none;stroke:#000000;stroke-width:0.8;stroke-linecap:square;stroke-linejoin:miter"
           id="path60" />
      </g>
      <g
         id="patch_4">
        <path
           d="M 309.27273,203.04 V 51.84"
           style="fill:none;stroke:#000000;stroke-width:0.8;stroke-linecap:square;stroke-linejoin:miter"
           id="path61" />
      </g>
      <g
         id="patch_5">
        <path
           d="M 81,203.04 H 309.27273"
           style="fill:none;stroke:#000000;stroke-width:0.8;stroke-linecap:square;stroke-linejoin:miter"
           id="path62" />
      </g>
      <g
         id="patch_6">
        <path
           d="M 81,51.84 H 309.27273"
           style="fill:none;stroke:#000000;stroke-width:0.8;stroke-linecap:square;stroke-linejoin:miter"
           id="path63" />
      </g>
      <g
         id="text_7">
        <!-- avg PI distance estimates -->
        <g
           transform="matrix(0.12,0,0,-0.12,118.03918,45.84)"
           id="g87">
          <defs
             id="defs63">
            <path
               id="DejaVuSans-61"
               d="m 2194,1759 q -697,0 -966,-159 -269,-159 -269,-544 0,-306 202,-486 202,-179 548,-179 479,0 768,339 289,339 289,901 v 128 z m 1147,238 V 0 H 2766 V 531 Q 2569,213 2275,61 1981,-91 1556,-91 q -537,0 -855,302 -317,302 -317,808 0,590 395,890 396,300 1180,300 h 807 v 57 q 0,397 -261,614 -261,217 -733,217 -300,0 -585,-72 -284,-72 -546,-216 v 532 q 315,122 612,182 297,61 578,61 760,0 1135,-394 375,-393 375,-1193 z"
               transform="scale(0.015625)" />
            <path
               id="DejaVuSans-67"
               d="m 2906,1791 q 0,625 -258,968 -257,344 -723,344 -462,0 -720,-344 -258,-343 -258,-968 0,-622 258,-966 258,-344 720,-344 466,0 723,344 258,344 258,966 z M 3481,434 q 0,-893 -397,-1329 -396,-436 -1215,-436 -303,0 -572,45 -269,45 -522,139 v 559 q 253,-137 500,-202 247,-66 503,-66 566,0 847,295 281,295 281,892 V 616 Q 2728,306 2450,153 2172,0 1784,0 1141,0 747,490 353,981 353,1791 q 0,812 394,1302 394,491 1037,491 388,0 666,-153 278,-153 456,-462 v 531 h 575 z"
               transform="scale(0.015625)" />
            <path
               id="DejaVuSans-50"
               d="M 1259,4147 V 2394 h 794 q 441,0 681,228 241,228 241,650 0,419 -241,647 -240,228 -681,228 z m -631,519 h 1425 q 785,0 1186,-355 402,-355 402,-1039 0,-691 -402,-1044 -401,-353 -1186,-353 H 1259 V 0 H 628 Z"
               transform="scale(0.015625)" />
            <path
               id="DejaVuSans-49"
               d="m 628,4666 h 631 V 0 H 628 Z"
               transform="scale(0.015625)" />
            <path
               id="DejaVuSans-64"
               d="m 2906,2969 v 1894 h 575 V 0 H 2906 V 525 Q 2725,213 2448,61 2172,-91 1784,-91 1150,-91 751,415 353,922 353,1747 q 0,825 398,1331 399,506 1033,506 388,0 664,-152 277,-151 458,-463 z M 947,1747 q 0,-634 261,-995 261,-361 717,-361 456,0 718,361 263,361 263,995 0,634 -263,995 -262,361 -718,361 -456,0 -717,-361 -261,-361 -261,-995 z"
               transform="scale(0.015625)" />
            <path
               id="DejaVuSans-69"
               d="m 603,3500 h 575 V 0 H 603 Z m 0,1363 h 575 V 4134 H 603 Z"
               transform="scale(0.015625)" />
            <path
               id="DejaVuSans-73"
               d="m 2834,3397 v -544 q -243,125 -506,187 -262,63 -544,63 -428,0 -642,-131 -214,-131 -214,-394 0,-200 153,-314 153,-114 616,-217 l 197,-44 q 612,-131 870,-370 258,-239 258,-667 0,-488 -386,-773 Q 2250,-91 1575,-91 1294,-91 989,-36 684,19 347,128 v 594 q 319,-166 628,-249 309,-82 613,-82 406,0 624,139 219,139 219,392 0,234 -158,359 -157,125 -692,241 l -200,47 q -534,112 -772,345 -237,233 -237,639 0,494 350,762 350,269 994,269 318,0 599,-47 282,-46 519,-140 z"
               transform="scale(0.015625)" />
            <path
               id="DejaVuSans-74"
               d="M 1172,4494 V 3500 H 2356 V 3053 H 1172 V 1153 q 0,-428 117,-550 117,-122 477,-122 h 590 V 0 H 1766 Q 1100,0 847,248 594,497 594,1153 V 3053 H 172 v 447 h 422 v 994 z"
               transform="scale(0.015625)" />
            <path
               id="DejaVuSans-6e"
               d="M 3513,2113 V 0 h -575 v 2094 q 0,497 -194,743 -194,247 -581,247 -466,0 -735,-297 -269,-296 -269,-809 V 0 H 581 v 3500 h 578 v -544 q 207,316 486,472 280,156 646,156 603,0 912,-373 310,-373 310,-1098 z"
               transform="scale(0.015625)" />
            <path
               id="DejaVuSans-63"
               d="m 3122,3366 v -538 q -244,135 -489,202 -245,67 -495,67 -560,0 -870,-355 -309,-354 -309,-995 0,-641 309,-996 310,-354 870,-354 250,0 495,67 245,67 489,202 V 134 Q 2881,22 2623,-34 2366,-91 2075,-91 1284,-91 818,406 353,903 353,1747 q 0,856 470,1346 471,491 1290,491 265,0 518,-55 253,-54 491,-163 z"
               transform="scale(0.015625)" />
            <path
               id="DejaVuSans-65"
               d="M 3597,1894 V 1613 H 953 q 38,-594 358,-905 320,-311 892,-311 331,0 642,81 311,81 618,244 V 178 Q 3153,47 2828,-22 2503,-91 2169,-91 1331,-91 842,396 353,884 353,1716 q 0,859 464,1363 464,505 1252,505 706,0 1117,-455 411,-454 411,-1235 z m -575,169 q -6,471 -264,752 -258,282 -683,282 -481,0 -770,-272 -289,-272 -333,-766 z"
               transform="scale(0.015625)" />
          </defs>
          <use
             xlink:href="#DejaVuSans-61"
             id="use63" />
          <use
             xlink:href="#DejaVuSans-76"
             x="61.279297"
             id="use64" />
          <use
             xlink:href="#DejaVuSans-67"
             x="120.45898"
             id="use65" />
          <use
             xlink:href="#DejaVuSans-20"
             x="183.93555"
             id="use66" />
          <use
             xlink:href="#DejaVuSans-50"
             x="215.72266"
             id="use67" />
          <use
             xlink:href="#DejaVuSans-49"
             x="276.02539"
             id="use68" />
          <use
             xlink:href="#DejaVuSans-20"
             x="305.51758"
             id="use69" />
          <use
             xlink:href="#DejaVuSans-64"
             x="337.30469"
             id="use70" />
          <use
             xlink:href="#DejaVuSans-69"
             x="400.78125"
             id="use71" />
          <use
             xlink:href="#DejaVuSans-73"
             x="428.56445"
             id="use72" />
          <use
             xlink:href="#DejaVuSans-74"
             x="480.66406"
             id="use73" />
          <use
             xlink:href="#DejaVuSans-61"
             x="519.87305"
             id="use74" />
          <use
             xlink:href="#DejaVuSans-6e"
             x="581.15234"
             id="use75" />
          <use
             xlink:href="#DejaVuSans-63"
             x="644.53125"
             id="use76" />
          <use
             xlink:href="#DejaVuSans-65"
             x="699.51172"
             id="use77" />
          <use
             xlink:href="#DejaVuSans-20"
             x="761.03516"
             id="use78" />
          <use
             xlink:href="#DejaVuSans-65"
             x="792.82227"
             id="use79" />
          <use
             xlink:href="#DejaVuSans-73"
             x="854.3457"
             id="use80" />
          <use
             xlink:href="#DejaVuSans-74"
             x="906.44531"
             id="use81" />
          <use
             xlink:href="#DejaVuSans-69"
             x="945.6543"
             id="use82" />
          <use
             xlink:href="#DejaVuSans-6d"
             x="973.4375"
             id="use83" />
          <use
             xlink:href="#DejaVuSans-61"
             x="1070.8496"
             id="use84" />
          <use
             xlink:href="#DejaVuSans-74"
             x="1132.1289"
             id="use85" />
          <use
             xlink:href="#DejaVuSans-65"
             x="1171.3379"
             id="use86" />
          <use
             xlink:href="#DejaVuSans-73"
             x="1232.8613"
             id="use87" />
        </g>
      </g>
    </g>
    <g
       id="axes_2">
      <g
         id="patch_7">
        <path
           d="M 354.92727,203.04 H 583.2 V 51.84 H 354.92727 Z"
           style="fill:#ffffff"
           id="path87" />
      </g>
      <g
         id="matplotlib.axis_3">
        <g
           id="xtick_7">
          <g
             id="line2d_16">
            <g
               id="g88">
              <use
                 xlink:href="#mdd724a0be8"
                 x="365.30331"
                 y="203.03999"
                 style="stroke:#000000;stroke-width:0.8"
                 id="use88" />
            </g>
          </g>
        </g>
        <g
           id="xtick_8">
          <g
             id="line2d_17">
            <g
               id="g89">
              <use
                 xlink:href="#mdd724a0be8"
                 x="406.80743"
                 y="203.03999"
                 style="stroke:#000000;stroke-width:0.8"
                 id="use89" />
            </g>
          </g>
        </g>
        <g
           id="xtick_9">
          <g
             id="line2d_18">
            <g
               id="g90">
              <use
                 xlink:href="#mdd724a0be8"
                 x="448.31158"
                 y="203.03999"
                 style="stroke:#000000;stroke-width:0.8"
                 id="use90" />
            </g>
          </g>
        </g>
        <g
           id="xtick_10">
          <g
             id="line2d_19">
            <g
               id="g91">
              <use
                 xlink:href="#mdd724a0be8"
                 x="489.8157"
                 y="203.03999"
                 style="stroke:#000000;stroke-width:0.8"
                 id="use91" />
            </g>
          </g>
        </g>
        <g
           id="xtick_11">
          <g
             id="line2d_20">
            <g
               id="g92">
              <use
                 xlink:href="#mdd724a0be8"
                 x="531.31982"
                 y="203.03999"
                 style="stroke:#000000;stroke-width:0.8"
                 id="use92" />
            </g>
          </g>
        </g>
        <g
           id="xtick_12">
          <g
             id="line2d_21">
            <g
               id="g93">
              <use
                 xlink:href="#mdd724a0be8"
                 x="572.82397"
                 y="203.03999"
                 style="stroke:#000000;stroke-width:0.8"
                 id="use93" />
            </g>
          </g>
        </g>
      </g>
      <g
         id="matplotlib.axis_4">
        <g
           id="ytick_6">
          <g
             id="line2d_22">
            <g
               id="g94">
              <use
                 xlink:href="#m246a095773"
                 x="354.92728"
                 y="188.07272"
                 style="stroke:#000000;stroke-width:0.8"
                 id="use94" />
            </g>
          </g>
          <g
             id="text_8">
            <!-- 2 -->
            <g
               transform="matrix(0.1,0,0,-0.1,341.56477,191.87194)"
               id="g95">
              <use
                 xlink:href="#DejaVuSans-32"
                 id="use95" />
            </g>
          </g>
        </g>
        <g
           id="ytick_7">
          <g
             id="line2d_23">
            <g
               id="g96">
              <use
                 xlink:href="#m246a095773"
                 x="354.92728"
                 y="163.98615"
                 style="stroke:#000000;stroke-width:0.8"
                 id="use96" />
            </g>
          </g>
          <g
             id="text_9">
            <!-- 4 -->
            <g
               transform="matrix(0.1,0,0,-0.1,341.56477,167.78537)"
               id="g97">
              <defs
                 id="defs96">
                <path
                   id="DejaVuSans-34"
                   d="M 2419,4116 825,1625 h 1594 z m -166,550 h 794 V 1625 h 666 V 1100 H 3047 V 0 H 2419 V 1100 H 313 v 609 z"
                   transform="scale(0.015625)" />
              </defs>
              <use
                 xlink:href="#DejaVuSans-34"
                 id="use97" />
            </g>
          </g>
        </g>
        <g
           id="ytick_8">
          <g
             id="line2d_24">
            <g
               id="g98">
              <use
                 xlink:href="#m246a095773"
                 x="354.92728"
                 y="139.89958"
                 style="stroke:#000000;stroke-width:0.8"
                 id="use98" />
            </g>
          </g>
          <g
             id="text_10">
            <!-- 6 -->
            <g
               transform="matrix(0.1,0,0,-0.1,341.56477,143.6988)"
               id="g99">
              <defs
                 id="defs98">
                <path
                   id="DejaVuSans-36"
                   d="m 2113,2584 q -425,0 -674,-291 -248,-290 -248,-796 0,-503 248,-796 249,-292 674,-292 425,0 673,292 248,293 248,796 0,506 -248,796 -248,291 -673,291 z m 1253,1979 v -575 q -238,112 -480,171 -242,60 -480,60 -625,0 -955,-422 -329,-422 -376,-1275 184,272 462,417 279,145 613,145 703,0 1111,-427 408,-426 408,-1160 0,-719 -425,-1154 -425,-434 -1131,-434 -810,0 -1238,620 -428,621 -428,1799 0,1106 525,1764 525,658 1409,658 238,0 480,-47 242,-47 505,-140 z"
                   transform="scale(0.015625)" />
              </defs>
              <use
                 xlink:href="#DejaVuSans-36"
                 id="use99" />
            </g>
          </g>
        </g>
        <g
           id="ytick_9">
          <g
             id="line2d_25">
            <g
               id="g100">
              <use
                 xlink:href="#m246a095773"
                 x="354.92728"
                 y="115.81301"
                 style="stroke:#000000;stroke-width:0.8"
                 id="use100" />
            </g>
          </g>
          <g
             id="text_11">
            <!-- 8 -->
            <g
               transform="matrix(0.1,0,0,-0.1,341.56477,119.61223)"
               id="g101">
              <defs
                 id="defs100">
                <path
                   id="DejaVuSans-38"
                   d="m 2034,2216 q -450,0 -708,-241 -257,-241 -257,-662 0,-422 257,-663 258,-241 708,-241 450,0 709,242 260,243 260,662 0,421 -258,662 -257,241 -711,241 z m -631,268 q -406,100 -633,378 -226,279 -226,679 0,559 398,884 399,325 1092,325 697,0 1094,-325 397,-325 397,-884 0,-400 -227,-679 -226,-278 -629,-378 456,-106 710,-416 255,-309 255,-755 Q 3634,634 3220,271 2806,-91 2034,-91 1263,-91 848,271 434,634 434,1313 q 0,446 256,755 257,310 713,416 z m -231,997 q 0,-362 226,-565 227,-203 636,-203 407,0 636,203 230,203 230,565 0,363 -230,566 -229,203 -636,203 -409,0 -636,-203 -226,-203 -226,-566 z"
                   transform="scale(0.015625)" />
              </defs>
              <use
                 xlink:href="#DejaVuSans-38"
                 id="use101" />
            </g>
          </g>
        </g>
        <g
           id="ytick_10">
          <g
             id="line2d_26">
            <g
               id="g102">
              <use
                 xlink:href="#m246a095773"
                 x="354.92728"
                 y="91.72644"
                 style="stroke:#000000;stroke-width:0.8"
                 id="use102" />
            </g>
          </g>
          <g
             id="text_12">
            <!-- 10 -->
            <g
               transform="matrix(0.1,0,0,-0.1,335.20227,95.525659)"
               id="g104">
              <defs
                 id="defs102">
                <path
                   id="DejaVuSans-31"
                   d="M 794,531 H 1825 V 4091 L 703,3866 v 575 l 1116,225 h 631 V 531 H 3481 V 0 H 794 Z"
                   transform="scale(0.015625)" />
              </defs>
              <use
                 xlink:href="#DejaVuSans-31"
                 id="use103" />
              <use
                 xlink:href="#DejaVuSans-30"
                 x="63.623047"
                 id="use104" />
            </g>
          </g>
        </g>
        <g
           id="ytick_11">
          <g
             id="line2d_27">
            <g
               id="g105">
              <use
                 xlink:href="#m246a095773"
                 x="354.92728"
                 y="67.63987"
                 style="stroke:#000000;stroke-width:0.8"
                 id="use105" />
            </g>
          </g>
          <g
             id="text_13">
            <!-- 12 -->
            <g
               transform="matrix(0.1,0,0,-0.1,335.20227,71.439089)"
               id="g107">
              <use
                 xlink:href="#DejaVuSans-31"
                 id="use106" />
              <use
                 xlink:href="#DejaVuSans-32"
                 x="63.623047"
                 id="use107" />
            </g>
          </g>
        </g>
        <g
           id="text_14">
          <!-- $\sigma$ [vm] -->
          <g
             transform="matrix(0,-0.1,-0.1,0,329.12259,143.94)"
             id="g113">
            <defs
               id="defs107">
              <path
                 id="DejaVuSans-Oblique-3c3"
                 d="m 2219,3044 q -475,0 -797,-344 -341,-359 -453,-953 -125,-628 75,-991 197,-359 662,-359 460,0 797,362 341,363 463,988 109,572 -85,953 -181,344 -662,344 z m 90,459 1910,-3 -113,-575 H 3463 Q 3706,2438 3575,1747 3406,888 2884,400 2359,-91 1609,-91 856,-91 525,400 194,888 363,1747 q 165,862 687,1350 434,406 1259,406 z"
                 transform="scale(0.015625)" />
            </defs>
            <use
               xlink:href="#DejaVuSans-Oblique-3c3"
               transform="translate(0,0.015625)"
               id="use108" />
            <use
               xlink:href="#DejaVuSans-20"
               transform="translate(63.378906,0.015625)"
               id="use109" />
            <use
               xlink:href="#DejaVuSans-5b"
               transform="translate(95.166016,0.015625)"
               id="use110" />
            <use
               xlink:href="#DejaVuSans-76"
               transform="translate(134.17969,0.015625)"
               id="use111" />
            <use
               xlink:href="#DejaVuSans-6d"
               transform="translate(193.35937,0.015625)"
               id="use112" />
            <use
               xlink:href="#DejaVuSans-5d"
               transform="translate(290.77148,0.015625)"
               id="use113" />
          </g>
        </g>
      </g>
      <g
         id="LineCollection_2">
        <path
           d="M 365.30331,144.24439 V 93.828937"
           clip-path="url(#p5756027a2c)"
           style="fill:none;stroke:#000000;stroke-width:2.5"
           id="path113" />
        <path
           d="M 406.80744,177.2892 V 161.22395"
           clip-path="url(#p5756027a2c)"
           style="fill:none;stroke:#000000;stroke-width:2.5"
           id="path114" />
        <path
           d="M 448.31157,188.01619 V 170.57936"
           clip-path="url(#p5756027a2c)"
           style="fill:none;stroke:#000000;stroke-width:2.5"
           id="path115" />
        <path
           d="m 489.8157,193.96761 v -9.91654"
           clip-path="url(#p5756027a2c)"
           style="fill:none;stroke:#000000;stroke-width:2.5"
           id="path116" />
        <path
           d="m 531.31983,196.16727 v -7.4776"
           clip-path="url(#p5756027a2c)"
           style="fill:none;stroke:#000000;stroke-width:2.5"
           id="path117" />
        <path
           d="M 572.82397,143.55932 V 58.712727"
           clip-path="url(#p5756027a2c)"
           style="fill:none;stroke:#000000;stroke-width:2.5"
           id="path118" />
      </g>
      <g
         id="line2d_28">
        <g
           clip-path="url(#p5756027a2c)"
           id="g123">
          <use
             xlink:href="#m176cfbef69"
             x="365.30331"
             y="144.24438"
             style="stroke:#000000"
             id="use118" />
          <use
             xlink:href="#m176cfbef69"
             x="406.80743"
             y="177.2892"
             style="stroke:#000000"
             id="use119" />
          <use
             xlink:href="#m176cfbef69"
             x="448.31158"
             y="188.01619"
             style="stroke:#000000"
             id="use120" />
          <use
             xlink:href="#m176cfbef69"
             x="489.8157"
             y="193.96761"
             style="stroke:#000000"
             id="use121" />
          <use
             xlink:href="#m176cfbef69"
             x="531.31982"
             y="196.16727"
             style="stroke:#000000"
             id="use122" />
          <use
             xlink:href="#m176cfbef69"
             x="572.82397"
             y="143.55933"
             style="stroke:#000000"
             id="use123" />
        </g>
      </g>
      <g
         id="line2d_29">
        <g
           clip-path="url(#p5756027a2c)"
           id="g129">
          <use
             xlink:href="#m176cfbef69"
             x="365.30331"
             y="93.828934"
             style="stroke:#000000"
             id="use124" />
          <use
             xlink:href="#m176cfbef69"
             x="406.80743"
             y="161.22395"
             style="stroke:#000000"
             id="use125" />
          <use
             xlink:href="#m176cfbef69"
             x="448.31158"
             y="170.57936"
             style="stroke:#000000"
             id="use126" />
          <use
             xlink:href="#m176cfbef69"
             x="489.8157"
             y="184.05107"
             style="stroke:#000000"
             id="use127" />
          <use
             xlink:href="#m176cfbef69"
             x="531.31982"
             y="188.68967"
             style="stroke:#000000"
             id="use128" />
          <use
             xlink:href="#m176cfbef69"
             x="572.82397"
             y="58.712727"
             style="stroke:#000000"
             id="use129" />
        </g>
      </g>
      <g
         id="line2d_30">
        <g
           clip-path="url(#p5756027a2c)"
           id="g135">
          <use
             xlink:href="#mc77a1e649d"
             x="365.30331"
             y="124.47381"
             style="stroke:#000000"
             id="use130" />
          <use
             xlink:href="#mc77a1e649d"
             x="406.80743"
             y="171.64662"
             style="stroke:#000000"
             id="use131" />
          <use
             xlink:href="#mc77a1e649d"
             x="448.31158"
             y="181.29694"
             style="stroke:#000000"
             id="use132" />
          <use
             xlink:href="#mc77a1e649d"
             x="489.8157"
             y="189.8008"
             style="stroke:#000000"
             id="use133" />
          <use
             xlink:href="#mc77a1e649d"
             x="531.31982"
             y="193.12967"
             style="stroke:#000000"
             id="use134" />
          <use
             xlink:href="#mc77a1e649d"
             x="572.82397"
             y="114.27205"
             style="stroke:#000000"
             id="use135" />
        </g>
      </g>
      <g
         id="patch_8">
        <path
           d="M 354.92727,203.04 V 51.84"
           style="fill:none;stroke:#000000;stroke-width:0.8;stroke-linecap:square;stroke-linejoin:miter"
           id="path135" />
      </g>
      <g
         id="patch_9">
        <path
           d="M 583.2,203.04 V 51.84"
           style="fill:none;stroke:#000000;stroke-width:0.8;stroke-linecap:square;stroke-linejoin:miter"
           id="path136" />
      </g>
      <g
         id="patch_10">
        <path
           d="M 354.92727,203.04 H 583.2"
           style="fill:none;stroke:#000000;stroke-width:0.8;stroke-linecap:square;stroke-linejoin:miter"
           id="path137" />
      </g>
      <g
         id="patch_11">
        <path
           d="M 354.92727,51.84 H 583.2"
           style="fill:none;stroke:#000000;stroke-width:0.8;stroke-linecap:square;stroke-linejoin:miter"
           id="path138" />
      </g>
      <g
         id="text_15">
        <!-- std of PI distance estimates -->
        <g
           transform="matrix(0.12,0,0,-0.12,386.02645,45.84)"
           id="g165">
          <defs
             id="defs138">
            <path
               id="DejaVuSans-6f"
               d="m 1959,3097 q -462,0 -731,-361 -269,-361 -269,-989 0,-628 267,-989 268,-361 733,-361 460,0 728,362 269,363 269,988 0,622 -269,986 -268,364 -728,364 z m 0,487 q 750,0 1178,-488 429,-487 429,-1349 Q 3566,888 3137,398 2709,-91 1959,-91 1206,-91 779,398 353,888 353,1747 q 0,862 426,1349 427,488 1180,488 z"
               transform="scale(0.015625)" />
            <path
               id="DejaVuSans-66"
               d="m 2375,4863 v -479 h -550 q -309,0 -430,-125 -120,-125 -120,-450 v -309 h 947 V 3053 H 1275 V 0 H 697 V 3053 H 147 v 447 h 550 v 244 q 0,584 272,851 272,268 862,268 z"
               transform="scale(0.015625)" />
          </defs>
          <use
             xlink:href="#DejaVuSans-73"
             id="use138" />
          <use
             xlink:href="#DejaVuSans-74"
             x="52.099609"
             id="use139" />
          <use
             xlink:href="#DejaVuSans-64"
             x="91.308594"
             id="use140" />
          <use
             xlink:href="#DejaVuSans-20"
             x="154.78516"
             id="use141" />
          <use
             xlink:href="#DejaVuSans-6f"
             x="186.57227"
             id="use142" />
          <use
             xlink:href="#DejaVuSans-66"
             x="247.75391"
             id="use143" />
          <use
             xlink:href="#DejaVuSans-20"
             x="282.95898"
             id="use144" />
          <use
             xlink:href="#DejaVuSans-50"
             x="314.74609"
             id="use145" />
          <use
             xlink:href="#DejaVuSans-49"
             x="375.04883"
             id="use146" />
          <use
             xlink:href="#DejaVuSans-20"
             x="404.54102"
             id="use147" />
          <use
             xlink:href="#DejaVuSans-64"
             x="436.32812"
             id="use148" />
          <use
             xlink:href="#DejaVuSans-69"
             x="499.80469"
             id="use149" />
          <use
             xlink:href="#DejaVuSans-73"
             x="527.58789"
             id="use150" />
          <use
             xlink:href="#DejaVuSans-74"
             x="579.6875"
             id="use151" />
          <use
             xlink:href="#DejaVuSans-61"
             x="618.89648"
             id="use152" />
          <use
             xlink:href="#DejaVuSans-6e"
             x="680.17578"
             id="use153" />
          <use
             xlink:href="#DejaVuSans-63"
             x="743.55469"
             id="use154" />
          <use
             xlink:href="#DejaVuSans-65"
             x="798.53516"
             id="use155" />
          <use
             xlink:href="#DejaVuSans-20"
             x="860.05859"
             id="use156" />
          <use
             xlink:href="#DejaVuSans-65"
             x="891.8457"
             id="use157" />
          <use
             xlink:href="#DejaVuSans-73"
             x="953.36914"
             id="use158" />
          <use
             xlink:href="#DejaVuSans-74"
             x="1005.4688"
             id="use159" />
          <use
             xlink:href="#DejaVuSans-69"
             x="1044.6777"
             id="use160" />
          <use
             xlink:href="#DejaVuSans-6d"
             x="1072.4609"
             id="use161" />
          <use
             xlink:href="#DejaVuSans-61"
             x="1169.873"
             id="use162" />
          <use
             xlink:href="#DejaVuSans-74"
             x="1231.1523"
             id="use163" />
          <use
             xlink:href="#DejaVuSans-65"
             x="1270.3613"
             id="use164" />
          <use
             xlink:href="#DejaVuSans-73"
             x="1331.8848"
             id="use165" />
        </g>
      </g>
    </g>
    <g
       id="axes_3">
      <g
         id="patch_12">
        <path
           d="M 81,384.48 H 309.27273 V 233.28 H 81 Z"
           style="fill:#ffffff"
           id="path165" />
      </g>
      <g
         id="matplotlib.axis_5">
        <g
           id="xtick_13">
          <g
             id="line2d_31">
            <g
               id="g166">
              <use
                 xlink:href="#mdd724a0be8"
                 x="91.37603"
                 y="384.48001"
                 style="stroke:#000000;stroke-width:0.8"
                 id="use166" />
            </g>
          </g>
          <g
             id="text_16">
            <!-- 0 -->
            <g
               transform="matrix(0.1,0,0,-0.1,88.194783,399.07844)"
               id="g167">
              <use
                 xlink:href="#DejaVuSans-30"
                 id="use167" />
            </g>
          </g>
        </g>
        <g
           id="xtick_14">
          <g
             id="line2d_32">
            <g
               id="g168">
              <use
                 xlink:href="#mdd724a0be8"
                 x="132.88016"
                 y="384.48001"
                 style="stroke:#000000;stroke-width:0.8"
                 id="use168" />
            </g>
          </g>
          <g
             id="text_17">
            <!-- 1 -->
            <g
               transform="matrix(0.1,0,0,-0.1,129.69891,399.07844)"
               id="g169">
              <use
                 xlink:href="#DejaVuSans-31"
                 id="use169" />
            </g>
          </g>
        </g>
        <g
           id="xtick_15">
          <g
             id="line2d_33">
            <g
               id="g170">
              <use
                 xlink:href="#mdd724a0be8"
                 x="174.38429"
                 y="384.48001"
                 style="stroke:#000000;stroke-width:0.8"
                 id="use170" />
            </g>
          </g>
          <g
             id="text_18">
            <!-- 2 -->
            <g
               transform="matrix(0.1,0,0,-0.1,171.20305,399.07844)"
               id="g171">
              <use
                 xlink:href="#DejaVuSans-32"
                 id="use171" />
            </g>
          </g>
        </g>
        <g
           id="xtick_16">
          <g
             id="line2d_34">
            <g
               id="g172">
              <use
                 xlink:href="#mdd724a0be8"
                 x="215.88843"
                 y="384.48001"
                 style="stroke:#000000;stroke-width:0.8"
                 id="use172" />
            </g>
          </g>
          <g
             id="text_19">
            <!-- 3 -->
            <g
               transform="matrix(0.1,0,0,-0.1,212.70718,399.07844)"
               id="g173">
              <use
                 xlink:href="#DejaVuSans-33"
                 id="use173" />
            </g>
          </g>
        </g>
        <g
           id="xtick_17">
          <g
             id="line2d_35">
            <g
               id="g174">
              <use
                 xlink:href="#mdd724a0be8"
                 x="257.39255"
                 y="384.48001"
                 style="stroke:#000000;stroke-width:0.8"
                 id="use174" />
            </g>
          </g>
          <g
             id="text_20">
            <!-- 10 -->
            <g
               transform="matrix(0.1,0,0,-0.1,251.03006,399.07844)"
               id="g176">
              <use
                 xlink:href="#DejaVuSans-31"
                 id="use175" />
              <use
                 xlink:href="#DejaVuSans-30"
                 x="63.623047"
                 id="use176" />
            </g>
          </g>
        </g>
        <g
           id="xtick_18">
          <g
             id="line2d_36">
            <g
               id="g177">
              <use
                 xlink:href="#mdd724a0be8"
                 x="298.8967"
                 y="384.48001"
                 style="stroke:#000000;stroke-width:0.8"
                 id="use177" />
            </g>
          </g>
          <g
             id="text_21">
            <!-- 99 -->
            <g
               transform="matrix(0.1,0,0,-0.1,292.53419,399.07844)"
               id="g179">
              <defs
                 id="defs177">
                <path
                   id="DejaVuSans-39"
                   d="m 703,97 v 575 q 238,-113 481,-172 244,-59 479,-59 625,0 954,420 330,420 377,1277 -181,-269 -460,-413 -278,-144 -615,-144 -700,0 -1108,423 -408,424 -408,1159 0,718 425,1152 425,435 1131,435 810,0 1236,-621 427,-620 427,-1801 Q 3622,1225 3098,567 2575,-91 1691,-91 1453,-91 1209,-44 966,3 703,97 Z m 1256,1978 q 425,0 673,290 249,291 249,798 0,503 -249,795 -248,292 -673,292 -425,0 -673,-292 -248,-292 -248,-795 0,-507 248,-798 248,-290 673,-290 z"
                   transform="scale(0.015625)" />
              </defs>
              <use
                 xlink:href="#DejaVuSans-39"
                 id="use178" />
              <use
                 xlink:href="#DejaVuSans-39"
                 x="63.623047"
                 id="use179" />
            </g>
          </g>
        </g>
        <g
           id="text_22">
          <!-- number of objects -->
          <g
             transform="matrix(0.1,0,0,-0.1,149.61136,412.75656)"
             id="g196">
            <defs
               id="defs179">
              <path
                 id="DejaVuSans-75"
                 d="m 544,1381 v 2119 h 575 V 1403 q 0,-497 193,-746 194,-248 582,-248 465,0 735,297 271,297 271,810 v 1984 h 575 V 0 H 2900 V 538 Q 2691,219 2414,64 2138,-91 1772,-91 1169,-91 856,284 544,659 544,1381 Z m 1447,2203 z"
                 transform="scale(0.015625)" />
              <path
                 id="DejaVuSans-62"
                 d="m 3116,1747 q 0,634 -261,995 -261,361 -717,361 -457,0 -718,-361 -261,-361 -261,-995 0,-634 261,-995 261,-361 718,-361 456,0 717,361 261,361 261,995 z M 1159,2969 q 182,312 458,463 277,152 661,152 638,0 1036,-506 399,-506 399,-1331 Q 3713,922 3314,415 2916,-91 2278,-91 1894,-91 1617,61 1341,213 1159,525 V 0 H 581 v 4863 h 578 z"
                 transform="scale(0.015625)" />
              <path
                 id="DejaVuSans-72"
                 d="m 2631,2963 q -97,56 -211,82 -114,27 -251,27 -488,0 -749,-317 -261,-317 -261,-911 V 0 H 581 v 3500 h 578 v -544 q 182,319 472,473 291,155 707,155 59,0 131,-8 72,-7 159,-23 z"
                 transform="scale(0.015625)" />
              <path
                 id="DejaVuSans-6a"
                 d="m 603,3500 h 575 V -63 q 0,-668 -255,-968 -254,-300 -820,-300 h -219 v 487 H 38 q 328,0 446,152 119,151 119,629 z m 0,1363 h 575 V 4134 H 603 Z"
                 transform="scale(0.015625)" />
            </defs>
            <use
               xlink:href="#DejaVuSans-6e"
               id="use180" />
            <use
               xlink:href="#DejaVuSans-75"
               x="63.378906"
               id="use181" />
            <use
               xlink:href="#DejaVuSans-6d"
               x="126.75781"
               id="use182" />
            <use
               xlink:href="#DejaVuSans-62"
               x="224.16992"
               id="use183" />
            <use
               xlink:href="#DejaVuSans-65"
               x="287.64648"
               id="use184" />
            <use
               xlink:href="#DejaVuSans-72"
               x="349.16992"
               id="use185" />
            <use
               xlink:href="#DejaVuSans-20"
               x="390.2832"
               id="use186" />
            <use
               xlink:href="#DejaVuSans-6f"
               x="422.07031"
               id="use187" />
            <use
               xlink:href="#DejaVuSans-66"
               x="483.25195"
               id="use188" />
            <use
               xlink:href="#DejaVuSans-20"
               x="518.45703"
               id="use189" />
            <use
               xlink:href="#DejaVuSans-6f"
               x="550.24414"
               id="use190" />
            <use
               xlink:href="#DejaVuSans-62"
               x="611.42578"
               id="use191" />
            <use
               xlink:href="#DejaVuSans-6a"
               x="674.90234"
               id="use192" />
            <use
               xlink:href="#DejaVuSans-65"
               x="702.68555"
               id="use193" />
            <use
               xlink:href="#DejaVuSans-63"
               x="764.20898"
               id="use194" />
            <use
               xlink:href="#DejaVuSans-74"
               x="819.18945"
               id="use195" />
            <use
               xlink:href="#DejaVuSans-73"
               x="858.39844"
               id="use196" />
          </g>
        </g>
      </g>
      <g
         id="matplotlib.axis_6">
        <g
           id="ytick_12">
          <g
             id="line2d_37">
            <g
               id="g197">
              <use
                 xlink:href="#m246a095773"
                 x="81"
                 y="367.02783"
                 style="stroke:#000000;stroke-width:0.8"
                 id="use197" />
            </g>
          </g>
          <g
             id="text_23">
            <!-- 0 -->
            <g
               transform="matrix(0.1,0,0,-0.1,67.6375,370.82704)"
               id="g198">
              <use
                 xlink:href="#DejaVuSans-30"
                 id="use198" />
            </g>
          </g>
        </g>
        <g
           id="ytick_13">
          <g
             id="line2d_38">
            <g
               id="g199">
              <use
                 xlink:href="#m246a095773"
                 x="81"
                 y="337.78226"
                 style="stroke:#000000;stroke-width:0.8"
                 id="use199" />
            </g>
          </g>
          <g
             id="text_24">
            <!-- 10 -->
            <g
               transform="matrix(0.1,0,0,-0.1,61.275,341.58147)"
               id="g201">
              <use
                 xlink:href="#DejaVuSans-31"
                 id="use200" />
              <use
                 xlink:href="#DejaVuSans-30"
                 x="63.623047"
                 id="use201" />
            </g>
          </g>
        </g>
        <g
           id="ytick_14">
          <g
             id="line2d_39">
            <g
               id="g202">
              <use
                 xlink:href="#m246a095773"
                 x="81"
                 y="308.53668"
                 style="stroke:#000000;stroke-width:0.8"
                 id="use202" />
            </g>
          </g>
          <g
             id="text_25">
            <!-- 20 -->
            <g
               transform="matrix(0.1,0,0,-0.1,61.275,312.3359)"
               id="g204">
              <use
                 xlink:href="#DejaVuSans-32"
                 id="use203" />
              <use
                 xlink:href="#DejaVuSans-30"
                 x="63.623047"
                 id="use204" />
            </g>
          </g>
        </g>
        <g
           id="ytick_15">
          <g
             id="line2d_40">
            <g
               id="g205">
              <use
                 xlink:href="#m246a095773"
                 x="81"
                 y="279.29111"
                 style="stroke:#000000;stroke-width:0.8"
                 id="use205" />
            </g>
          </g>
          <g
             id="text_26">
            <!-- 30 -->
            <g
               transform="matrix(0.1,0,0,-0.1,61.275,283.09034)"
               id="g207">
              <use
                 xlink:href="#DejaVuSans-33"
                 id="use206" />
              <use
                 xlink:href="#DejaVuSans-30"
                 x="63.623047"
                 id="use207" />
            </g>
          </g>
        </g>
        <g
           id="ytick_16">
          <g
             id="line2d_41">
            <g
               id="g208">
              <use
                 xlink:href="#m246a095773"
                 x="81"
                 y="250.04555"
                 style="stroke:#000000;stroke-width:0.8"
                 id="use208" />
            </g>
          </g>
          <g
             id="text_27">
            <!-- 40 -->
            <g
               transform="matrix(0.1,0,0,-0.1,61.275,253.84477)"
               id="g210">
              <use
                 xlink:href="#DejaVuSans-34"
                 id="use209" />
              <use
                 xlink:href="#DejaVuSans-30"
                 x="63.623047"
                 id="use210" />
            </g>
          </g>
        </g>
        <g
           id="text_28">
          <!-- $\mu$ [deg] -->
          <g
             transform="matrix(0,-0.1,-0.1,0,55.175,326.98)"
             id="g217">
            <use
               xlink:href="#DejaVuSans-Oblique-3bc"
               transform="translate(0,0.015625)"
               id="use211" />
            <use
               xlink:href="#DejaVuSans-20"
               transform="translate(63.623047,0.015625)"
               id="use212" />
            <use
               xlink:href="#DejaVuSans-5b"
               transform="translate(95.410156,0.015625)"
               id="use213" />
            <use
               xlink:href="#DejaVuSans-64"
               transform="translate(134.42383,0.015625)"
               id="use214" />
            <use
               xlink:href="#DejaVuSans-65"
               transform="translate(197.90039,0.015625)"
               id="use215" />
            <use
               xlink:href="#DejaVuSans-67"
               transform="translate(259.42383,0.015625)"
               id="use216" />
            <use
               xlink:href="#DejaVuSans-5d"
               transform="translate(322.90039,0.015625)"
               id="use217" />
          </g>
        </g>
      </g>
      <g
         id="LineCollection_3">
        <path
           d="M 91.376033,335.29722 V 281.99663"
           clip-path="url(#pf6c8887f0c)"
           style="fill:none;stroke:#000000;stroke-width:2.5"
           id="path217" />
        <path
           d="M 132.88016,377.60727 V 367.01429"
           clip-path="url(#pf6c8887f0c)"
           style="fill:none;stroke:#000000;stroke-width:2.5"
           id="path218" />
        <path
           d="m 174.3843,372.33565 v -13.5446"
           clip-path="url(#pf6c8887f0c)"
           style="fill:none;stroke:#000000;stroke-width:2.5"
           id="path219" />
        <path
           d="m 215.88843,369.49124 v -10.5788"
           clip-path="url(#pf6c8887f0c)"
           style="fill:none;stroke:#000000;stroke-width:2.5"
           id="path220" />
        <path
           d="M 257.39256,352.68937 V 334.20502"
           clip-path="url(#pf6c8887f0c)"
           style="fill:none;stroke:#000000;stroke-width:2.5"
           id="path221" />
        <path
           d="M 298.89669,310.43546 V 240.15273"
           clip-path="url(#pf6c8887f0c)"
           style="fill:none;stroke:#000000;stroke-width:2.5"
           id="path222" />
      </g>
      <g
         id="line2d_42">
        <g
           clip-path="url(#pf6c8887f0c)"
           id="g227">
          <use
             xlink:href="#m176cfbef69"
             x="91.37603"
             y="335.29721"
             style="stroke:#000000"
             id="use222" />
          <use
             xlink:href="#m176cfbef69"
             x="132.88016"
             y="377.60727"
             style="stroke:#000000"
             id="use223" />
          <use
             xlink:href="#m176cfbef69"
             x="174.38429"
             y="372.33566"
             style="stroke:#000000"
             id="use224" />
          <use
             xlink:href="#m176cfbef69"
             x="215.88843"
             y="369.49124"
             style="stroke:#000000"
             id="use225" />
          <use
             xlink:href="#m176cfbef69"
             x="257.39255"
             y="352.68936"
             style="stroke:#000000"
             id="use226" />
          <use
             xlink:href="#m176cfbef69"
             x="298.8967"
             y="310.43546"
             style="stroke:#000000"
             id="use227" />
        </g>
      </g>
      <g
         id="line2d_43">
        <g
           clip-path="url(#pf6c8887f0c)"
           id="g233">
          <use
             xlink:href="#m176cfbef69"
             x="91.37603"
             y="281.99664"
             style="stroke:#000000"
             id="use228" />
          <use
             xlink:href="#m176cfbef69"
             x="132.88016"
             y="367.01428"
             style="stroke:#000000"
             id="use229" />
          <use
             xlink:href="#m176cfbef69"
             x="174.38429"
             y="358.79105"
             style="stroke:#000000"
             id="use230" />
          <use
             xlink:href="#m176cfbef69"
             x="215.88843"
             y="358.91245"
             style="stroke:#000000"
             id="use231" />
          <use
             xlink:href="#m176cfbef69"
             x="257.39255"
             y="334.20502"
             style="stroke:#000000"
             id="use232" />
          <use
             xlink:href="#m176cfbef69"
             x="298.8967"
             y="240.15273"
             style="stroke:#000000"
             id="use233" />
        </g>
      </g>
      <g
         id="line2d_44">
        <path
           d="M 81,367.02782 H 309.27273"
           clip-path="url(#pf6c8887f0c)"
           style="fill:none;stroke:#ff0000;stroke-width:1.5;stroke-dasharray:5.55, 2.4;stroke-dashoffset:0"
           id="path233" />
      </g>
      <g
         id="line2d_45">
        <g
           clip-path="url(#pf6c8887f0c)"
           id="g239">
          <use
             xlink:href="#mc77a1e649d"
             x="91.37603"
             y="307.36575"
             style="stroke:#000000"
             id="use234" />
          <use
             xlink:href="#mc77a1e649d"
             x="132.88016"
             y="372.16229"
             style="stroke:#000000"
             id="use235" />
          <use
             xlink:href="#mc77a1e649d"
             x="174.38429"
             y="367.1582"
             style="stroke:#000000"
             id="use236" />
          <use
             xlink:href="#mc77a1e649d"
             x="215.88843"
             y="365.61176"
             style="stroke:#000000"
             id="use237" />
          <use
             xlink:href="#mc77a1e649d"
             x="257.39255"
             y="346.27884"
             style="stroke:#000000"
             id="use238" />
          <use
             xlink:href="#mc77a1e649d"
             x="298.8967"
             y="279.0065"
             style="stroke:#000000"
             id="use239" />
        </g>
      </g>
      <g
         id="patch_13">
        <path
           d="M 81,384.48 V 233.28"
           style="fill:none;stroke:#000000;stroke-width:0.8;stroke-linecap:square;stroke-linejoin:miter"
           id="path239" />
      </g>
      <g
         id="patch_14">
        <path
           d="M 309.27273,384.48 V 233.28"
           style="fill:none;stroke:#000000;stroke-width:0.8;stroke-linecap:square;stroke-linejoin:miter"
           id="path240" />
      </g>
      <g
         id="patch_15">
        <path
           d="M 81,384.48 H 309.27273"
           style="fill:none;stroke:#000000;stroke-width:0.8;stroke-linecap:square;stroke-linejoin:miter"
           id="path241" />
      </g>
      <g
         id="patch_16">
        <path
           d="M 81,233.28 H 309.27273"
           style="fill:none;stroke:#000000;stroke-width:0.8;stroke-linecap:square;stroke-linejoin:miter"
           id="path242" />
      </g>
      <g
         id="text_29">
        <!-- avg PI direction estimates -->
        <g
           transform="matrix(0.12,0,0,-0.12,117.17199,227.28)"
           id="g267">
          <use
             xlink:href="#DejaVuSans-61"
             id="use242" />
          <use
             xlink:href="#DejaVuSans-76"
             x="61.279297"
             id="use243" />
          <use
             xlink:href="#DejaVuSans-67"
             x="120.45898"
             id="use244" />
          <use
             xlink:href="#DejaVuSans-20"
             x="183.93555"
             id="use245" />
          <use
             xlink:href="#DejaVuSans-50"
             x="215.72266"
             id="use246" />
          <use
             xlink:href="#DejaVuSans-49"
             x="276.02539"
             id="use247" />
          <use
             xlink:href="#DejaVuSans-20"
             x="305.51758"
             id="use248" />
          <use
             xlink:href="#DejaVuSans-64"
             x="337.30469"
             id="use249" />
          <use
             xlink:href="#DejaVuSans-69"
             x="400.78125"
             id="use250" />
          <use
             xlink:href="#DejaVuSans-72"
             x="428.56445"
             id="use251" />
          <use
             xlink:href="#DejaVuSans-65"
             x="467.42773"
             id="use252" />
          <use
             xlink:href="#DejaVuSans-63"
             x="528.95117"
             id="use253" />
          <use
             xlink:href="#DejaVuSans-74"
             x="583.93164"
             id="use254" />
          <use
             xlink:href="#DejaVuSans-69"
             x="623.14062"
             id="use255" />
          <use
             xlink:href="#DejaVuSans-6f"
             x="650.92383"
             id="use256" />
          <use
             xlink:href="#DejaVuSans-6e"
             x="712.10547"
             id="use257" />
          <use
             xlink:href="#DejaVuSans-20"
             x="775.48438"
             id="use258" />
          <use
             xlink:href="#DejaVuSans-65"
             x="807.27148"
             id="use259" />
          <use
             xlink:href="#DejaVuSans-73"
             x="868.79492"
             id="use260" />
          <use
             xlink:href="#DejaVuSans-74"
             x="920.89453"
             id="use261" />
          <use
             xlink:href="#DejaVuSans-69"
             x="960.10352"
             id="use262" />
          <use
             xlink:href="#DejaVuSans-6d"
             x="987.88672"
             id="use263" />
          <use
             xlink:href="#DejaVuSans-61"
             x="1085.2988"
             id="use264" />
          <use
             xlink:href="#DejaVuSans-74"
             x="1146.5781"
             id="use265" />
          <use
             xlink:href="#DejaVuSans-65"
             x="1185.7871"
             id="use266" />
          <use
             xlink:href="#DejaVuSans-73"
             x="1247.3105"
             id="use267" />
        </g>
      </g>
    </g>
    <g
       id="axes_4">
      <g
         id="patch_17">
        <path
           d="M 354.92727,384.48 H 583.2 V 233.28 H 354.92727 Z"
           style="fill:#ffffff"
           id="path267" />
      </g>
      <g
         id="matplotlib.axis_7">
        <g
           id="xtick_19">
          <g
             id="line2d_46">
            <g
               id="g268">
              <use
                 xlink:href="#mdd724a0be8"
                 x="365.30331"
                 y="384.48001"
                 style="stroke:#000000;stroke-width:0.8"
                 id="use268" />
            </g>
          </g>
          <g
             id="text_30">
            <!-- 0 -->
            <g
               transform="matrix(0.1,0,0,-0.1,362.12206,399.07844)"
               id="g269">
              <use
                 xlink:href="#DejaVuSans-30"
                 id="use269" />
            </g>
          </g>
        </g>
        <g
           id="xtick_20">
          <g
             id="line2d_47">
            <g
               id="g270">
              <use
                 xlink:href="#mdd724a0be8"
                 x="406.80743"
                 y="384.48001"
                 style="stroke:#000000;stroke-width:0.8"
                 id="use270" />
            </g>
          </g>
          <g
             id="text_31">
            <!-- 1 -->
            <g
               transform="matrix(0.1,0,0,-0.1,403.62619,399.07844)"
               id="g271">
              <use
                 xlink:href="#DejaVuSans-31"
                 id="use271" />
            </g>
          </g>
        </g>
        <g
           id="xtick_21">
          <g
             id="line2d_48">
            <g
               id="g272">
              <use
                 xlink:href="#mdd724a0be8"
                 x="448.31158"
                 y="384.48001"
                 style="stroke:#000000;stroke-width:0.8"
                 id="use272" />
            </g>
          </g>
          <g
             id="text_32">
            <!-- 2 -->
            <g
               transform="matrix(0.1,0,0,-0.1,445.13032,399.07844)"
               id="g273">
              <use
                 xlink:href="#DejaVuSans-32"
                 id="use273" />
            </g>
          </g>
        </g>
        <g
           id="xtick_22">
          <g
             id="line2d_49">
            <g
               id="g274">
              <use
                 xlink:href="#mdd724a0be8"
                 x="489.8157"
                 y="384.48001"
                 style="stroke:#000000;stroke-width:0.8"
                 id="use274" />
            </g>
          </g>
          <g
             id="text_33">
            <!-- 3 -->
            <g
               transform="matrix(0.1,0,0,-0.1,486.63445,399.07844)"
               id="g275">
              <use
                 xlink:href="#DejaVuSans-33"
                 id="use275" />
            </g>
          </g>
        </g>
        <g
           id="xtick_23">
          <g
             id="line2d_50">
            <g
               id="g276">
              <use
                 xlink:href="#mdd724a0be8"
                 x="531.31982"
                 y="384.48001"
                 style="stroke:#000000;stroke-width:0.8"
                 id="use276" />
            </g>
          </g>
          <g
             id="text_34">
            <!-- 10 -->
            <g
               transform="matrix(0.1,0,0,-0.1,524.95733,399.07844)"
               id="g278">
              <use
                 xlink:href="#DejaVuSans-31"
                 id="use277" />
              <use
                 xlink:href="#DejaVuSans-30"
                 x="63.623047"
                 id="use278" />
            </g>
          </g>
        </g>
        <g
           id="xtick_24">
          <g
             id="line2d_51">
            <g
               id="g279">
              <use
                 xlink:href="#mdd724a0be8"
                 x="572.82397"
                 y="384.48001"
                 style="stroke:#000000;stroke-width:0.8"
                 id="use279" />
            </g>
          </g>
          <g
             id="text_35">
            <!-- 99 -->
            <g
               transform="matrix(0.1,0,0,-0.1,566.46147,399.07844)"
               id="g281">
              <use
                 xlink:href="#DejaVuSans-39"
                 id="use280" />
              <use
                 xlink:href="#DejaVuSans-39"
                 x="63.623047"
                 id="use281" />
            </g>
          </g>
        </g>
        <g
           id="text_36">
          <!-- number of objects -->
          <g
             transform="matrix(0.1,0,0,-0.1,423.53864,412.75656)"
             id="g298">
            <use
               xlink:href="#DejaVuSans-6e"
               id="use282" />
            <use
               xlink:href="#DejaVuSans-75"
               x="63.378906"
               id="use283" />
            <use
               xlink:href="#DejaVuSans-6d"
               x="126.75781"
               id="use284" />
            <use
               xlink:href="#DejaVuSans-62"
               x="224.16992"
               id="use285" />
            <use
               xlink:href="#DejaVuSans-65"
               x="287.64648"
               id="use286" />
            <use
               xlink:href="#DejaVuSans-72"
               x="349.16992"
               id="use287" />
            <use
               xlink:href="#DejaVuSans-20"
               x="390.2832"
               id="use288" />
            <use
               xlink:href="#DejaVuSans-6f"
               x="422.07031"
               id="use289" />
            <use
               xlink:href="#DejaVuSans-66"
               x="483.25195"
               id="use290" />
            <use
               xlink:href="#DejaVuSans-20"
               x="518.45703"
               id="use291" />
            <use
               xlink:href="#DejaVuSans-6f"
               x="550.24414"
               id="use292" />
            <use
               xlink:href="#DejaVuSans-62"
               x="611.42578"
               id="use293" />
            <use
               xlink:href="#DejaVuSans-6a"
               x="674.90234"
               id="use294" />
            <use
               xlink:href="#DejaVuSans-65"
               x="702.68555"
               id="use295" />
            <use
               xlink:href="#DejaVuSans-63"
               x="764.20898"
               id="use296" />
            <use
               xlink:href="#DejaVuSans-74"
               x="819.18945"
               id="use297" />
            <use
               xlink:href="#DejaVuSans-73"
               x="858.39844"
               id="use298" />
          </g>
        </g>
      </g>
      <g
         id="matplotlib.axis_8">
        <g
           id="ytick_17">
          <g
             id="line2d_52">
            <g
               id="g299">
              <use
                 xlink:href="#m246a095773"
                 x="354.92728"
                 y="383.76639"
                 style="stroke:#000000;stroke-width:0.8"
                 id="use299" />
            </g>
          </g>
          <g
             id="text_37">
            <!-- 0 -->
            <g
               transform="matrix(0.1,0,0,-0.1,341.56477,387.5656)"
               id="g300">
              <use
                 xlink:href="#DejaVuSans-30"
                 id="use300" />
            </g>
          </g>
        </g>
        <g
           id="ytick_18">
          <g
             id="line2d_53">
            <g
               id="g301">
              <use
                 xlink:href="#m246a095773"
                 x="354.92728"
                 y="361.54016"
                 style="stroke:#000000;stroke-width:0.8"
                 id="use301" />
            </g>
          </g>
          <g
             id="text_38">
            <!-- 5 -->
            <g
               transform="matrix(0.1,0,0,-0.1,341.56477,365.33938)"
               id="g302">
              <use
                 xlink:href="#DejaVuSans-35"
                 id="use302" />
            </g>
          </g>
        </g>
        <g
           id="ytick_19">
          <g
             id="line2d_54">
            <g
               id="g303">
              <use
                 xlink:href="#m246a095773"
                 x="354.92728"
                 y="339.31393"
                 style="stroke:#000000;stroke-width:0.8"
                 id="use303" />
            </g>
          </g>
          <g
             id="text_39">
            <!-- 10 -->
            <g
               transform="matrix(0.1,0,0,-0.1,335.20227,343.11316)"
               id="g305">
              <use
                 xlink:href="#DejaVuSans-31"
                 id="use304" />
              <use
                 xlink:href="#DejaVuSans-30"
                 x="63.623047"
                 id="use305" />
            </g>
          </g>
        </g>
        <g
           id="ytick_20">
          <g
             id="line2d_55">
            <g
               id="g306">
              <use
                 xlink:href="#m246a095773"
                 x="354.92728"
                 y="317.08774"
                 style="stroke:#000000;stroke-width:0.8"
                 id="use306" />
            </g>
          </g>
          <g
             id="text_40">
            <!-- 15 -->
            <g
               transform="matrix(0.1,0,0,-0.1,335.20227,320.88695)"
               id="g308">
              <use
                 xlink:href="#DejaVuSans-31"
                 id="use307" />
              <use
                 xlink:href="#DejaVuSans-35"
                 x="63.623047"
                 id="use308" />
            </g>
          </g>
        </g>
        <g
           id="ytick_21">
          <g
             id="line2d_56">
            <g
               id="g309">
              <use
                 xlink:href="#m246a095773"
                 x="354.92728"
                 y="294.86151"
                 style="stroke:#000000;stroke-width:0.8"
                 id="use309" />
            </g>
          </g>
          <g
             id="text_41">
            <!-- 20 -->
            <g
               transform="matrix(0.1,0,0,-0.1,335.20227,298.66073)"
               id="g311">
              <use
                 xlink:href="#DejaVuSans-32"
                 id="use310" />
              <use
                 xlink:href="#DejaVuSans-30"
                 x="63.623047"
                 id="use311" />
            </g>
          </g>
        </g>
        <g
           id="ytick_22">
          <g
             id="line2d_57">
            <g
               id="g312">
              <use
                 xlink:href="#m246a095773"
                 x="354.92728"
                 y="272.63528"
                 style="stroke:#000000;stroke-width:0.8"
                 id="use312" />
            </g>
          </g>
          <g
             id="text_42">
            <!-- 25 -->
            <g
               transform="matrix(0.1,0,0,-0.1,335.20227,276.43451)"
               id="g314">
              <use
                 xlink:href="#DejaVuSans-32"
                 id="use313" />
              <use
                 xlink:href="#DejaVuSans-35"
                 x="63.623047"
                 id="use314" />
            </g>
          </g>
        </g>
        <g
           id="ytick_23">
          <g
             id="line2d_58">
            <g
               id="g315">
              <use
                 xlink:href="#m246a095773"
                 x="354.92728"
                 y="250.40907"
                 style="stroke:#000000;stroke-width:0.8"
                 id="use315" />
            </g>
          </g>
          <g
             id="text_43">
            <!-- 30 -->
            <g
               transform="matrix(0.1,0,0,-0.1,335.20227,254.20829)"
               id="g317">
              <use
                 xlink:href="#DejaVuSans-33"
                 id="use316" />
              <use
                 xlink:href="#DejaVuSans-30"
                 x="63.623047"
                 id="use317" />
            </g>
          </g>
        </g>
        <g
           id="text_44">
          <!-- $\sqrt{1/\kappa}$ [deg] -->
          <g
             transform="matrix(0,-0.1,-0.1,0,329.10227,336.13)"
             id="g327">
            <defs
               id="defs317">
              <path
                 id="STIXSizeOneSym-Regular-221a"
                 d="M 6970,9933 3373,-1888 H 3104 L 1626,2918 q -71,231 -161,333 -89,103 -236,103 -218,0 -435,-173 l -77,128 1049,806 h 160 L 3379,-602 h 26 L 6605,9933 Z"
                 transform="scale(0.015625)" />
              <path
                 id="DejaVuSans-2f"
                 d="m 1625,4666 h 531 L 531,-594 H 0 Z"
                 transform="scale(0.015625)" />
              <path
                 id="DejaVuSans-Oblique-3ba"
                 d="m 938,3500 h 593 L 1247,2047 3041,3500 h 700 L 2106,2181 3275,0 H 2572 L 1628,1806 1122,1403 850,0 H 256 Z"
                 transform="scale(0.015625)" />
            </defs>
            <use
               xlink:href="#STIXSizeOneSym-Regular-221a"
               transform="matrix(0.614161,0,0,0.614161,0,9.703125)"
               id="use318" />
            <use
               xlink:href="#DejaVuSans-31"
               transform="translate(77.406403,0.84375)"
               id="use319" />
            <use
               xlink:href="#DejaVuSans-2f"
               transform="translate(141.02945,0.84375)"
               id="use320" />
            <use
               xlink:href="#DejaVuSans-Oblique-3ba"
               transform="translate(174.72086,0.84375)"
               id="use321" />
            <use
               xlink:href="#DejaVuSans-20"
               transform="translate(246.1564,0.875)"
               id="use322" />
            <use
               xlink:href="#DejaVuSans-5b"
               transform="translate(277.94351,0.875)"
               id="use323" />
            <use
               xlink:href="#DejaVuSans-64"
               transform="translate(316.95718,0.875)"
               id="use324" />
            <use
               xlink:href="#DejaVuSans-65"
               transform="translate(380.43375,0.875)"
               id="use325" />
            <use
               xlink:href="#DejaVuSans-67"
               transform="translate(441.95718,0.875)"
               id="use326" />
            <use
               xlink:href="#DejaVuSans-5d"
               transform="translate(505.43375,0.875)"
               id="use327" />
            <path
               d="m 64.906403,98.5 v 6.25 H 246.1564 V 98.5 Z"
               id="path327" />
          </g>
        </g>
      </g>
      <g
         id="LineCollection_4">
        <path
           d="M 365.30331,313.3372 V 268.65295"
           clip-path="url(#pb7febf5ede)"
           style="fill:none;stroke:#000000;stroke-width:2.5"
           id="path328" />
        <path
           d="m 406.80744,369.21863 v -9.85648"
           clip-path="url(#pb7febf5ede)"
           style="fill:none;stroke:#000000;stroke-width:2.5"
           id="path329" />
        <path
           d="M 448.31157,369.87708 V 349.33974"
           clip-path="url(#pb7febf5ede)"
           style="fill:none;stroke:#000000;stroke-width:2.5"
           id="path330" />
        <path
           d="M 489.8157,375.76125 V 358.40329"
           clip-path="url(#pb7febf5ede)"
           style="fill:none;stroke:#000000;stroke-width:2.5"
           id="path331" />
        <path
           d="M 531.31983,377.60727 V 336.73624"
           clip-path="url(#pb7febf5ede)"
           style="fill:none;stroke:#000000;stroke-width:2.5"
           id="path332" />
        <path
           d="M 572.82397,292.43101 V 240.15273"
           clip-path="url(#pb7febf5ede)"
           style="fill:none;stroke:#000000;stroke-width:2.5"
           id="path333" />
      </g>
      <g
         id="line2d_59">
        <g
           clip-path="url(#pb7febf5ede)"
           id="g338">
          <use
             xlink:href="#m176cfbef69"
             x="365.30331"
             y="313.33719"
             style="stroke:#000000"
             id="use333" />
          <use
             xlink:href="#m176cfbef69"
             x="406.80743"
             y="369.21863"
             style="stroke:#000000"
             id="use334" />
          <use
             xlink:href="#m176cfbef69"
             x="448.31158"
             y="369.87708"
             style="stroke:#000000"
             id="use335" />
          <use
             xlink:href="#m176cfbef69"
             x="489.8157"
             y="375.76126"
             style="stroke:#000000"
             id="use336" />
          <use
             xlink:href="#m176cfbef69"
             x="531.31982"
             y="377.60727"
             style="stroke:#000000"
             id="use337" />
          <use
             xlink:href="#m176cfbef69"
             x="572.82397"
             y="292.431"
             style="stroke:#000000"
             id="use338" />
        </g>
      </g>
      <g
         id="line2d_60">
        <g
           clip-path="url(#pb7febf5ede)"
           id="g344">
          <use
             xlink:href="#m176cfbef69"
             x="365.30331"
             y="268.65295"
             style="stroke:#000000"
             id="use339" />
          <use
             xlink:href="#m176cfbef69"
             x="406.80743"
             y="359.36215"
             style="stroke:#000000"
             id="use340" />
          <use
             xlink:href="#m176cfbef69"
             x="448.31158"
             y="349.33975"
             style="stroke:#000000"
             id="use341" />
          <use
             xlink:href="#m176cfbef69"
             x="489.8157"
             y="358.40329"
             style="stroke:#000000"
             id="use342" />
          <use
             xlink:href="#m176cfbef69"
             x="531.31982"
             y="336.73624"
             style="stroke:#000000"
             id="use343" />
          <use
             xlink:href="#m176cfbef69"
             x="572.82397"
             y="240.15273"
             style="stroke:#000000"
             id="use344" />
        </g>
      </g>
      <g
         id="line2d_61">
        <g
           clip-path="url(#pb7febf5ede)"
           id="g350">
          <use
             xlink:href="#mc77a1e649d"
             x="365.30331"
             y="288.30203"
             style="stroke:#000000"
             id="use345" />
          <use
             xlink:href="#mc77a1e649d"
             x="406.80743"
             y="363.55344"
             style="stroke:#000000"
             id="use346" />
          <use
             xlink:href="#mc77a1e649d"
             x="448.31158"
             y="358.6174"
             style="stroke:#000000"
             id="use347" />
          <use
             xlink:href="#mc77a1e649d"
             x="489.8157"
             y="365.06277"
             style="stroke:#000000"
             id="use348" />
          <use
             xlink:href="#mc77a1e649d"
             x="531.31982"
             y="350.71481"
             style="stroke:#000000"
             id="use349" />
          <use
             xlink:href="#mc77a1e649d"
             x="572.82397"
             y="262.3457"
             style="stroke:#000000"
             id="use350" />
        </g>
      </g>
      <g
         id="patch_18">
        <path
           d="M 354.92727,384.48 V 233.28"
           style="fill:none;stroke:#000000;stroke-width:0.8;stroke-linecap:square;stroke-linejoin:miter"
           id="path350" />
      </g>
      <g
         id="patch_19">
        <path
           d="M 583.2,384.48 V 233.28"
           style="fill:none;stroke:#000000;stroke-width:0.8;stroke-linecap:square;stroke-linejoin:miter"
           id="path351" />
      </g>
      <g
         id="patch_20">
        <path
           d="M 354.92727,384.48 H 583.2"
           style="fill:none;stroke:#000000;stroke-width:0.8;stroke-linecap:square;stroke-linejoin:miter"
           id="path352" />
      </g>
      <g
         id="patch_21">
        <path
           d="M 354.92727,233.28 H 583.2"
           style="fill:none;stroke:#000000;stroke-width:0.8;stroke-linecap:square;stroke-linejoin:miter"
           id="path353" />
      </g>
      <g
         id="text_45">
        <!-- approx. circ std of PI direction estimates -->
        <g
           transform="matrix(0.12,0,0,-0.12,348.18051,227.28)"
           id="g394">
          <defs
             id="defs353">
            <path
               id="DejaVuSans-70"
               d="M 1159,525 V -1331 H 581 v 4831 h 578 v -531 q 182,312 458,463 277,152 661,152 638,0 1036,-506 399,-506 399,-1331 0,-825 -399,-1332 -398,-506 -1036,-506 -384,0 -661,152 -276,152 -458,464 z m 1957,1222 q 0,634 -261,995 -261,361 -717,361 -457,0 -718,-361 -261,-361 -261,-995 0,-634 261,-995 261,-361 718,-361 456,0 717,361 261,361 261,995 z"
               transform="scale(0.015625)" />
            <path
               id="DejaVuSans-78"
               d="M 3513,3500 2247,1797 3578,0 H 2900 L 1881,1375 863,0 H 184 L 1544,1831 300,3500 h 678 l 928,-1247 928,1247 z"
               transform="scale(0.015625)" />
          </defs>
          <use
             xlink:href="#DejaVuSans-61"
             id="use353" />
          <use
             xlink:href="#DejaVuSans-70"
             x="61.279297"
             id="use354" />
          <use
             xlink:href="#DejaVuSans-70"
             x="124.75586"
             id="use355" />
          <use
             xlink:href="#DejaVuSans-72"
             x="188.23242"
             id="use356" />
          <use
             xlink:href="#DejaVuSans-6f"
             x="227.0957"
             id="use357" />
          <use
             xlink:href="#DejaVuSans-78"
             x="285.15234"
             id="use358" />
          <use
             xlink:href="#DejaVuSans-2e"
             x="344.33203"
             id="use359" />
          <use
             xlink:href="#DejaVuSans-20"
             x="376.11914"
             id="use360" />
          <use
             xlink:href="#DejaVuSans-63"
             x="407.90625"
             id="use361" />
          <use
             xlink:href="#DejaVuSans-69"
             x="462.88672"
             id="use362" />
          <use
             xlink:href="#DejaVuSans-72"
             x="490.66992"
             id="use363" />
          <use
             xlink:href="#DejaVuSans-63"
             x="529.5332"
             id="use364" />
          <use
             xlink:href="#DejaVuSans-20"
             x="584.51367"
             id="use365" />
          <use
             xlink:href="#DejaVuSans-73"
             x="616.30078"
             id="use366" />
          <use
             xlink:href="#DejaVuSans-74"
             x="668.40039"
             id="use367" />
          <use
             xlink:href="#DejaVuSans-64"
             x="707.60938"
             id="use368" />
          <use
             xlink:href="#DejaVuSans-20"
             x="771.08594"
             id="use369" />
          <use
             xlink:href="#DejaVuSans-6f"
             x="802.87305"
             id="use370" />
          <use
             xlink:href="#DejaVuSans-66"
             x="864.05469"
             id="use371" />
          <use
             xlink:href="#DejaVuSans-20"
             x="899.25977"
             id="use372" />
          <use
             xlink:href="#DejaVuSans-50"
             x="931.04688"
             id="use373" />
          <use
             xlink:href="#DejaVuSans-49"
             x="991.34961"
             id="use374" />
          <use
             xlink:href="#DejaVuSans-20"
             x="1020.8418"
             id="use375" />
          <use
             xlink:href="#DejaVuSans-64"
             x="1052.6289"
             id="use376" />
          <use
             xlink:href="#DejaVuSans-69"
             x="1116.1055"
             id="use377" />
          <use
             xlink:href="#DejaVuSans-72"
             x="1143.8887"
             id="use378" />
          <use
             xlink:href="#DejaVuSans-65"
             x="1182.752"
             id="use379" />
          <use
             xlink:href="#DejaVuSans-63"
             x="1244.2754"
             id="use380" />
          <use
             xlink:href="#DejaVuSans-74"
             x="1299.2559"
             id="use381" />
          <use
             xlink:href="#DejaVuSans-69"
             x="1338.4648"
             id="use382" />
          <use
             xlink:href="#DejaVuSans-6f"
             x="1366.248"
             id="use383" />
          <use
             xlink:href="#DejaVuSans-6e"
             x="1427.4297"
             id="use384" />
          <use
             xlink:href="#DejaVuSans-20"
             x="1490.8086"
             id="use385" />
          <use
             xlink:href="#DejaVuSans-65"
             x="1522.5957"
             id="use386" />
          <use
             xlink:href="#DejaVuSans-73"
             x="1584.1191"
             id="use387" />
          <use
             xlink:href="#DejaVuSans-74"
             x="1636.2188"
             id="use388" />
          <use
             xlink:href="#DejaVuSans-69"
             x="1675.4277"
             id="use389" />
          <use
             xlink:href="#DejaVuSans-6d"
             x="1703.2109"
             id="use390" />
          <use
             xlink:href="#DejaVuSans-61"
             x="1800.623"
             id="use391" />
          <use
             xlink:href="#DejaVuSans-74"
             x="1861.9023"
             id="use392" />
          <use
             xlink:href="#DejaVuSans-65"
             x="1901.1113"
             id="use393" />
          <use
             xlink:href="#DejaVuSans-73"
             x="1962.6348"
             id="use394" />
        </g>
      </g>
    </g>
  </g>
  <defs
     id="defs397">
    <clipPath
       id="p04fb4f05d8">
      <rect
         x="81"
         y="51.84"
         width="228.27272"
         height="151.2"
         id="rect394" />
    </clipPath>
    <clipPath
       id="p5756027a2c">
      <rect
         x="354.92728"
         y="51.84"
         width="228.27272"
         height="151.2"
         id="rect395" />
    </clipPath>
    <clipPath
       id="pf6c8887f0c">
      <rect
         x="81"
         y="233.28"
         width="228.27272"
         height="151.2"
         id="rect396" />
    </clipPath>
    <clipPath
       id="pb7febf5ede">
      <rect
         x="354.92728"
         y="233.28"
         width="228.27272"
         height="151.2"
         id="rect397" />
    </clipPath>
  </defs>
</svg>
