<?xml version="1.0" encoding="utf-8"?>
<!-- Uploaded to: SVG Repo, www.svgrepo.com, Generator: SVG Repo Mixer Tools -->
<svg fill="#99c1f1" height="800px" width="800px" version="1.2" baseProfile="tiny" id="inventory"
	 xmlns="http://www.w3.org/2000/svg" xmlns:xlink="http://www.w3.org/1999/xlink"  viewBox="0 0 256 230"
	 xml:space="preserve">
<path d="M61.2,106h37.4v31.2H61.2V106z M61.2,178.7h37.4v-31.2H61.2V178.7z M61.2,220.1h37.4v-31.2H61.2V220.1z M109.7,178.7H147
	v-31.2h-37.4V178.7z M109.7,220.1H147v-31.2h-37.4V220.1z M158.2,188.9v31.2h37.4v-31.2H158.2z M255,67.2L128.3,7.6L1.7,67.4
	l7.9,16.5l16.1-7.7v144h18.2V75.6h169v144.8h18.2v-144l16.1,7.5L255,67.2z"/>
</svg>